{"text_format":"1","workbook":"xlsx","n_sheets":9,"sheets":["Paràmetres","Taula Farratges","Taula Concentrats","Taula Minerals-aa","CàlculsOVI","I_Necessitats","II_Plantejar Ració","III_Resultat Ració","NR"],"not_rendered":{"charts":0,"images":1,"macros":1,"external_links":2,"defined_names":244,"comments":1,"pivot_tables":0},"unopened":[],"bounds":{"document_bytes":16777216,"sheet_cells":100000,"rows_first":2000,"rows_last":500,"rows_between":2000,"halvings":0,"cell_chars":16384,"cell_head_chars":4096},"cells_cut":0,"cells_raw":0,"read":"whole","date_system":"1900"}

{"sheet":"Paràmetres","index":0,"n_rows":42,"n_cols":3,"rows_kept":42,"cut":false,"hidden":true,"merged":[]}
["COMPONENTS","POSICIÓ","PARÀMETRES DE CÀLCUL"]
[{"$f":"'Taula Farratges'!B$1","v":"MS %"},1,2]
[{"$f":"'Taula Farratges'!C$1","v":"UFL"},{"$f":"1+B2","v":2},1]
[{"$f":"'Taula Farratges'!D$1","v":"UFV"},3,1]
[{"$f":"'Taula Farratges'!E1","v":"MNT_PB"},4,1]
[{"$f":"'Taula Farratges'!F1","v":"PDIA"},5,1]
[{"$f":"'Taula Farratges'!G1","v":"PDI"},6,1]
[{"$f":"'Taula Farratges'!H1","v":"BPR"},7,1]
[{"$f":"'Taula Farratges'!I1","v":"UEL"},8,1]
[{"$f":"'Taula Farratges'!J1","v":"UEB"},9,1]
[{"$f":"'Taula Farratges'!K1","v":"UEM"},10,1]
[{"$f":"'Taula Farratges'!L1","v":"NI ref"},11,1]
[{"$f":"'Taula Farratges'!M1","v":"dMO"},12,1]
[{"$f":"'Taula Farratges'!N1","v":"MOD"},13,1]
[{"$f":"'Taula Farratges'!O1","v":"EE"},14,1]
[{"$f":"'Taula Farratges'!P1","v":"FB"},15,1]
[{"$f":"'Taula Farratges'!Q1","v":"NDF"},16,1]
[{"$f":"'Taula Farratges'!R1","v":"ADF"},17,1]
[{"$f":"'Taula Farratges'!S1","v":"Lignina"},18,1]
[{"$f":"'Taula Farratges'!T1","v":"cendres"},19,1]
[{"$f":"'Taula Farratges'!U1","v":"Ca"},20,1]
[{"$f":"'Taula Farratges'!V1","v":"P"},21,1]
[{"$f":"'Taula Farratges'!W1","v":"Mg"},22,1]
[{"$f":"'Taula Farratges'!X1","v":"Cl"},23,1]
[{"$f":"'Taula Farratges'!Y1","v":"K"},24,1]
[{"$f":"'Taula Farratges'!Z1","v":"Na"},25,1]
[{"$f":"'Taula Farratges'!AA1","v":"S"},26,1]
[{"$f":"'Taula Farratges'!AB1","v":"Co"},27,1]
[{"$f":"'Taula Farratges'!AC1","v":"Cu"},28,1]
[{"$f":"'Taula Farratges'!AD1","v":"Mo"},29,1]
[{"$f":"'Taula Farratges'!AE1","v":"Iode"},30,1]
[{"$f":"'Taula Farratges'!AF1","v":"Fe"},31,1]
[{"$f":"'Taula Farratges'!AG1","v":"Mn"},32,1]
[{"$f":"'Taula Farratges'!AH1","v":"Se"},33,1]
[{"$f":"'Taula Farratges'!AI1","v":"Zn"},34,1]
[{"$f":"'Taula Farratges'!AJ1","v":"Vit A"},35,1]
[{"$f":"'Taula Farratges'!AK1","v":"Vit D"},36,1]
[{"$f":"'Taula Farratges'!AL1","v":"Vit E"},37,1]
[{"$f":"'Taula Farratges'!AM1","v":"AG"},38,1]
[{"$f":"'Taula Farratges'!AN1","v":"DT_N"},39,1]
[{"$f":"'Taula Farratges'!AO1","v":"PF"},40,1]
[{"$f":"'Taula Farratges'!AP1","v":"MOF"},41,1]

{"sheet":"Taula Farratges","index":1,"n_rows":399,"n_cols":47,"rows_kept":399,"cut":false,"hidden":false,"merged":[]}
["Nom","MS %","UFL","UFV","MNT_PB","PDIA","PDI","BPR","UEL","UEB","UEM","NI ref","dMO","MOD","EE","FB","NDF","ADF","Lignina","cendres","Ca","P","Mg","Cl","K","Na","S","Co","Cu","Mo","Iode","Fe","Mn","Se","Zn","Vit A","Vit D","Vit E","AG","DT_N","PF","MOF"]
[]
["VERD Raigràs italià Fulla tardor/hivern",16.600000000000001,0.98752542301286184,0.96862343900373249,190,37.049999999999997,83.729305252851219,53.463585542419978,0.99084854862359462,0.98292252314240713,0.97878066167451971,2.7532019636685905,0.75792000000000004,649.53744000000006,41,238,531.31999999999994,265,"",143,5.7,4.3,null,null,null,null,null,null,null,null,null,null,null,null,null,null,null,null,27.18,0.74,null,{"$f":"N3-F3-(11.4+0.08*(785-8.62*M3*100))-(6+0.599*(9.7+0.75*AM3))","v":566.53268820000017}]
["VERD Raigràs italià Fulla primavera",15.1,1.0950296145848954,1.0989935399169917,191,34.379999999999995,86.075046066243218,50.186490521494974,0.97089801460888281,0.94946304619472999,0.93585147423185366,2.8794962811112788,0.81287000000000009,704.7582900000001,43,178,462.91999999999996,203,"",133,5,4,1.7,null,30,3,null,null,8.1,null,null,null,85.1,null,null,null,null,null,27.285,0.76,null,628.16571895000016]
["VERD Raigràs italià Espiga a 10 cm",15.8,1.0735144194744679,1.0694268732466976,168,26.459999999999994,77.846214502419187,38.229039839970014,0.99103463889108023,0.98323915467272305,0.97919111815687709,2.7520478788609646,0.79571999999999987,705.0079199999999,39,188,474.32,213,"",114,4.5,3.5,1.7,null,30,3,1,null,8.1,null,null,null,85.1,null,null,null,null,null,24.87,0.79,null,636.23762369999986]
["VERD Raigràs italià 1 setmana abans inici espigat",16.399999999999999,0.95689870666779997,0.92793230273629967,112,22.68,69.968842313824013,-6.3288161153500191,1.0571012443135424,1.1012950217887776,1.1379992516516921,2.3679987801502724,0.73790000000000011,663.37210000000005,33,230,522.20000000000005,257,"",101,4.5,3,1.7,null,30,3,1,null,6,null,null,null,80,null,23,80000,30,20,18.989999999999998,0.73,null,597.03612650000002]
["VERD Raigràs italià Inici espigat",16.5,0.93684956106994044,0.90410248855808739,105,21.262500000000003,67.8124260345312,-10.284259428955007,1.0672228531944756,1.1204338752740313,1.1648766033788691,2.3133616315295407,0.72816999999999998,654.62482999999997,32,238,531.31999999999994,265,"",101,4.5,3,1.7,null,30,3,1,null,5,null,null,null,80,null,23,80000,30,20,18.254999999999999,0.73,null,589.36557444999994]
["VERD Raigràs italià Espigat",17.8,0.88184075870700551,0.83779666868101732,88,19.14,63.382896942944008,-20.84952647335,1.0914348948575481,1.1674392075396804,1.2323083649584736,2.1867747686788919,0.69764999999999999,629.97794999999996,30,265,562.09999999999991,293,"",97,4.5,2.5,null,null,null,null,null,null,5,null,null,null,79.599999999999994,null,23.8,80000,30,20,16.47,0.71,null,565.53844649999996]
["VERD Raigràs italià Final espigat",20.399999999999999,0.85440088506958656,0.80318318028193669,80,17.400000000000002,60.325511947001601,-24.47111241719001,1.0967717953522336,1.178039486138192,1.2478010418173731,2.1596238097367575,0.67756000000000005,617.93472000000008,29,284,583.76,313,"",88,4.5,2.5,2.2999999999999998,null,26,1.5,null,null,null,null,null,null,null,null,null,80000,30,20,15.629999999999999,0.71,null,554.22718010000017]
["VERD Raigràs italià Inici floració",24,0.83423945067046223,0.77936346043230376,70,15.225000000000003,57.342206399603207,-30.308134999380005,1.0940999515278929,1.1727215793467025,1.2400153550274735,2.1731834438964874,0.66587000000000007,608.60518000000002,28,293,594.02,322,"",86,4.5,2,null,null,null,null,null,null,null,null,null,null,null,null,null,80000,30,20,14.579999999999998,0.71,null,546.73821020000003]
["VERD Raigràs italià Floració",27.5,0.80685367113340589,0.74696978180239471,60,13.500000000000004,54.399338757356801,-36.105216808369988,1.094509341268644,1.1735349707846756,1.2412044528855173,2.1711014921501279,0.64962999999999993,595.06107999999995,27,307,609.98,337,"",84,4.5,2,null,null,null,null,null,null,null,null,null,null,null,null,null,80000,30,20,13.530000000000001,0.7,null,534.27091229999985]
["VERD Blat de moro Pastós",30.7,1.3365193726351559,1.2976569692461448,77.400000000000006,13.932,58.791469320032924,-25.468920812551421,1.0287076803514683,1.0491399436253608,1.0663920128792077,1.4,0.72046413502109707,687.46687763713089,23.8,208,454.4,243.9,29.5,45.8,2.1,2.2999999999999998,null,null,null,null,1.1000000000000001,null,null,null,null,160,null,null,null,80000,30,20,15.356999999999999,0.76,null,630.30865213818572]
["VERD Civada Inici allargament tiges",14.9,1.064086631371385,1.0648547254219185,120,26.1,78.540947235026891,-10.938980054729537,1.020791556789022,1.0349885040559215,1.047364373208719,2.5729162731279134,0.81001137656427757,712,34,230,522.20000000000005,257,"",121,5,4,null,null,null,null,null,null,null,null,null,null,null,null,null,80000,30,20,19.829999999999998,0.74,null,646.83945702787264]
["VERD Civada Inici espigat",20.6,0.91333093057134518,0.87419395222156171,102,19.89,65.217582265828071,-9.5443472903563524,1.0602585729914722,1.1072336004065757,1.1463038738332441,2.3508433507354152,0.7104972375690608,643,32,302,604.28,331,"",95,4.5,3.5,null,null,null,null,null,null,null,null,null,null,null,null,null,80000,30,20,17.939999999999998,0.74,null,578.03604450276248]
["VERD Civada Floració",17.7,0.82294203192554172,0.76625553664384183,101,18.9375,59.893045182320009,-2.4430393473750023,1.1028559437781433,1.1902323151561571,1.2657544233897913,2.1289918406971013,0.66,594,32,333,639.61999999999989,364,"",100,4,3,null,null,null,null,null,null,null,null,null,null,null,null,null,80000,30,20,17.835000000000001,0.75,null,526.55342624999992]
["VERD Civada Lletós-pastós",31.8,0.73565844803415192,0.65655065623404674,67,12.5625,48.699708160190347,-20.414387750297411,1.1023148702224652,1.189143269883159,1.2641450199268489,2.1317022946299837,0.58943965517241381,547,25,270,567.79999999999995,298,"",72,3.5,2.5,null,null,null,null,null,null,null,null,null,null,null,null,null,80000,30,20,14.265000000000001,0.75,null,482.66640737068963]
["VERD Civada Pastós",38.299999999999997,0.70725373323244844,0.62325068836847375,63,12.285,46.824005315001301,-21.547195804689519,1.0852102252608484,1.1551863027804197,1.2145329392128961,2.2187795429159296,0.56989247311827962,530,25,263,559.81999999999994,291,"",70,3,2.5,null,null,null,null,null,null,null,null,null,null,null,null,null,80000,30,20,13.844999999999999,0.74,null,464.78461869623663]
["VERD Triticale Lletós-pastós",40.51,0.78663088364503642,0.71307400675309951,71.900000000000006,13.481250000000001,51.742682232248974,-20.05848786288902,1.0463959657475401,1.0813694287603073,1.1103630076712525,2.4269367955393735,0.61026200873362446,574.92783842794756,14.8,299,618.40000000000009,350.09999999999997,43.5,57.9,2.9,1.5,2.7,null,25,1.7,3,null,8.6,0.44,null,null,43.9,null,24.1,80000,30,20,14.779499999999999,0.75,null,510.88026617521825]
["VERD Alfals Inici botons florals",19.829999999999998,0.89545070680381955,0.84539321239714582,196.70000000000002,33.930750000000003,74.375738644794566,74.063705242508505,0.97832950718065281,0.96181498260220788,0.95159725192721134,2.8318501700856706,0.67482600000000004,585.20910720000006,22.6,277.39999999999998,442.1,334.4,74.3,132.79999999999998,18.100000000000001,2.5,null,null,null,null,null,null,8.8000000000000007,1.3,null,null,26.7,null,32.299999999999997,120000,20,100,20.313500000000001,0.77,null,502.67821828500007]
["VERD Alfals Vegetatiu 30 cm",14.4,1.0579703950352333,1.0379178369075921,246,40.589999999999989,87.137906090886389,104.94889673299001,0.93430199369735301,0.89049322326002445,0.86227914358067548,3.1251838337790021,0.75198999999999994,654.9832899999999,33,201,489.14,259,"",129,16.5,4.5,null,null,null,null,null,null,8.8000000000000007,1.3,null,null,26.7,null,32.299999999999997,120000,20,100,25.49,0.78,null,568.78883789999986]
["VERD Enclova fulla, 1r any",9.31,1.096854529391851,1.0923154153996353,233.5,47.283749999999998,101.47599610799841,71.579615456252483,0.94406749113829702,0.90593437062390314,0.88129249746648941,3.0577598782129622,0.78986500000000004,687.81444199999999,27,163.5,249.60000000000002,234.1,"",129.19999999999999,null,null,null,null,null,null,null,null,null,null,null,null,null,null,null,null,null,null,24.177499999999998,0.73,null,598.12774052500004,17.003770031249999,2.8672075000000001,3.7227700000000006,18.761599999999998,52.119874424999999]
["VERD Enclova tija fulla, 1r any",9.73,1.0185842087953727,0.99799522826140863,186,37.665000000000006,91.197186063974414,37.935959275039991,0.9882329889956053,0.97848114339409076,0.97303159891575208,2.7694689902423741,0.75451499999999994,664.04865150000001,27,198.5,280.5,269.89999999999998,"",119.9,null,null,null,null,null,null,null,null,null,null,null,null,null,null,null,null,null,null,19.189999999999998,0.73,null,583.78359840000007,18.141730500000001,3.0018699999999998,3.9821200000000001,19.5596,49.194256799999998]
["VERD Enclova gemmes florals, 1r any",11.91,0.97166206695584478,0.94000581377256476,170.3,34.48575000000001,87.26725566060513,27.647897405304509,1.0028017402943088,1.00343500554711,1.0055373170303181,2.6799411559202033,0.72744699999999995,645.68195719999994,27,225.3,323.89999999999998,304.20000000000005,"",112.4,null,null,null,null,null,null,null,null,null,null,null,null,null,null,null,null,null,null,17.541499999999999,0.73,null,567.47013344499987,18.572553611250001,3.0463795,4.0678420000000006,19.823360000000001,48.095989832999997]
["VERD Enclova Botons florals, 1r any",13.77,0.96614085568473185,0.93053932906038217,168.9,34.202249999999999,86.945352644738875,26.685902117595493,1.0007309591481519,0.99985588272857107,1.0008442882212805,2.6925075872814803,0.71795299999999995,645.15256579999993,27,234.7,348.5,330.4,"",101.4,null,null,null,null,null,null,null,null,null,null,null,null,null,null,null,null,null,null,17.394500000000001,0.73,null,566.63557555499983,18.612290651249999,3.0503485000000001,4.0754860000000006,19.846879999999999,47.994887937000001]
["VERD Enclova Inici Floració, 1r any",14.5,0.91962154275921515,0.87567449613502713,167,32.564999999999998,84.172959866843513,28.742562708057012,1.0100190345863349,1.0159941012896332,1.0220874989156672,2.636546129937039,0.69512699999999994,620.33133479999992,23,257.3,366,334.09999999999997,"",107.6,null,null,null,null,null,null,null,null,null,null,null,null,null,null,null,null,null,null,17.195,0.74,null,541.96713896999984,18.666565124999998,3.0557349999999999,4.0858600000000003,19.878799999999998,47.856848699999993]
["VERD Enclova Floració, 1r any",14.92,0.88969990351872497,0.84135662913691533,162.39999999999998,31.667999999999999,82.562520454548491,26.453311789767998,1.0178496754832842,1.0297714065984536,1.0403919149130092,2.5901593438934505,0.68209799999999998,604.61166719999994,23,270.2,390.09999999999997,346.3,"",113.6,null,null,null,null,null,null,null,null,null,null,null,null,null,null,null,null,null,null,16.711999999999996,0.74,null,526.4629792799999,18.799614720000001,3.0687760000000002,4.1109760000000009,19.95608,47.518692671999986]
["VERD Enclova Fructificació, 1r any",18.93,0.77401946656011245,0.70503347951194739,130.80000000000001,25.506,74.013164041958419,6.7995561844399965,1.0561333578065242,1.0994802235470891,1.1354676663546046,2.3732783588410475,0.61816499999999996,549.4868684999999,21,333.5,519.6,450.7,"",111.1,null,null,null,null,null,null,null,null,null,null,null,null,null,null,null,null,null,null,13.393999999999998,0.74,null,474.58197239999993,19.776666179999999,3.1583619999999999,4.2835120000000009,20.48696,45.044367167999994]
["VERD Enclova fulla, 2n any",9.6199999999999992,1.0997475678808939,1.0955739358757886,240.5,48.701250000000002,102.77599704931104,76.873207735451487,0.93857706228682003,0.89722712927592585,0.87054930247213902,3.0954948008925363,0.790269,686.98084170000004,27,163.1,272.8,253.29999999999998,"",130.69999999999999,null,null,null,null,null,null,null,null,null,null,null,null,null,null,null,null,null,null,24.912499999999998,0.73,null,595.57430131500007,16.857100781250001,2.8473625,3.6845500000000007,18.643999999999998,52.500545624999994]
["VERD Enclova tija fulla, 2n any",10.029999999999999,1.027185590826025,1.0072223154339977,206.5,41.816250000000004,95.042085967479366,53.379631300813486,0.97340769944599659,0.95361978058004249,0.9411371114222743,2.8633243838941782,0.75512100000000004,662.46765330000005,27,197.89999999999998,311.2,290.39999999999998,"",122.69999999999999,null,null,null,null,null,null,null,null,null,null,null,null,null,null,null,null,null,null,21.342499999999998,0.73,null,577.12612933500009,17.62009903125,2.9437525,3.8701900000000009,19.215199999999999,50.530119825]
["VERD Enclova gemmes florals,2n any",12.06,0.94147987825051005,0.90301862075432326,177.39999999999998,35.923499999999997,87.760272637741451,34.307042753528975,1.0059539503059134,1.0089040219475649,1.012728492916573,2.6609114472156188,0.70946900000000002,628.16385259999993,27,243.1,360.20000000000005,330.5,"",114.60000000000001,null,null,null,null,null,null,null,null,null,null,null,null,null,null,null,null,null,null,18.286999999999995,0.73,null,546.93960009,18.374356845000001,3.0262510000000002,4.0290760000000008,19.704080000000001,48.600736571999995]
["VERD Enclova Botons Florals, 2n any",12.51,0.89511695047393725,0.84831034371938674,168.9,34.202249999999999,85.027463789994556,29.682603453133499,1.0212578557591314,1.0358175124197606,1.0484744022230137,2.5701923041798236,0.68644100000000008,605.6468943000001,27,265.89999999999998,382.29999999999995,352.40000000000003,"",117.69999999999999,null,null,null,null,null,null,null,null,null,null,null,null,null,null,null,null,null,null,17.394500000000001,0.73,null,524.95683653499998,18.612290651249999,3.0503485000000001,4.0754860000000006,19.846879999999999,47.994887937000001]
["VERD Enclova Inici Floració, 2n any",15.37,0.86881967024630535,0.81422239885418368,151.5,29.5425,80.223350325455058,18.721171366476486,1.0317230795400663,1.0545743042255284,1.0737438177302745,2.5097055696390158,0.66603899999999994,598.43604149999999,23,286.10000000000002,406,371.5,"",101.5,null,null,null,null,null,null,null,null,null,null,null,null,null,null,null,null,null,null,15.567499999999999,0.74,null,521.819591565,19.12419778125,3.0996774999999999,4.1704900000000009,20.139199999999999,46.695057824999992]
["VERD Enclova Floració, 2n any",17.12,0.83214342113550244,0.77228576567026164,141.1,27.514499999999998,77.408014276619213,12.25538394278249,1.0404074604954003,1.0703623520467973,1.0952454344255966,2.4604355836793905,0.64896999999999994,579.98448899999994,23,303,452.59999999999997,406.5,"",106.30000000000001,null,null,null,null,null,null,null,null,null,null,null,null,null,null,null,null,null,null,14.475499999999997,0.74,null,504.70954182499997,19.446103001250002,3.1291614999999999,4.2272740000000004,20.31392,45.879897296999992]
["VERD Enclova Fructificació, 2n any",20.03,0.77143119127727278,0.69909135051730531,135.39999999999998,26.402999999999995,74.793560372722553,10.385749417620975,1.0522008612083678,1.0921340283508449,1.1252497728173221,2.3948290458003165,0.60968100000000003,548.65193190000002,21,341.9,491.1,452.9,"",100.1,null,null,null,null,null,null,null,null,null,null,null,null,null,null,null,null,null,null,13.876999999999995,0.74,null,472.04799141000001,19.627590644999998,3.145321,4.2583960000000012,20.409680000000002,45.420985451999996]
["VERD Enclova Botons",9.1,0.98714581306540561,0.96685370267084725,199,40.297499999999999,86.213032515440005,59.326980444624994,0.98284221180709641,0.96937985564538043,0.96129936913126734,2.8032691232892639,0.753,637.79100000000005,27,200,488,230,"",153,11,3,null,null,null,null,null,null,null,null,null,null,null,null,null,120000,20,100,20.555,0.73,null,554.17574625000009]
["VERD Enclova Floració",13.5,0.85663511928844371,0.80590339975096426,155,30.225000000000001,70.915031325385598,36.921826054085003,1.0336253408704008,1.0580151174918615,1.0784116566464967,2.4988424625369929,0.67320999999999998,586.36590999999999,23,279,578.05999999999995,305.05,"",129,12,3,null,null,null,null,null,null,null,null,null,null,null,null,null,120000,20,100,15.934999999999999,0.74,null,509.39637284999998]
["VERD Enclova Final floració",15.3,0.8276145296713725,0.76722137641537558,152,29.64,68.692100739392004,37.261092594700017,1.0414164228237595,1.0722099432557681,1.0977756576883742,2.4547646150194544,0.64694999999999991,574.49159999999995,21,305,607.70000000000005,329.75,"",112,9,5,null,null,null,null,null,null,null,null,null,null,null,null,null,120000,20,100,15.619999999999997,0.74,null,496.43768699999998]
["ENSITJAT prefenificat Raigràs italià 1 setmana abans inici espigat",33.5,0.91540389584190662,0.87232923811261709,118.5,10.665000000000001,48.653723552902093,27.167619448590475,1.1057384150319181,1.1750869048508286,1.5518689283723059,1.7364745117679363,0.71522300000000005,635.18954630000007,41.8,280.89999999999998,529.4,338.29999999999995,38.4,111.89999999999999,4.5999999999999996,2.6,null,null,null,null,null,null,null,null,null,null,null,null,null,8000,200,5,18.605499999999999,0.85,80,{"$f":"N38-F38-(11.4+0.08*(785-8.62*M38*100))-(6+0.599*(9.7+0.75*AM38))-AO38","v":499.47750350500007}]
["ENSITJAT prefenificat Raigràs italià Inici espigat",28,0.9097615866544948,0.86376459305372488,170.79999999999998,20.495999999999992,60.643688209473268,59.709237172697996,1.0514195364989558,1.0749502815127321,1.4387849987856081,1.8729558912538233,0.70604299999999998,617.43460349999998,38.700000000000003,286.90000000000003,530.79999999999995,350.79999999999995,39,125.5,5.6,3.5,null,null,null,null,null,null,null,null,null,null,null,null,null,8000,200,5,22.946400000000001,0.85,80,469.30835858]
["ENSITJAT prefenificat Raigràs italià Final espigat",29,0.85574567414180602,0.80201622303037556,124.5,15.686999999999998,54.545559104799693,23.438501398750493,1.1033875767177896,1.1720748156230081,1.566289349929106,1.7204872393757273,0.68538800000000011,602.11335800000006,36.5,300.39999999999998,565.6,373.7,46.5,121.5,5.3,3.4,null,null,null,null,null,null,null,null,null,null,null,null,null,8000,200,5,19.1035,0.79,80,459.09816710500002]
["ENSITJAT Prat natural pla, gramínies en gran part",48,0.9301076693133391,0.86569319205113415,114.3,15.087599999999998,51.530586601789764,18.011833434703501,1.1317898668132078,1.2295663735641016,1.6383431146859011,1.6448208043647601,0.66871099999999994,599.16505599999994,22.200000000000003,311.3,584.20000000000005,385,null,104,8.6999999999999993,2.6,null,null,null,null,null,null,null,null,null,null,null,null,null,8000,200,5,18.256900000000002,0.78,115,420.97955423500002]
["ENSITJAT Blat de moro Lletós",28.5,0.9421569564891038,0.88957697028723326,78.099999999999994,13.667499999999999,49.998667512565987,-12.392449238384355,1.0806638363566192,1.1912972600163021,1.3455328310010872,1.4,0.69,651.22199999999987,33.299999999999997,232.60000000000002,488.2,278.39999999999998,30.4,56.2,3.6,2.2999999999999998,null,null,null,null,null,null,null,null,null,null,null,null,null,null,null,null,24,0.75,100,488.34459999999979]
["ENSITJAT Blat de moro Lletós-pastós",28.5,0.97874640109961941,0.93392943082914304,78.099999999999994,13.667499999999999,51.607525824622435,-14.906290350972558,1.0422094841063054,1.1525629360024265,1.2846865364851052,1.4,0.71,670.09799999999996,33.299999999999997,232.60000000000002,488.2,278.39999999999998,30.4,56.2,3.6,2.2999999999999998,null,null,null,null,null,null,null,null,null,null,null,null,null,null,null,null,24,0.75,125,483.59979999999996]
["ENSITJAT Blat de moro Pastós",30,0.99626128521090906,0.95403421579894565,77,13.475,54.028817866378347,-19.815340416216156,1.0132958896376021,1.1164911620910118,1.2785238674835691,1.4,0.71699999999999997,680.21789999999999,34.4,216.5,450.90000000000003,287.5,29.3,51.3,3,2.2000000000000002,null,null,null,null,null,null,null,null,null,null,null,null,null,null,null,null,24,0.75,80,539.39491999999996]
["ENSITJAT Blat de moro Pastós-vidriós",32,0.98314239284985649,0.9382032061594856,75.900000000000006,13.282500000000001,52.116471121566136,-17.953079877447077,1.0041912879324348,1.0985757184935629,1.2844202105596523,1.4,0.71019108280254772,673.68726114649678,32.1,203.70000000000002,432.70000000000005,244.4,22.9,51.4,3,2.2999999999999998,null,null,null,null,null,null,null,null,null,null,null,null,null,null,null,null,24,0.75,100,512.58723821656042]
["ENSITJAT Blat de moro Vidriós",32,0.96401164680448415,0.91546345893534753,76,13.299999999999999,51.899042023992166,-17.511003162487757,1.0206141424357025,1.114790276307644,1.3042568239789341,1.4,0.70080464625132,663.52183907074982,32,202,432.40000000000003,244.4,26.5,53.2,3.1,2.2999999999999998,null,null,null,null,null,null,null,null,null,null,null,null,null,null,null,null,24,0.75,80,521.75702747624086]
["ENSITJAT Civada Lletós-pastós",31,0.66424114835938342,0.56952073627037447,96.6,18.933599999999998,47.975074691200007,9.9746957949999846,1.1549554187208375,1.2826605891057561,1.7912244332565892,1.5044350611183899,0.56000000000000005,508.70400000000012,45,333.40000000000003,600.1,385.3,49.3,91.6,5.4,2.8,null,null,null,null,null,null,5,0.13,null,null,30,null,null,5000,200,5,19,0.72,80,353.84195000000011]
["ENSITJAT Ordi Lletós-pastós",30.5,0.72142021600330664,0.63401319082140295,98.800000000000011,19.364800000000002,51.132219780851621,7.2994065924193627,1.1474959575885495,1.2652874217455174,1.7453927636691655,1.5439395050877607,0.5903225806451613,540.14516129032256,40.700000000000003,278.39999999999998,533.29999999999995,328.5,42.9,85,5.3,2.7,null,null,null,null,null,null,null,null,null,null,null,null,null,5000,200,5,19,0.72,80,386.94295645161293]
["ENSITJAT Sorgo Pastós",24,0.89466117374478127,0.84489885255540476,102.30000000000001,26.495700000000003,67.487942194560006,-13.801378428999978,1.1262973537643675,1.2160280172855182,1.6084066051897921,1.6754350740838606,0.70099999999999996,644.7097,25,293.39999999999998,586.4,346.8,42.400000000000006,80.3,5.6,2.4,null,null,null,null,null,null,null,null,null,null,null,null,null,5000,200,5,19,0.63,80,492.0089099999999]
["ENSITJAT Triticale lletós",28.1,0.71854288407494793,0.63150931772761865,99.800000000000011,19.560800000000004,51.202394224206458,8.2160090246774296,1.1462933363591252,1.2627982133356292,1.7422302525507003,1.5467420771610727,0.5903225806451613,537.6067741935484,46.6,329.3,589.70000000000005,373.5,46.2,89.3,4.9000000000000004,2.9,null,null,null,null,null,null,null,null,null,null,null,null,null,5000,200,5,19,0.72,80,384.20856935483874]
["ENSITJAT prefenificat Alfals Inici botons florals",45,0.98073229696217212,0.93754372825724863,213.6,22.321199999999997,62.683776417288968,95.749474347986009,0.97973765917405842,0.95479769802657022,1.0999907166650131,2.4498214383965466,0.70985600000000004,621.97582720000003,20.8,247.2,407.2,320.09999999999997,64.3,123.80000000000001,12.8,2.6,null,null,null,null,null,null,null,null,null,null,null,null,null,3000,200,5,26.498799999999999,0.83,80,470.69141106000006]
["ENSITJAT prefenificat Alfals abans floració",43,0.94785679034806092,0.90465843911301136,198.2,21.801999999999992,61.325852381925756,82.60398065324101,0.99374219105851747,0.9777668498437726,1.1210232216881295,2.4038581784818929,0.7073060000000001,605.02955239999994,18.700000000000003,249.7,424.6,336.1,65.900000000000006,144.60000000000002,12.8,2.6,null,null,null,null,null,null,null,null,null,null,null,null,null,3000,200,5,25.220600000000001,0.8,80,454.66271960999995]
["ENSITJAT prefenificat Alfals rebrots floració",47,1.0032072973934074,0.9674763745363909,219.7,27.792049999999996,68.858592379226565,90.802527532458456,0.9725684349724405,0.94271832300516278,1.084479733485664,2.484860487951897,0.72617600000000015,627.77915200000018,17.8,231.20000000000002,391.4,298.89999999999998,61.900000000000006,135.5,17.399999999999999,3.5,null,null,null,null,null,null,null,null,null,null,null,null,null,3000,200,5,27.005099999999999,0.79,80,471.92185778500016]
["ENSITJAT Enclova Botons Florals a Floració, Bolles",27.16,0.75460390300459157,0.67286444594327566,140.9,16.273949999999999,57.035050896491214,33.421779849232493,1.0754416064743921,1.1260486535516214,1.2670212051033991,2.1268632512770091,0.60143000000000013,526.25125000000014,27,353.5,537.20000000000005,351.67649999999998,"Falta valor lignina",125,null,null,null,null,null,null,null,null,null,null,null,null,null,null,null,null,null,null,20.464700000000001,0.79,150,306.24784632500013,18.990099999999998,2.96,4.2345999999999995,20.182000000000002,48.061300000000003]
["ENSITJAT Enclova Inici Floració a Fructificació",19.66,0.76699251537638691,0.68587181205808523,135.6,15.661799999999999,56.909349422917131,28.474704026691985,1.0804926889835968,1.1353212919101585,1.2731603311922557,2.1166076052649183,0.60561200000000004,535.72437520000017,27,349.4,589.29999999999995,349.30259999999998,"Falta valor lignina",115.39999999999999,null,null,null,null,null,null,null,null,null,null,null,null,null,null,null,null,null,null,20.024799999999999,0.79,150,316.81913732000021,19.048400000000001,2.96,4.2664,20.288000000000004,47.7592]
["FENC Bromo Final vegetació",85,0.76419285183337515,0.69355439469847935,100,20.3,58.493150019206396,-2.8767969050099929,1.0835094894031958,1.1490542116640832,1.4703700439119152,1.832722892363662,0.62748999999999999,564.74099999999999,34,320,640,333,null,100,3.1,2.9,null,null,null,null,null,null,null,null,null,null,null,null,null,50000,50,5,15.93,0.71,null,{"$f":"N56-F56-(11.4+0.08*(785-8.62*M56*100))-(6+0.599*(9.7+0.75*AM56))","v":494.54585790000004}]
["FENC Dàctil Floració",85,0.6267609342137026,0.53155509065566853,88,17.247999999999998,48.36165599462273,0.54491250840198902,1.134465219318965,1.2492965014143194,1.6338101491345389,1.6493843187047212,0.53715200000000007,491.49408000000005,27,372,684.07999999999993,404,null,85,2.2999999999999998,1.8,null,null,null,null,null,null,null,null,null,null,null,null,null,50000,50,5,14.933999999999999,0.72,null,418.56868242000002]
["FENC Festuca Floració",88.2,0.73943220877777716,0.65928850942806472,116,23.547999999999998,59.757651814873611,11.582419039259992,1.0793541165782508,1.140751809057504,1.4579976536735357,1.8482751552675172,0.60047250000000008,550.63328250000006,27,331,637.33999999999992,354.45,null,83,null,null,null,null,null,null,null,null,null,null,null,null,null,null,null,50000,50,5,17.257999999999999,0.71,null,474.73040960000003]
["FENC Raigràs italià Espigat",85,0.75513884519311159,0.68241655802433343,79,13.824999999999999,52.185630943845752,-14.88848584975899,1.1062655311186032,1.1934031028108834,1.5408190326700311,1.7489275395653956,0.622116,566.12555999999995,26,307,609.98,337,null,90,4,2.2999999999999998,2,null,20,2,null,null,4.9000000000000004,null,null,null,110,null,26.5,50000,50,5,14.186999999999999,0.75,null,502.81786960999989]
["FENC Raigràs italià Floració",85,0.6767027482560638,0.59071631898229005,52,10.92,45.712396424961298,-32.163119414002011,1.1556101088638542,1.2944117226547334,1.7072960015291541,1.5783911151373442,0.57474800000000004,528.76816000000008,24,344,652.16,374,null,80,4,1.8,null,null,null,null,null,null,null,null,null,null,null,null,null,50000,50,5,11.946,0.7,null,466.10574158000014]
["FENC Raigràs italià rebrots d'espigat amb fulles",85,0.88455752307932112,0.83555018199236453,107,23.219000000000005,65.956156128094094,-7.1468064501470074,1.0503135369712728,1.0876843119708051,1.3736638097389902,1.9617469868665793,0.69441000000000019,629.13546000000019,29,256,567,291,null,94,4,2.7,2,null,20,2,null,null,null,null,null,null,null,null,null,50000,50,5,16.510999999999999,0.69,null,560.37510685000018]
["FENC Civada Floració",90,0.67480317863899208,0.58227461861367924,140,33.319999999999993,65.228139936057602,28.343531349909998,1.0749145907417021,1.1317419865579073,1.4449610854640151,1.8649504591037236,0.55566000000000004,509.54022000000003,33,320,620,390,60,83,6.3,1,null,null,null,null,null,null,null,null,null,null,null,null,null,50000,50,5,19.25,0.66,null,419.88017109999998]
["FENC Civada Inici espigat",90,0.78652389805863199,0.70575228911118604,175,41.649999999999991,77.978984355311994,44.535961944825004,1.0237566758532983,1.0390632549443961,1.3016259564347528,2.0703189164299771,0.60694999999999999,567.49824999999998,26,290,580,350,40,65,6.3,1,null,null,null,null,null,null,null,null,null,null,null,null,null,50000,50,5,22.155000000000001,0.66,null,471.74008824999999]
["FENC Ordi Espigat",78.5,0.59193017134449111,0.49259343790919707,112,26.655999999999999,55.098112213262077,15.279199666778009,1.1196754302777518,1.2187032952808325,1.5845540343235869,1.7006556932427213,0.51462799999999997,464.70908399999996,12.5,285,584.9,422,null,97,2.95,2.5,1.6,null,14.15,1.75,1.7,7.0000000000000007E-2,24,null,null,101,27,0.16,48,null,null,null,16.925999999999998,0.66,null,379.92752537999996]
["FENC Ordi Inici espigat",83.7,0.78734030434506597,0.72632602372427391,108,25.703999999999997,65.002965002686736,-4.324632816698017,1.0656566417672084,1.1155627702170452,1.4175098191472175,1.9010667886197266,0.65300200000000008,570.72374800000011,12.5,285,584.9,313,null,126,2.95,2.5,1.6,null,14.15,1.75,1.7,7.0000000000000007E-2,24,null,null,101,27,0.16,48,50000,50,5,16.594000000000001,0.66,null,496.58561142000019]
["FENC Ordi Lletós",90,0.70632061718517436,0.62140149005677348,135,32.129999999999995,65.961349921366406,22.038515747865009,1.0693830299255613,1.1216408789031524,1.4286049531676628,1.8863023215395973,0.58099000000000001,526.37693999999999,12.5,285,610,370,null,94,3.6,2.4,1.6,null,14.15,1.75,1.7,7.0000000000000007E-2,24,null,null,101,27,0.16,48,50000,50,5,18.834999999999997,0.66,null,439.84008664999999]
["FENC Ordi Vidriós",76.3,0.74034682336508006,0.66220836375956105,99,23.561999999999998,60.204756763352961,-6.1143074427390012,1.0934509872849412,1.1679797385858239,1.5007721412635913,1.7955962571734776,0.60588600000000004,554.38569000000007,12.5,285,584.9,350,null,85,3.6,2.4,1.8,null,11.8,1.4,1.7,7.0000000000000007E-2,24,null,null,101,27,0.16,48,50000,50,5,15.847,0.66,null,479.47602381000007]
["PALLA blat",88,0.54489449959297132,0.44220463365346863,35,7.8399999999999981,35.751928353225608,-34.012388051915011,1.2158557736596241,1.4281298035897589,1.9403574479922112,1.3888063987960364,0.49196000000000006,452.60320000000007,15,420,738.8,439,null,80,2,1,1.4,null,16.5,2.1,null,null,null,null,null,null,null,null,null,null,null,null,10.535,0.68,null,387.94561285000009]
["PALLA Blat tractada amoniac",88,0.56531695204398313,0.46053859806899722,100,22.399999999999995,49.607914377043201,11.287633785869989,1.1419257322988237,1.2641142850862204,1.6595863549606495,1.6237665678969901,0.49287000000000009,453.44040000000007,15,420,738.8,439,null,80,2,1,null,null,null,null,null,null,null,null,null,null,null,null,null,null,null,null,15.93,0.66,null,371.86186270000007]
["PALLA Blat de moro rostoll ",85,0.65295030331947668,0.56115553193506373,59,14.041999999999998,47.160476103231375,-27.007618911299009,1.1574722224070044,1.2980624106603422,1.7140693223387169,1.572153940685612,0.55452600000000007,514.60012800000004,13,344,670,390,110,72,5.7,1,1.4,null,16.5,2.1,null,null,null,null,null,null,null,null,null,50000,50,5,12.527000000000001,0.66,null,447.16018621000006]
["PALLA Civada ",88,0.53812725183444132,0.4366356893312896,32,7.3919999999999986,35.099752735092487,-36.053363648582007,1.2194997260559368,1.436733452984293,1.9556277145677179,1.3779620832990693,0.49191800000000008,447.64538000000005,15,420,738.8,439,null,90,3.5,1,null,null,null,null,null,null,null,null,null,null,null,null,null,50000,50,5,10.286,0.67,null,383.54475978000005]
["PALLA Ordi ",88,0.54583884995246301,0.44305246126076597,38,8.5119999999999987,36.391435400478727,-31.921617813248002,1.2122335331673182,1.4196285839782588,1.9253238055783992,1.3996507142930033,0.49200200000000005,452.64184000000006,12.5,420,738.8,439,null,80,3.5,1,1.4,null,16.5,2.1,null,null,3.1,null,null,null,17.600000000000001,null,7.3,50000,50,5,10.783999999999999,0.68,null,387.20328592000004]
["PALLA Ordi tractada amoniac",88,0.56531695204398313,0.46053859806899722,100,22.399999999999995,49.607914377043201,11.287633785869989,1.1419257322988237,1.2641142850862204,1.6595863549606495,1.6237665678969901,0.49287000000000009,453.44040000000007,12.5,420,738.8,439,null,80,3.5,1,null,null,null,null,null,null,null,null,null,null,null,null,null,null,null,null,15.93,0.66,null,371.86186270000007]
["FENC Alfals Botons florals",85,0.57123558052070356,0.46444274804760227,171,35.910000000000004,61.686763221321605,68.64380746668499,1.0731847945413775,1.1276103050952651,1.4400957053043448,1.8712512160111086,0.48796,443.06768,26,372,684.07999999999993,436,null,92,14,2.5,null,null,null,null,null,null,7.1,null,null,null,29,null,24.6,45000,400,10,21.823,0.72,null,344.99311884999997]
["FENC Alfals Inici vegetació",85,0.76317000378293631,0.68735630001277959,168.5,35.385000000000005,71.398796663299521,50.848442713594494,1.0272530664094703,1.0452860176409202,1.3108982501333131,2.0556750605541518,0.61256199999999994,548.91680819999999,21.200000000000003,283.39999999999998,483.1,326.70000000000005,69.3,103.9,12.5,2.4,null,null,null,null,null,0.1,4.5999999999999996,0.6,null,null,42.9,0.03,21.3,45000,400,10,21.615500000000001,0.72,null,460.05302034499999]
["FENC Alfals Floració",85,0.53042608012322923,0.41881028536100962,160,33.6,57.356247581535996,63.880863153850001,1.0949864792633808,1.1689784137676618,1.5060870012241476,1.7892597423208703,0.46059999999999995,421.90959999999995,24,395,710.3,460,null,84,14,2.2000000000000002,null,null,null,null,null,null,null,null,null,null,null,null,null,45000,400,10,20.91,0.72,null,324.66845849999993]
["FENC Alfals floració (Catalunya)",89,0.7804774847881284,0.70842363842025324,174.5,36.645000000000003,73.402532623920322,54.006355275124506,1.0179631656165384,1.0291021887835796,1.2863355843314199,2.0949283161778949,0.62396199999999991,555.95014199999991,19.8,271.5,446.59999999999997,316.70000000000005,69.099999999999994,109,18.899999999999999,3,null,null,null,null,null,0.1,4.5999999999999996,0.6,null,null,42.9,0.03,21.3,45000,400,10,22.113499999999998,0.72,null,466.38877164499996]
["FENC Alfals rebrots (Catalunya)",89,0.82205470435761685,0.75613867516714384,179.3,37.653000000000006,76.258578893598411,54.574782978752495,1.006503008750228,1.0094903891680025,1.2566714172197362,2.144379829760966,0.64471000000000001,577.98251500000003,19.8,259.60000000000002,442.1,298.5,65.8,103.5,11,2.2000000000000002,null,null,null,null,null,0.1,4.5999999999999996,0.6,null,null,42.9,0.03,21.3,45000,400,10,22.511900000000001,0.72,null,488.66494552500001]
["FENC Alfals rebrots de floració",85,0.55599142142101565,0.44631833609527294,174,36.540000000000006,61.352732546995213,72.310105395319994,1.0754412677633514,1.1317071487843955,1.4468110586675325,1.8625658295734471,0.47542000000000001,434.53388000000001,24,382,695.48,447,null,86,12.2,2.2000000000000002,null,null,null,null,null,0.1,4.5999999999999996,0.6,null,null,42.9,0.03,21.3,45000,400,10,22.071999999999999,0.72,null,334.85269719999997]
["FENC Alfals Sense especificar (primavera) IAMZ",90,0.8022678479128047,0.73596215149667599,171,35.910000000000004,73.93543875043521,49.505251952444979,1.0148357975382867,1.0238365530945255,1.2781381256264579,2.1083643353509456,0.64072000000000007,567.0372000000001,25,300,394,302,null,115,14.6,4.5,null,null,null,null,null,null,null,null,null,null,null,null,null,45000,400,10,21.823,0.72,null,479.49696845000017]
["FENC Alfals Sense especificar (estiu) IAMZ",90,0.80275298588032373,0.73261232695119138,187,39.270000000000003,76.69014371951809,61.971025438252966,1.0047311728786472,1.0063219773648062,1.2521919703921178,2.1520508863183911,0.63182800000000006,566.11788799999999,25,284,583.76,309.8,null,104,19.399999999999999,2.9,null,null,null,null,null,null,null,null,null,null,null,null,null,45000,400,10,23.151,0.72,null,474.00786013000004]
["FENC Enclova Final floració",87.6,0.79742769224428822,0.72717662515667236,143,30.030000000000005,68.40600963093442,28.797484951664988,1.0419028468164517,1.0716763542824852,1.3505150540292457,1.9953726777671104,0.63273999999999997,575.16066000000001,13.5,287,414,309,null,91,1.2,0.3,null,null,null,null,null,null,null,null,null,null,null,null,null,45000,400,10,19.498999999999999,0.72,null,493.99418465000002]
["FENC Trèvol blanc Vegetatiu",90,0.79818726684692809,0.7236613653982934,220,56.099999999999994,91.797130433951992,75.223233696950018,0.98223680859474038,0.96830897985285391,1.1963126772137844,2.2525723341821324,0.62019999999999997,557.5598,27,212,360,320,70,101,13.5,3.1,4.3,3.2,16.2,1.9,1.7,0.16,11,null,0.25,184,73,null,17,45000,400,10,25.89,0.66,null,446.58740949999998]
["FENC Trèvol violeta Final floració",89,0.71129301654850108,0.62330572153739683,160,40.799999999999997,73.887318682976002,39.701064557850003,1.0490595705479822,1.0839781862511857,1.3705459085367102,1.9662098313804495,0.5746,525.75900000000001,28,288,460,360,80,85,15.3,2.5,null,null,null,null,null,null,null,null,null,null,null,null,null,45000,400,10,20.91,0.66,null,429.17929850000002]
["FENC Veça Inici botons",91.4,0.97212142615502195,0.93222753604964459,196,49.980000000000004,94.638496257844494,45.381099597118009,0.96804899794938748,0.94589141470041038,1.1621093304524754,2.3188703240803497,0.718468,653.80588,25,204,492.55999999999995,233.79999999999998,null,90,17.600000000000001,2.2000000000000002,null,null,null,null,null,null,null,null,null,null,null,null,null,45000,400,10,23.898,0.66,null,556.62495677999993]
["FENC Veça Botons",92,0.7602900997960611,0.68406922475749654,217,55.334999999999994,89.496195466959989,75.643132082874999,0.98849058053204519,0.97861550011578569,1.2116285321394968,2.2240982019172817,0.60880000000000001,533.91759999999999,25,244,470,330,null,123,17.600000000000001,2.2000000000000002,null,null,null,null,null,null,null,null,null,null,null,null,null,45000,400,10,25.641000000000002,0.66,null,423.03592875000004]
["FENC Veça Inici floració",90,0.75185723717774389,0.67347333051166314,225,57.375,90.8595417645856,81.980403492835009,0.98448565926461906,0.97187134256680685,1.2018330935222286,2.2422255255307535,0.60195999999999994,527.91891999999996,25,244,538.16,336,null,123,17.600000000000001,2.2000000000000002,null,null,null,null,null,null,null,null,null,null,null,null,null,45000,400,10,26.305,0.66,null,414.22726034999994]
["FENC Veça Final floració",85,0.91395057593913331,0.86255647770957011,197,50.234999999999992,92.184528135347847,50.273862288518998,0.97734056562373328,0.96084554796604882,1.1843136089723143,2.2753946415101325,0.68814400000000009,623.45846400000005,25,232,524.48,260.39999999999998,null,94,14.7,3.1,null,null,null,null,null,null,null,null,null,null,null,null,null,45000,400,10,23.980999999999998,0.66,null,523.89410999000006]
["FENC Veça Fructificació",91,0.83209635677761806,0.76577420261610507,186,47.429999999999993,85.844816081036811,48.536849873379992,1.0008060205745131,0.99975635411462671,1.2422134746837556,2.1693379557077908,0.64527999999999996,583.33312000000001,20,236,453,298,null,96,15.1,1.7,null,null,null,null,null,null,null,null,null,null,null,null,null,45000,400,10,23.068000000000001,0.66,null,484.02802980000001]
["FENC Veça Pastós",90.2,0.94923426925277721,0.90897107697315827,188,47.94,91.999449584953595,41.03711002351001,0.97502789206574958,0.95729300272020357,1.1786990783138984,2.2862330931639918,0.71596000000000004,640.78420000000006,20,278,576.91999999999996,236,null,105,16,3,null,null,null,null,null,null,null,null,null,null,null,null,null,45000,400,10,23.234000000000002,0.66,null,545.7686271]
["FENC Veça (>50%)-Civada tall precoç INRA",84,0.73,0.65,158,42,93,1,1.0204081632653061,1.0245017686135793,0.86,3.13,0.68,881,null,333,674,378,null,119,13,2,null,null,null,null,null,null,null,null,null,null,null,null,null,null,null,null,null,0.6,null,799.88250000000005]
["FENC Veça (20-50%)-Civada tall precoç INRA",79,0.72,0.65,104,24,75,-28,1.0650923587231063,1.1087768440709616,1.21,2.23,0.68,897,null,280,595,323,null,103,null,null,null,null,null,null,null,null,null,null,null,null,null,null,null,null,null,null,null,0.63,null,833.88250000000005]
["FENC Veça (< 20%)-Civada tall precoç INRA",81,0.74,0.66,129,29,81,-11,1.0318700433385417,1.0534720220009313,1.21,2.23,0.7,870,null,270,575,308,null,130,null,null,null,null,null,null,null,null,null,null,null,null,null,null,null,null,null,null,null,0.64,null,803.26170000000002]
["FENC Veça (>50%)-Civada tall tardà INRA",81,0.65,0.55000000000000004,123,31,81,-17,1.0788068396353634,1.1283330364035868,0.89,3.02,0.61,929,null,268,584,309,null,71,null,null,null,null,null,null,null,null,null,null,null,null,null,null,null,null,null,null,null,0.6,null,854.05529999999999]
["FENC Veça (20-50%)-Civada tall tardà INRA",82,0.64,0.55000000000000004,99,23,72,-29,1.0901813594561551,1.1553663727576771,1.39,1.94,0.63,901,null,333,675,385,null,99,null,null,null,null,null,null,null,null,null,null,null,null,null,null,null,null,null,null,null,0.63,null,835.43449999999996]
["FENC Veça (< 20%)-Civada tall tardà INRA",86,0.61,0.52,74,17,66,-45,1.1245341215782034,1.228533002276019,1.25,2.16,0.6,916,null,324,664,377,null,84,null,null,null,null,null,null,null,null,null,null,null,null,null,null,null,null,null,null,null,0.61,null,854.36570000000006]
[]
[]
[]
[]
[]
[]
[]
[]
[]
[]
[]
[]
[]
[]
[]
[]
[]
[]
[]
[]
[]
[]
[]
[]
[]
[]
[]
[]
[]
[]
[]
[]
[]
[]
[]
[]
[]
[]
[]
[]
[]
[]
[]
[]
[]
[]
[]
[]
[]
[]
[]
[]
[]
[]
[]
[]
[]
[]
[]
[]
[]
[]
[]
[]
[]
[]
[]
[]
[]
[]
[]
[]
[]
[]
[]
[]
[]
[]
[]
[]
[]
[]
[]
[]
[]
[]
[]
[]
[]
[]
[]
[]
[]
[]
[]
[]
[]
[]
[]
[]
[]
[]
[]
[]
[]
[]
[]
[]
[]
[]
[]
[]
[]
[]
[null,null,null,null,null,null,null,null,null,null,null,null,null,null,null,null,null,null,null,null,null,null,null,null,null,null,"","","","","","","","","","","","",""]
["","","","","","","","",null,null,null,null,null,"",null,"","","","","","","","","","",""]
[null,null,null,null,null,null,null,null,null,null,null,null,null,null,null,null,null,null,null,null,null,null,null,null,null,null,"","","","","","","","","","","","",""]
["","","","","","","","",null,null,null,null,null,"",null,"","","","","","","","","","",""]
[null,null,null,null,null,null,null,null,null,null,null,null,null,null,null,null,null,null,null,null,null,null,null,null,null,null,"","","","","","","","","","","","",""]
["","","","","","","","",null,null,null,null,null,"",null,"","","","","","","","","","",""]
[]
[]
[]
[]
[null,null,null,null,null,null,null,null,null,null,null,null,null,null,null,null,null,null,null,null,null,null,null,null,null,null,"","","","","","","","","","","","",""]
["","","","","","","","",null,null,null,null,null,"",null,"","","","","","","","","","",""]
[null,null,null,null,null,null,null,null,null,null,null,null,null,null,null,null,null,null,null,null,null,null,null,null,null,null,"","","","","","","","","","","","",""]
["","","","","","","","",null,null,null,null,null,"",null,"","","","","","","","","","","","","","","","","","","","","","","",""]
["","","","","","","","",null,null,null,null,null,"",null,"","","","","","","","","","",""]
[]
[]
[null,null,null,null,null,null,null,null,null,null,null,null,null,null,null,null,null,null,null,null,null,null,null,null,null,null,"","","","","","","","","","","","",""]
["","","","","","","","",null,null,null,null,null,"",null,"","","","","","","","","","",""]
[null,null,null,null,null,null,null,null,null,null,null,null,null,null,null,null,null,null,null,null,null,null,null,null,null,null,"","","","","","","","","","","","",""]
["","","","","","","","",null,null,null,null,null,"",null,"","","","","","","","","","",""]
[null,null,null,null,null,null,null,null,null,null,null,null,null,null,null,null,null,null,null,null,null,null,null,null,null,null,"","","","","","","","","","","","",""]
["","","","","","","","",null,null,null,null,null,"",null,"","","","","","","","","","",""]
[null,null,null,null,null,null,null,null,null,null,null,null,null,null,null,null,null,null,null,null,null,null,null,null,null,null,"","","","","","","","","","","","",""]
["","","","","","","","",null,null,null,null,null,"",null,"","","","","","","","","","",""]
[null,null,null,null,null,null,null,null,null,null,null,null,null,null,null,null,null,null,null,null,null,null,null,null,null,null,"","","","","","","","","","","","",""]
["","","","","","","","",null,null,null,null,null,"",null,"","","","","","","","","","",""]
[]
[]
[]
[null,null,null,null,null,null,null,null,null,null,null,null,null,null,null,null,null,null,null,null,null,null,null,null,null,null,"","","","","","","","","","","","",""]
["","","","","","","","",null,null,null,null,"","","","","","","","","","","","","","","","","","","","","","","","","","",""]
["","","","","","","","",null,null,null,null,null,"",null,"","","","","","","","","","",""]
[null,null,null,null,null,null,null,null,null,null,null,null,null,null,null,null,null,null,null,null,null,null,null,null,null,null,"","","","","","","","","","","","",""]
["","","","","","","","",null,null,null,null,null,"",null,"","","","","","","","","","",""]
[null,null,null,null,null,null,null,null,null,null,null,null,null,null,null,null,null,null,null,null,null,null,null,null,null,null,"","","","","","","","","","","","",""]
["","","","","","","","",null,null,null,null,null,"",null,"","","","","","","","","","","","","","","","","","","","","","","",""]
["","","","","","","","",null,null,null,null,null,"",null,"","","","","","","","","","",""]
[null,null,null,null,null,null,null,null,null,null,null,null,null,null,null,null,null,null,null,null,null,null,null,null,null,null,"","","","","","","","","","","","",""]
["","","","","","","","",null,null,null,null,null,"",null,"","","","","","","","","","",""]
[null,null,null,null,null,null,null,null,null,null,null,null,null,null,null,null,null,null,null,null,null,null,null,null,null,null,"","","","","","","","","","","","",""]
["","","","","","","","",null,null,null,null,null,"",null,"","","","","","","","","","",""]
[null,null,null,null,null,null,null,null,null,null,null,null,null,null,null,null,null,null,null,null,null,null,null,null,null,null,"","","","","","","","","","","","",""]
["","","","","","","","",null,null,null,null,null,"",null,"","","","","","","","","","",""]
[null,null,null,null,null,null,null,null,null,null,null,null,null,null,null,null,null,null,null,null,null,null,null,null,null,null,"","","","","","","","","","","","",""]
["","","","","","","","",null,null,null,null,null,"",null,"","","","","","","","","","",""]
[null,null,null,null,null,null,null,null,null,null,null,null,null,null,null,null,null,null,null,null,null,null,null,null,null,null,"","","","","","","","","","","","",""]
["","","","","","","","",null,null,null,null,null,"",null,"","","","","","","","","","",""]
[null,null,null,null,null,null,null,null,null,null,null,null,null,null,null,null,null,null,null,null,null,null,null,null,null,null,"","","","","","","","","","","","",""]
["","","","","","","","",null,null,null,null,null,"",null,"","","","","","","","","","",""]
[null,null,null,null,null,null,null,null,null,null,null,null,null,null,null,null,null,null,null,null,null,null,null,null,null,null,"","","","","","","","","","","","",""]
["","","","","","","","",null,null,null,null,null,"",null,"","","","","","","","","","",""]
[null,null,null,null,null,null,null,null,null,null,null,null,null,null,null,null,null,null,null,null,null,null,null,null,null,null,"","","","","","","","","","","","",""]
["","","","","","","","",null,null,null,null,null,"",null,"","","","","","","","","","",""]
[null,null,null,null,null,null,null,null,null,null,null,null,null,null,null,null,null,null,null,null,null,null,null,null,null,null,"","","","","","","","","","","","",""]
["","","","","","","","",null,null,null,null,null,"",null,"","","","","","","","","","",""]
[null,null,null,null,null,null,null,null,null,null,null,null,null,null,null,null,null,null,null,null,null,null,null,null,null,null,"","","","","","","","","","","","",""]
["","","","","","","","",null,null,null,null,null,"",null,"","","","","","","","","","",""]
[null,null,null,null,null,null,null,null,null,null,null,null,null,null,null,null,null,null,null,null,null,null,null,null,null,null,"","","","","","","","","","","","",""]
["","","","","","","","",null,null,null,null,null,"",null,"","","","","","","","","","",""]
[null,null,null,null,null,null,null,null,null,null,null,null,null,null,null,null,null,null,null,null,null,null,null,null,null,null,"","","","","","","","","","","","",""]
["","","","","","","","",null,null,null,null,null,"",null,"","","","","","","","","","",""]
[null,null,null,null,null,null,null,null,null,null,null,null,null,null,null,null,null,null,null,null,null,null,null,null,null,null,"","","","","","","","","","","","",""]
["","","","","","","","",null,null,null,null,null,"",null,"","","","","","","","","","",""]
[null,null,null,null,null,null,null,null,null,null,null,null,null,null,null,null,null,null,null,null,null,null,null,null,null,null,"","","","","","","","","","","","",""]
["","","","","","","","",null,null,null,null,null,"",null,"","","","","","","","","","",""]
[null,null,null,null,null,null,null,null,null,null,null,null,null,null,null,null,null,null,null,null,null,null,null,null,null,null,"","","","","","","","","","","","",""]
["","","","","","","","",null,null,null,null,null,"",null,"","","","","","","","","","",""]
[null,null,null,null,null,null,null,null,null,null,null,null,null,null,null,null,null,null,null,null,null,null,null,null,null,null,"","","","","","","","","","","","",""]
["","","","","","","","",null,null,null,null,null,"",null,"","","","","","","","","","",""]
[null,null,null,null,null,null,null,null,null,null,null,null,null,null,null,null,null,null,null,null,null,null,null,null,null,null,"","","","","","","","","","","","",""]
["","","","","","","","",null,null,null,null,null,"",null,"","","","","","","","","","",""]
[null,null,null,null,null,null,null,null,null,null,null,null,null,null,null,null,null,null,null,null,null,null,null,null,null,null,"","","","","","","","","","","","",""]
["","","","","","","","",null,null,null,null,null,"",null,"","","","","","","","","","",""]
[null,null,null,null,null,null,null,null,null,null,null,null,null,null,null,null,null,null,null,null,null,null,null,null,null,null,"","","","","","","","","","","","",""]
["","","","","","","","",null,null,null,null,null,"",null,"","","","","","","","","","",""]
[null,null,null,null,null,null,null,null,null,null,null,null,null,null,null,null,null,null,null,null,null,null,null,null,null,null,"","","","","","","","","","","","",""]
["","","","","","","","",null,null,null,null,null,"",null,"","","","","","","","","","",""]
[null,null,null,null,null,null,null,null,null,null,null,null,null,null,null,null,null,null,null,null,null,null,null,null,null,null,"","","","","","","","","","","","",""]
["","","","","","","","",null,null,null,null,null,"",null,"","","","","","","","","","",""]
[null,null,null,null,null,null,null,null,null,null,null,null,null,null,null,null,null,null,null,null,null,null,null,null,null,null,"","","","","","","","","","","","",""]
["","","","","","","","",null,null,null,null,null,"",null,"","","","","","","","","","",""]
[null,null,null,null,null,null,null,null,null,null,null,null,null,null,null,null,null,null,null,null,null,null,null,null,null,null,"","","","","","","","","","","","",""]
["","","","","","","","",null,null,null,null,null,"",null,"","","","","","","","","","",""]
[null,null,null,null,null,null,null,null,null,null,null,null,null,null,null,null,null,null,null,null,null,null,null,null,null,null,"","","","","","","","","","","","",""]
["","","","","","","","",null,null,null,null,null,"",null,"","","","","","","","","","",""]
[null,null,null,null,null,null,null,null,null,null,null,null,null,null,null,null,null,null,null,null,null,null,null,null,null,null,"","","","","","","","","","","","",""]
["","","","","","","","",null,null,null,null,null,"",null,"","","","","","","","","","",""]
[null,null,null,null,null,null,null,null,null,null,null,null,null,null,null,null,null,null,null,null,null,null,null,null,null,null,"","","","","","","","","","","","",""]
["","","","","","","","",null,null,null,null,null,"",null,"","","","","","","","","","",""]
[null,null,null,null,null,null,null,null,null,null,null,null,null,null,null,null,null,null,null,null,null,null,null,null,null,null,"","","","","","","","","","","","",""]
["","","","","","","","",null,null,null,null,null,"",null,"","","","","","","","","","",""]
[null,null,null,null,null,null,null,null,null,null,null,null,null,null,null,null,null,null,null,null,null,null,null,null,null,null,"","","","","","","","","","","","",""]
["","","","","","","","",null,null,null,null,null,"",null,"","","","","","","","","","",""]
[null,null,null,null,null,null,null,null,null,null,null,null,null,null,null,null,null,null,null,null,null,null,null,null,null,null,"","","","","","","","","","","","",""]
["","","","","","","","",null,null,null,null,null,"",null,"","","","","","","","","","","","","","","","","","","","","","","",""]
["","","","","","","","",null,null,null,null,null,"",null,"","","","","","","","","","",""]
[null,null,null,null,null,null,null,null,null,null,null,null,null,null,null,null,null,null,null,null,null,null,null,null,null,null,"","","","","","","","","","","","",""]
["","","","","","","","",null,null,null,null,null,"",null,"","","","","","","","","","",""]
[null,null,null,null,null,null,null,null,null,null,null,null,null,null,null,null,null,null,null,null,null,null,null,null,null,null,"","","","","","","","","","","","",""]
["","","","","","","","",null,null,null,null,null,"",null,"","","","","","","","","","",""]
[null,null,null,null,null,null,null,null,null,null,null,null,null,null,null,null,null,null,null,null,null,null,null,null,null,null,"","","","","","","","","","","","",""]
["","","","","","","","",null,null,null,null,null,"",null,"","","","","","","","","","",""]
[null,null,null,null,null,null,null,null,null,null,null,null,null,null,null,null,null,null,null,null,null,null,null,null,null,null,"","","","","","","","","","","","",""]
["","","","","","","","",null,null,null,null,null,"",null,"","","","","","","","","","",""]
[null,null,null,null,null,null,null,null,null,null,null,null,null,null,null,null,null,null,null,null,null,null,null,null,null,null,"","","","","","","","","","","","",""]
["","","","","","","","",null,null,null,null,null,"",null,"","","","","","","","","","",""]
[null,null,null,null,null,null,null,null,null,null,null,null,null,null,null,null,null,null,null,null,null,null,null,null,null,null,"","","","","","","","","","","","",""]
["","","","","","","","",null,null,null,null,null,"",null,"","","","","","","","","","",""]
[null,null,null,null,null,null,null,null,null,null,null,null,null,null,null,null,null,null,null,null,null,null,null,null,null,null,"","","","","","","","","","","","",""]
["","","","","","","","",null,null,null,null,null,"",null,"","","","","","","","","","",""]
[null,null,null,null,null,null,null,null,null,null,null,null,null,null,null,null,null,null,null,null,null,null,null,null,null,null,"","","","","","","","","","","","",""]
["","","","","","","","",null,null,null,null,null,"",null,"","","","","","","","","","",""]
[null,null,null,null,null,null,null,null,null,null,null,null,null,null,null,null,null,null,null,null,null,null,null,null,null,null,"","","","","","","","","","","","",""]
["","","","","","","","",null,null,null,null,null,"",null,"","","","","","","","","","",""]
[null,null,null,null,null,null,null,null,null,null,null,null,null,null,null,null,null,null,null,null,null,null,null,null,null,null,"","","","","","","","","","","","",""]
["","","","","","","","",null,null,null,null,null,"",null,"","","","","","","","","","","","","","","","","","","","","","","",""]
["","","","","","","","",null,null,null,null,null,"",null,"","","","","","","","","","",""]
[null,null,null,null,null,null,null,null,null,null,null,null,null,null,null,null,null,null,null,null,null,null,null,null,null,null,"","","","","","","","","","","","",""]
["","","","","","","","",null,null,null,null,null,"",null,"","","","","","","","","","",""]
[null,null,null,null,null,null,null,null,null,null,null,null,null,null,null,null,null,null,null,null,null,null,null,null,null,null,"","","","","","","","","","","","",""]
["","","","","","","","",null,null,null,null,null,"",null,"","","","","","","","","","",""]
[null,null,null,null,null,null,null,null,null,null,null,null,null,null,null,null,null,null,null,null,null,null,null,null,null,null,"","","","","","","","","","","","",""]
["","","","","","","","",null,null,null,null,null,"",null,"","","","","","","","","","",""]
[null,null,null,null,null,null,null,null,null,null,null,null,null,null,null,null,null,null,null,null,null,null,null,null,null,null,"","","","","","","","","","","","",""]
["","","","","","","","",null,null,null,null,null,"",null,"","","","","","","","","","",""]
[null,null,null,null,null,null,null,null,null,null,null,null,null,null,null,null,null,null,null,null,null,null,null,null,null,null,"","","","","","","","","","","","",""]
["","","","","","","","",null,null,null,null,null,"",null,"","","","","","","","","","",""]
[null,null,null,null,null,null,null,null,null,null,null,null,null,null,null,null,null,null,null,null,null,null,null,null,null,null,"","","","","","","","","","","","",""]
["","","","","","","","",null,null,null,null,null,"",null,"","","","","","","","","","",""]
[null,null,null,null,null,null,null,null,null,null,null,null,null,null,null,null,null,null,null,null,null,null,null,null,null,null,"","","","","","","","","","","","",""]
["","","","","","","","",null,null,null,null,null,"",null,"","","","","","","","","","",""]
[null,null,null,null,null,null,null,null,null,null,null,null,null,null,null,null,null,null,null,null,null,null,null,null,null,null,"","","","","","","","","","","","",""]
["","","","","","","","",null,null,null,null,null,"",null,"","","","","","","","","","",""]
[null,null,null,null,null,null,null,null,null,null,null,null,null,null,null,null,null,null,null,null,null,null,null,null,null,null,"","","","","","","","","","","","",""]
["","","","","","","","",null,null,null,null,null,"",null,"","","","","","","","","","",""]
[null,null,null,null,null,null,null,null,null,null,null,null,null,null,null,null,null,null,null,null,null,null,null,null,null,null,"","","","","","","","","","","","",""]
["","","","","","","","",null,null,null,null,null,"",null,"","","","","","","","","","",""]
[null,null,null,null,null,null,null,null,null,null,null,null,null,null,null,null,null,null,null,null,null,null,null,null,null,null,"","","","","","","","","","","","",""]
["","","","","","","","",null,null,null,null,null,"",null,"","","","","","","","","","",""]
[null,null,null,null,null,null,null,null,null,null,null,null,null,null,null,null,null,null,null,null,null,null,null,null,null,null,"","","","","","","","","","","","",""]
["","","","","","","","",null,null,null,null,null,"",null,"","","","","","","","","","",""]
[null,null,null,null,null,null,null,null,null,null,null,null,null,null,null,null,null,null,null,null,null,null,null,null,null,null,"","","","","","","","","","","","",""]
["","","","","","","","",null,null,null,null,null,"",null,"","","","","","","","","","",""]
[null,null,null,null,null,null,null,null,null,null,null,null,null,null,null,null,null,null,null,null,null,null,null,null,null,null,"","","","","","","","","","","","",""]
["","","","","","","","",null,null,null,null,null,"",null,"","","","","","","","","","",""]
[null,null,null,null,null,null,null,null,null,null,null,null,null,null,null,null,null,null,null,null,null,null,null,null,null,null,"","","","","","","","","","","","",""]
["","","","","","","","",null,null,null,null,null,"",null,"","","","","","","","","","",""]
[null,null,null,null,null,null,null,null,null,null,null,null,null,null,null,null,null,null,null,null,null,null,null,null,null,null,"","","","","","","","","","","","",""]
["","","","","","","","",null,null,null,null,null,"",null,"","","","","","","","","","","","","","","","","","","","","","","",""]
["","","","","","","","",null,null,null,null,null,"",null,"","","","","","","","","","",""]
[]
[null,null,null,null,null,null,null,null,null,null,null,null,null,null,null,null,null,null,null,null,null,null,null,null,null,null,"","","","","","","","","","","","",""]
["","","","","","","","",null,null,null,null,null,"",null,"","","","","","","","","","",""]
[null,null,null,null,null,null,null,null,null,null,null,null,null,null,null,null,null,null,null,null,null,null,null,null,null,null,"","","","","","","","","","","","",""]
["","","","","","","","",null,null,null,null,null,"",null,"","","","","","","","","","","","","","","","","","","","","","","",""]
["","","","","","","","",null,null,null,null,null,"",null,"","","","","","","","","","",""]
[null,null,null,null,null,null,null,null,null,null,null,null,null,null,null,null,null,null,null,null,null,null,null,null,null,null,"","","","","","","","","","","","",""]
["","","","","","","","",null,null,null,null,null,"",null,"","","","","","","","","","",""]
[null,null,null,null,null,null,null,null,null,null,null,null,null,null,null,null,null,null,null,null,null,null,null,null,null,null,"","","","","","","","","","","","",""]
["","","","","","","","",null,null,null,null,null,"",null,"","","","","","","","","","",""]
[null,null,null,null,null,null,null,null,null,null,null,null,null,null,null,null,null,null,null,null,null,null,null,null,null,null,"","","","","","","","","","","","",""]
["","","","","","","","",null,null,null,null,null,"",null,"","","","","","","","","","",""]
[null,null,null,null,null,null,null,null,null,null,null,null,null,null,null,null,null,null,null,null,null,null,null,null,null,null,"","","","","","","","","","","","",""]
["","","","","","","","",null,null,null,null,null,"",null,"","","","","","","","","","","","","","","","","","","","","","","",""]
["","","","","","","","",null,null,null,null,null,"",null,"","","","","","","","","","",""]
[]
[null,null,null,null,null,null,null,null,null,null,null,null,null,null,null,null,null,null,null,null,null,null,null,null,null,null,"","","","","","","","","","","","",""]
["","","","","","","","",null,null,null,null,null,"",null,"","","","","","","","","","",""]
[null,null,null,null,null,null,null,null,null,null,null,null,null,null,null,null,null,null,null,null,null,null,null,null,null,null,"","","","","","","","","","","","",""]
["","","","","","","","",null,null,null,null,null,"",null,"","","","","","","","","","",""]
[null,null,null,null,null,null,null,null,null,null,null,null,null,null,null,null,null,null,null,null,null,null,null,null,null,null,"","","","","","","","","","","","",""]
["","","","","","","","",null,null,null,null,null,"",null,"","","","","","","","","","",""]
[null,null,null,null,null,null,null,null,null,null,null,null,null,null,null,null,null,null,null,null,null,null,null,null,null,null,"","","","","","","","","","","","",""]
["","","","","","","","",null,null,null,null,null,"",null,"","","","","","","","","","",""]
[null,null,null,null,null,null,null,null,null,null,null,null,null,null,null,null,null,null,null,null,null,null,null,null,null,null,"","","","","","","","","","","","",""]
["","","","","","","","",null,null,null,null,null,"",null,"","","","","","","","","","",""]
[]
[]
[]
[]
[]
[]
[]
[]
[]
[]
[null,null,null,null,null,null,null,null,null,null,null,null,null,null,null,null,null,null,null,null,null,null,null,null,null,null,"","","","","","","","","","","","",""]
["","","","","","","","",null,null,null,null,null,"",null,"","","","","","","","","","",""]

{"sheet":"Taula Concentrats","index":2,"n_rows":198,"n_cols":42,"rows_kept":198,"cut":false,"hidden":false,"merged":[]}
["Concentrats","MS","UFL","UFV","MNT_PB","PDIA","PDI","BPR","UEL","UEB","UEM","NI ref","dMO","MOD_TDN","EE","FB","NDF","ADF","Lignina","cendres","Ca","P","Mg","Cl","K","Na","S","Co","Cu","Mo","Iode","Fe","Mn","Se","Zn","Vit A","Vit D","Vit E","AG","DT_N","dr","MOF"]
[]
["Ordi gra",87.2,1.0789699893040996,1.0677525561217629,112,27.595082457151996,89.462201893951999,-31.347374120000008,0.2046,null,null,2,0.83732799999999996,816.39479999999992,19,54,215,65,12,25,0.8,3.9,1.3,null,5.55,0.35,null,0.01,4.0999999999999996,0.3,null,90,17.600000000000001,0.02,24.4,1000,null,25,{"$f":"0.75*O3","v":14.25},{"$f":"1-(F3/(E3*AO3))","v":0.73492599485689536},{"$f":"(88.3+0.0371*E3-3.7*(10^-5)*(E3^2)-0.107*S3-0.00313*(100-N3))/100","v":0.92949387723999977},{"$f":"N3-E3*(1-AN3)-O3","v":767.70651142397219}]
["Blat de moro gra",86,1.2447554097468898,1.2699211700375517,89,38.129888218376763,100.70571645287278,-70.144731616400009,0.3291,null,null,2,0.88284600000000013,870.48615600000005,43,26,125,31,60,14,0.5,2.9,1.4,null,3.6,0.33,null,0.02,2.2999999999999998,0.3,null,80,10.8,0.02,21.4,null,null,null,{"$f":"0.85*O4","v":36.549999999999997},0.50925139963862587,0.87300444668280008,783.80953056783778]
["Blat gra",87,1.1915137972087206,1.2050625767281833,157,33.001449423599993,96.505827343600004,5.8944094999999983,0.1714,null,null,2,0.87875000000000003,861.17500000000007,23,29,146,38,12,20,0.5,3.9,null,null,null,null,null,0.02,4.4000000000000004,0.3,null,null,33.700000000000003,0.04,32.5,null,null,12,{"$f":"O5*0.75","v":17.25},0.77712043387736873,0.94311164749999987,803.18290811874692]
["Civada",87.4,1.002754803542979,0.95481461893995845,111,20.397543993710997,75.333047872111024,-14.566724810000022,0.32080000000000003,null,null,2,0.72867000000000004,706.80990000000008,67,135,336,162,27,30,1,4,1.75,null,4.3,0.5,null,0.02,3.5,0.7,null,null,38.4,0.04,25.2,null,null,15,{"$f":"O6*0.9","v":60.300000000000004},0.79800315384488929,0.90972537986999991,617.38825007678281]
["Fajol gra",88,1.0007757853016814,0.96615921016994921,125,34.099887237024994,90.969890410784984,-20.559379958999994,0.21290000000000009,null,null,2,0.74392999999999987,726.8196099999999,28,118,301,158.9,33.4,23,1.1000000000000001,3.7,1.2,0.5,5.0999999999999996,0.6,1.6,0.06,11,null,null,50,38,null,10,null,null,null,{"$f":"O7*0.75","v":21},0.69938671959743504,0.90747520379299995,661.24294994967931]
["Mill gra",88,1.009546490666007,0.97767630563404173,131,35.907645941378647,91.778122786690659,-15.037620070799999,0.21290000000000009,null,null,2,0.75275400000000003,721.13833199999999,42,106,284.5,143.85999999999999,29.700000000000003,42,0.4,3.2,1.7,0.34,4.66,0.45,null,null,null,null,null,null,null,null,null,null,null,null,{"$f":"0.9*O8","v":37.800000000000004},0.69974811478529253,0.91291405979160001,639.80533503687332]
["Segol gra",86.5,1.2078146748003231,1.231534718227727,120,35.283824642879999,99.110415798080027,-34.72904868000002,0.21290000000000009,null,null,2,0.88214000000000015,864.49720000000013,16.200000000000003,26,132,42,14,20,0.7,4,1.35,null,5.25,0.3,null,0.03,4.5,0.2,null,null,55,0.03,30,null,null,17,{"$f":"0.75*O9","v":12.150000000000002},0.68422403581734659,0.93114076235999998,810.40408429808167]
["Sorgo gra",86,1.2563624126057522,1.2850946916475117,114,33.93068941985544,97.130963149263465,-37.710427702200008,0.21290000000000009,null,null,2,0.88468600000000008,869.64633800000001,37,25,107,49,4,17,0.3,3.2,1.75,null,3.6,0.4,null,null,10,null,null,160,14,null,14,14000,null,12,{"$f":"O10*0.9","v":33.300000000000004},0.68346370384827659,0.9402954103793999,796.56120023870358]
["Triticale gra",87.1,1.1917933324586927,1.2103621408310392,130,38.225488002259986,101.29653785185999,-26.948515390000008,0.21290000000000009,null,null,2,0.87145000000000006,852.27809999999999,17,33,148,40,13,22,0.5,4.5999999999999996,null,null,null,null,null,null,null,null,null,null,null,null,null,null,null,null,{"$f":"O11*0.75","v":12.75},0.68538622981633202,0.93461330452999991,794.37830987612313]
["Blat segó blat dur",87.7,1.0176943686522057,0.977907847095282,167,34.631141078796077,88.47767852596408,25.244785238800009,0.30577720000000003,null,null,2,0.73153799999999991,692.03494799999987,58,118,481,148,38,54,1.7,10.4,null,null,null,null,null,null,10,null,null,200,90,null,80,1000,null,21,{"$f":"O12*0.8","v":46.400000000000006},0.77274508423544552,0.91250876387239999,596.08337706731925]
["Blat de moro flocs",89,1.2854594416716449,1.3156335468620108,100,41.498506498559998,103.94646933760002,-59.774941936000019,0.231567,null,null,2,0.88266,868.53744000000006,43,26,90,30,10,16,0.3,2.9,1.4,0.5,3.7,0.3,1.2,0.05,4,null,null,30,5,0.08,14,1000,null,25,{"$f":"O13*0.85","v":36.549999999999997},0.55366202283859689,0.92975522187199999,780.90364228385977]
["Blat de moro bagàs",88.1,1.2034638734603806,1.2055011502513313,151,56.283786721918673,116.77481847795069,-22.647237118800017,0.28759999999999997,null,null,2,0.85009200000000007,833.94025199999999,34,68,272,78,11,19,null,null,1.8,null,3.5,9.5,null,null,null,null,null,null,null,null,null,null,null,null,{"$f":"O14*0.75","v":25.5},0.60422014182361838,0.94178695988759986,740.17749341536637]
["Blat de moro hominyfeed (mescla segó, germèn i midó)",90,1.1533551355658935,1.1579668052179757,114,46.524159785375986,107.37452349097599,-49.998693289999991,0.25357849999999998,null,null,2,0.83747599999999989,816.53909999999985,19,54,215,65,12,25,0.5,5.7,2.6,0.6,6.5,0.9,0.3,0.06,15,null,null,75,16,0.11,3,null,null,null,{"$f":"O15*0.85","v":16.149999999999999},0.56121014448870521,0.93007315382999989,747.51705647171229]
["Blat de moro gluten feed",87.7,1.0563074392437739,1.0298938534891089,216,53.864651595352321,111.00304612616833,49.881258545599977,0.3125,null,null,2,0.82507200000000003,769.79217599999993,45,88,343,100,13,67,3,7.8,3.5,null,10.25,7,null,null,null,null,null,null,null,null,null,3000,null,14,{"$f":"O16*0.9","v":40.5},0.73830819761020405,0.9529277751088,668.26674668380406]
["Blat de moro gluten meal",89.3,1.6477477819813739,1.7039593019383183,661,427.85021155354741,474.69275818906743,117.51852088199998,0.48679999999999995,null,null,2,0.94365200000000005,929.49722000000008,35,21,107,28,6,15,0.2,4,null,null,null,null,null,null,null,null,null,null,null,null,null,14000,null,26,{"$f":"O17*0.8","v":28},0.34360783225527836,0.98611349298600004,460.62199712073908]
["Blat de moro espigots ",90.2,0.52319139706798212,0.41152989548810526,44,14.398539143577599,59.977382422937616,-62.536942624000005,0.46929120000000002,null,null,2,0.45527600000000007,437.0649600000001,5,302,822,408,38,40,1.2,0.7,null,null,null,null,null,null,null,null,null,null,null,null,null,null,null,null,2,0.62321203231751077,0.86849781324800002,415.48628942197058]
["Blat de moro segó",88.3,1.1129736772157073,1.1007866196572278,101,43.238359333239842,96.344289691511847,-50.718016184800007,0.37059999999999998,null,null,2,0.70725199999999999,669.06039199999998,40,150,557,164,19,54,0.3,2.5,null,null,null,null,null,null,null,null,null,null,null,null,null,null,null,null,{"$f":"O19*0.85","v":34},0.53170775876766296,0.91417822026959994,581.76287563553399]
["Blat de moro tortó de gèrmens a pressió",88.1,1.1789597500931865,1.171602179305957,146,59.101547199313913,113.88478174088193,-23.878803971200011,0.2642698,null,null,2,0.80152400000000001,763.05084800000009,82,72,285,82,11,48,0.6,4.7,4.5,null,1.8,8.5,null,null,null,null,null,null,null,null,null,null,null,null,{"$f":"O20*0.8","v":65.600000000000009},0.56855881276595621,0.9382625715424,618.06043466382971]
["Blat de moro tortó de gèrmens amb dissolvent",87.9,1.0419900226719216,1.0235383932445659,135,54.171907268543997,111.696577773504,-33.882297663999992,0.26867210000000002,null,null,2,0.79027999999999987,752.34655999999984,17,79,310,89,12,48,0.9,5,4.5,null,1.8,8.5,null,null,null,null,null,null,null,null,null,1000,null,94,{"$f":"O21*0.75","v":12.75},0.57033439439208355,0.93392019732799991,677.34170324293109]
["Blat de moro extrussionat",90.3,1.2659242795142109,1.3059451410330718,96.35,55.422778448670854,120.6512296608667,-82.396955019056023,0.21464959,null,null,2,0.91813040000000012,904.90932224000017,4.32,2.5499999999999998,12.18,3.1,0.55000000000000004,14.399999999999999,0.3,2.9,1.4,0.5,3.7,0.3,1.2,0.05,4,null,null,30,5,0.08,14,1000,null,25,{"$f":"O22*0.85","v":3.6720000000000002},0.3880056000926686,0.93991618246111197,841.62366180892877]
["Fajol segones",89,1.1855213154544,1.1685861892728744,335,98.398382182629987,150.65027895702997,125.25641129000003,0.21290000000000009,null,null,2,0.79561999999999999,751.8608999999999,82,83,251.39,114.99000000000001,22.61,55,null,null,null,null,null,null,null,null,null,null,null,null,null,null,null,null,null,null,{"$f":"O23*0.8","v":65.600000000000009},0.69466219022372699,0.96197229616999991,567.57273372494842]
["Ordi bagàs cerveseria fresc",20.5,0.86409217991914111,0.77037029419231517,300,129.948715875,172.97965507500001,53.564157499999993,0.49509999999999998,null,null,2,0.63849999999999996,606.57500000000005,86,150,525,206,47,50,3.3,5.7,1.6,null,0.7,1.6,null,0.08,22.2,0.5,null,null,38.5,0.06,85,null,null,29,{"$f":"O24*0.45","v":38.700000000000003},0.5325076886943908,0.9265657974999999,380.32730660831726]
["Ordi bagàs cerveseria sec",91.9,0.87119356499561229,0.78054262949459352,262.39999999999998,107.61563282559231,151.63839868082431,35.094428351199994,0.49509999999999998,null,null,2,0.62731999999999999,601.34895199999994,79.900000000000006,161.6,643.29999999999995,236.4,78.899999999999991,41.4,2.2999999999999998,6.3,null,null,null,null,null,0.08,22.2,0.5,null,null,38.5,0.06,85,null,null,29,{"$f":"O25*0.45","v":35.955000000000005},0.53718506650710496,0.88614373099759991,400.00631345146428]
["Ordi malta, gra germinat i eixugat",89.6,0.82318564868563615,0.75819659606944634,255,66.3550213595625,127.25276543956251,71.697274874999977,0.29589999999999994,null,null,2,0.89924999999999988,840.79874999999993,23,10,94,10,6,65,2.7,7.5,null,null,null,null,null,null,null,null,null,null,null,null,null,null,null,16,{"$f":"O26*0.45","v":10.35},0.73182278620697816,0.97031275087500002,749.4135604827793]
["Ordi segó",89,0.76049500367747369,0.68300071501306703,118,25.132764616152489,75.567175445336488,-8.0437669206000031,0.36300710000000003,null,null,2,0.62060199999999999,581.50407399999995,32,187,539,239,28,63,0.8,3.9,null,null,null,null,null,0.03,11.7,0.6,null,null,123,0.05,59,null,null,null,{"$f":"O27*0.8","v":25.6},0.76510334942826175,0.90673719751619997,521.78626923253478]
["Cacau tortó",86.6,0.92152562915630509,0.87946946177744068,232,88.670879085753597,140.27091297407361,25.814947049499995,0.34659280999999997,null,null,2,0.74546499999999993,673.15489500000001,20,161,363.86,212.89999999999998,47.29,97,2.6,1.3,null,null,null,null,null,null,null,null,null,null,null,null,null,null,null,null,{"$f":"O28*0.75","v":15},0.58297490871153479,0.91649656821350012,556.40507382107603]
["Cacauet, tortó 48",88.6,1.1944335830241395,1.1865160385387328,524,143.30222231441923,198.10149398417923,261.73613801599998,0.28759999999999997,null,null,2,0.84376000000000007,789.75936000000002,16,77,150,101,26,64,1.8,6.6,3,null,null,null,null,0.3,14.5,1.7,null,450,47.5,0.11,61.5,null,null,null,{"$f":"O29*0.75","v":12},0.71794238190373694,0.96958034796799997,625.96116811755815]
["Coco tortó",90,0.97095956734287703,0.93399951412527582,239,87.269035447756792,138.20984342983681,30.484987527999994,0.28759999999999997,null,null,2,0.7160399999999999,660.18887999999993,18,178,580,316,78,78,2,6.6,4,null,null,0.6,null,null,20,null,null,500,60,null,70,null,null,null,{"$f":"O30*0.9","v":16.2},0.58722694217038374,0.88460814194399984,543.53611917872161]
["Colza, gra",89.9,1.9687535898800934,2.0261645054875959,217,41.884822356221591,81.980608908541598,90.240333511999992,0.29589999999999994,null,null,2,0.84608000000000005,798.69952000000012,457,68,199,116,41,56,3.3,5.3,null,null,null,null,null,null,null,null,null,null,null,null,null,null,null,null,{"$f":"O31*0.85","v":388.45},0.79112532282213199,0.92408336497600008,296.37371505240276]
["Colza, gra semiesclovellat",90,2.0068243854673327,2.0660563857148828,217,41.884822356221591,80.92224090854161,91.894033511999979,0.29589999999999994,null,null,2,0.84608000000000005,798.69952000000012,480,68,115,84,41,56,3.3,5.3,null,null,null,null,null,null,null,null,null,null,null,null,null,null,null,null,{"$f":"O32*0.79","v":379.20000000000005},0.79112532282213199,0.92408336497600008,273.37371505240276]
["Colza, turtó ",90,0.95800502495921236,0.90985936028426784,418,103.91199090373202,155.86270835653204,193.04700397999994,0.3125,null,null,2,0.78420000000000001,704.99580000000014,26,120,287,182,74,101,8.4,12.4,5.15,null,12.4,0.75,null,0.1,5.5,0.5,null,300,63.5,7.0000000000000007E-2,64.5,null,null,20,{"$f":"O33*0.8","v":20.8},0.72777380875241571,0.91318648854000006,565.20525205850993]
["Colza, turtó  tanné, curtit",89,1.2403090812927602,1.2532844857689245,391,143.42495357934857,193.47316113966858,118.739675687,0.33739999999999998,null,null,2,0.77349000000000001,713.93126999999993,26,129,302,193,79,77,8.4,12.4,null,null,12.4,0.75,null,0.1,5.5,0.5,null,300,63.5,7.0000000000000007E-2,64.5,null,null,null,{"$f":"O34*0.69","v":17.939999999999998},0.59520702136024917,0.90618107875099996,529.6572153518573]
["Cotó, gra",92,1.1057454642423121,1.0271553531490456,220,48.764449067224007,91.654792821464014,70.583837883999976,0.50340000000000007,null,null,2,0.64651999999999998,618.71964000000003,198,276,456,354,105,43,2.1,6.4,null,null,null,null,null,null,null,null,null,null,null,null,null,null,null,null,188.1,0.73941085414823005,0.85059792473200002,363.39002791261066]
["Cotó tortó dessoliat",89,1.1501920277402691,1.1259438132783857,466,160.92210943249918,212.64457169579521,184.58365271359997,0.29948819999999998,null,null,2,0.80219600000000002,750.855456,20,127,232,138,32,64,4.7,9.4,5.2,null,15.2,0.4,null,null,null,null,null,null,null,null,null,null,null,null,{"$f":"O36*0.75","v":15},0.64090967269049992,0.96167005577279996,563.51936347377296]
["Cotó clovella",91,0.36620814217767916,0.23807886329057015,81,16.103086591867196,54.653602301563204,-25.8351807964,0.65129486000000003,null,null,2,0.32318199999999997,309.60835599999996,19,547,900,697.4,184.60000000000002,42,1.4,1.1000000000000001,null,null,null,null,null,null,null,null,null,null,null,null,null,null,null,null,{"$f":"O37*0.75","v":14.25},0.72375435859716208,0.71966217154279999,268.23245904637008]
["Favó gra",86.9,1.2866071181997207,1.3209577887210684,302,51.430279740777983,115.06988487997799,130.98311697000003,0.1714,null,null,2,0.91429999999999989,876.81370000000004,16,90,171,108,24.700000000000003,41,1.3,7,1.6,0.8,12,0.25,null,0.4,13.8,1,null,100,12.7,0.02,43.7,null,null,null,{"$f":"O38*0.8","v":12.8},0.82245394822364193,0.95918178880999994,807.19479236353993]
["Gira-sol, gra",93,1.7084711843203275,1.695156001331616,174,24.647498694691201,60.4191065078112,72.586862791999977,0.26269999999999993,null,null,2,0.74312,714.13832000000002,485,164,294,200,56,39,1.8,4.8,null,null,null,null,null,null,null,null,null,null,null,null,null,null,null,null,{"$f":"O39*0.95","v":460.75},0.84184492382372955,0.89565440941600005,201.61933674532895]
["Gira-sol tortó esclovellat",91,0.99107641893319698,0.94397086945962927,417,80.253815077377354,133.12343795232135,220.11121425790003,0.32080000000000003,null,null,2,0.74591699999999994,691.46505899999988,22,176,299,220,70,73,3.8,9.9,5.5,1.2,12,0.33,null,null,null,null,null,null,null,null,null,null,null,null,{"$f":"O40*0.75","v":16.5},0.79012083402996014,0.91698092634670014,581.94544679049329]
["Llentia gra",88,1.2927425717054508,1.3306553425464995,281,49.081812964852382,113.1999670179724,113.22538429199999,0.1714,null,null,2,0.91962999999999995,886.52332000000001,19.3,49,160,72,3,36,1.1000000000000001,4.5,null,null,null,null,null,null,null,null,null,null,null,null,null,null,null,null,{"$f":"O41*0.75","v":14.475000000000001},0.82166571738072802,0.97944360991599988,817.11138658398465]
["Llí, gra",90.3,1.6575837469429318,1.6606714982698805,253,51.011948668166198,92.319144300857403,111.00750682392,0.32080000000000003,null,null,2,0.78051800000000005,743.36534319999998,362,101.89999999999999,244.7,148.4,62,47.599999999999994,4.2081949058693242,6.7552602436323372,3.9867109634551494,0.66445182724252494,7.9734219269102988,0.77519379844961245,2.9900332225913622,null,13.289036544850498,0.22148394241417499,0.44296788482834998,163.89811738648947,32.115171650055373,null,49.833887043189371,null,null,null,{"$f":"O42*0.95","v":343.9},0.77769198729402633,0.90697700524215985,325.12141598538869]
["Llinosa tortó dessoliat",89,1.1518710540767036,1.1341411667893986,377,129.46711168154192,180.63225981184593,120.74445604639997,0.30640610000000001,null,null,2,0.80390399999999995,752.45414399999981,58,118,236,149,88,64,4.7,9.4,6.1,null,14,1.3,null,0.6,21,0.6,null,250,59,0.5,73,null,null,9,{"$f":"O43*0.75","v":43.5},0.61695666244551961,0.89654108470719995,550.04680574196072]
["Margalló tortó (palmiste)",90,0.83194750357129577,0.76329964928928062,206,83.768055090368009,136.52083694508801,-3.9262216479999914,0.42869999999999997,null,null,2,0.73055999999999999,699.14591999999993,19,167,632,241,103,43,3.1,6.7,null,null,null,null,null,null,null,null,null,null,null,null,null,null,null,null,{"$f":"O44*0.9","v":17.100000000000001},0.52287183224694234,0.85226794729599997,581.85751744287006]
["Mongeta gra",88,1.2694175668129566,1.3060081028573072,257,44.572029681858787,108.56384220537879,93.98279293200001,0.1714,null,null,2,0.91937000000000002,878.91772000000003,19,51,162,74,3,44,1.3,5.0999999999999996,1.6,null,14,0.4,null,null,null,null,null,null,null,null,null,null,null,null,{"$f":"O45*0.8","v":15.200000000000001},0.82213541357934528,0.97507899463600001,814.20652128989173]
["Pèsol gra",85.7,1.2625786176584095,1.2977899538253017,259,44.911731932978391,108.99577708625841,95.458679448000012,0.1714,null,null,2,0.91768000000000005,877.30208000000005,15,64,162,74,3,44,0.9,4.5999999999999996,1.45,null,11,0.3,null,7.0000000000000007E-2,7.2,1.1000000000000001,null,null,8,0.2,37,null,null,null,{"$f":"O46*0.8","v":12},0.82222021761807795,0.97538858510400006,816.25711636308222]
["Soja, gra extrussionat",88,1.4854856019534888,1.4973907223657086,402,188.43235510953002,238.04062854249003,109.28707276099998,0.32080000000000003,null,null,2,0.97179000000000004,912.51081000000011,213,74,146,92,7,61,2.8,6.4,null,null,null,null,null,null,null,null,null,null,null,null,null,null,null,null,{"$f":"O47*0.95","v":202.35},0.52666678399466216,0.99029010835300013,509.23085716585433]
["Soja, gra torrat",88.6,1.4901857276896577,1.5024458709028436,397.29999999999995,133.30789500662681,185.68918291519,158.22623764286999,0.29589999999999994,null,null,2,0.97577899999999995,918.50077269999986,216.70000000000002,63.2,132,77.78,13.5,58.7,3.6117381489841991,5.9819413092550793,2.5959367945823928,0.56433408577878108,20.767494356659142,0.90293453724604977,3.1602708803611739,null,38.37471783295711,4.5146726862302486,null,161.39954853273139,31.602708803611741,0.31602708803611745,45.146726862302486,null,null,null,{"$f":"O48*0.95","v":205.86500000000001},0.65872130014657793,0.98316887688550991,566.2107452482353]
["Soja tortó 44",87.2,1.1656258626018918,1.1597938319839582,488,153.41999795655397,207.06952650471396,219.17261164349998,0.27810560000000001,null,null,2,0.84965499999999994,779.13363500000003,22,84,163,104,8,83,3.4,7,2.7,null,20,1.95,null,0.3,17.100000000000001,2.2999999999999998,null,200,43.7,0.2,54.6,null,null,7,{"$f":"O49*0.75","v":16.5},0.68199960346033861,0.9886316027755,601.94944148864533]
["Soja tortó 46",87.2,1.2042399719188401,1.2053336060239686,505,160.06920989040626,214.45587978640626,229.07082828750001,0.26867210000000002,null,null,2,0.86389499999999997,799.10287499999993,20,72,143,89,7,75,3.4,7.4,2.7,null,20,1.95,null,0.3,17.100000000000001,2.2999999999999998,null,200,43.7,0.2,54.6,null,null,null,{"$f":"O50*0.75","v":15},0.6799548883113109,0.99038766998750005,617.48009359721186]
["Soja tortó 48",88.3,1.2238106736886152,1.2268716598377332,520,165.08161824536202,219.31515756907405,239.06009480669999,0.26741429999999999,null,null,2,0.86734100000000003,804.02510700000005,23,70,140,87,7,73,3.4,7.8,2.7,null,19.7,1.95,null,0.3,17.100000000000001,2.2999999999999998,null,200,43.7,0.2,54.6,null,null,null,{"$f":"O51*0.75","v":17.25},0.67946396874075055,0.99041798584910001,614.34637074519037]
["Soja tortó 50",87.8,1.225744301238733,1.2255650042406774,544,172.40454338212001,225.71545583172002,256.10169929750003,0.2498051,null,null,2,0.86202699999999988,797.37497499999995,28,77,102,59,6,75,3,7.8,2.7,null,19.7,1.95,null,0.3,17.100000000000001,2.2999999999999998,null,200,43.7,0.2,54.6,null,null,null,{"$f":"O52*0.75","v":21},0.68011632654366916,0.99073551671750015,595.35825663975595]
["Soja tortó 48 curtit \"tanne\"",88.8,1.2238106736886152,1.2268716598377332,520,165.08161824536202,219.31515756907405,239.06009480669999,0.26741429999999999,null,null,2,0.86734100000000003,804.02510700000005,23,70,140,87,7,73,3.4,7.8,null,null,null,null,null,0.3,17.100000000000001,2.2999999999999998,null,200,43.7,0.2,54.6,null,null,null,{"$f":"O53*0.66","v":15.180000000000001},0.67946396874075055,0.99041798584910001,614.34637074519037]
["Llobí (tramús) gra",86.7,1.4985748501920342,1.5443460916061895,399,69.098815818280471,127.26703342788048,218.10215998500001,0.1714,null,null,2,0.90506999999999993,864.34185000000002,104,161,229,172,17,45,2,4.5999999999999996,2.5,null,9.5,0.55000000000000004,null,null,null,null,null,null,null,null,null,null,null,null,{"$f":"O54*0.9","v":93.600000000000009},0.82289872796188157,0.97785852990499988,689.67844245679078]
["Llobí (tramús) extrussionat",88,1.5275128795369315,1.5781926650923088,406,69.232090685749569,127.71452533022958,223.28119586800003,0.1714,null,null,2,0.91027000000000002,877.50027999999998,109,121,214,175,34.4,36,2,4.5,1.7,0.23,10,0.11,null,null,null,null,null,null,null,null,null,null,null,null,{"$f":"O55*0.77","v":83.93},0.82240293019900856,0.96016443876399993,696.39586966079742]
["Polpes (cítrics) ensitjades",21,1.2247648530455373,1.2387634090832353,73,20.576516455389989,79.537256128989995,-58.876155740000002,0.22120000000000006,null,null,2,0.87227999999999994,824.30459999999994,97,156,356.65,206.62,44.65,55,20.399999999999999,1.5,1.6,null,6.2,0.9,0.2,0.16,6,null,null,160,7,null,16,null,null,null,{"$f":"O56*0.6","v":58.199999999999996},0.68078367808218965,0.88300650397999969,704.00180849999981]
["Polpes (cítrics)",90,1.0945776496498119,1.1035515879610236,70,20.494530967225,82.579768544825001,-65.708183715000004,0.22120000000000006,null,null,2,0.87930999999999993,822.1548499999999,28,137,223,158,14,65,23,1.3,null,null,null,null,null,null,null,null,null,null,null,null,null,null,null,null,{"$f":"O57*0.6","v":16.8},0.6799461391636954,0.91478044680499992,771.75107974145862]
["Garrofer garrofa",87,0.84349490499888424,0.82739527562045634,58,20.578036751799999,81.081596271800024,-76.256811750000026,0.28817428899999997,null,null,2,0.801456386292835,771.80250000000012,11,87,257.16000000000003,120.00999999999999,23.83,37,1.5,0.6,null,null,null,null,null,null,null,null,null,null,null,null,null,null,null,null,{"$f":"O58*0.9","v":9.9},0.60525957312408907,0.89880263824999995,737.90755524119731]
["Garrofer polpa deshidratada sense grana, IAMZ",86,0.81755713356327342,0.80100990873229949,56,19.887404593055997,81.023260765855994,-78.364775269999996,0.286199543,null,null,2,0.80349252336448596,773.76329999999996,0.1,84.5,253.55,116.86999999999999,23.07,37,1.5,0.6,null,null,null,null,null,null,null,null,null,null,null,null,null,null,null,null,{"$f":"O59*0.8","v":8.0000000000000016E-2},0.60497831613785447,0.89901957128999999,751.54208570371975]
["Oliva molinada \"orujo\"",89,0.3555684594003049,0.23152849593807051,111,37.773671789926794,72.196085881446805,-21.365022018000008,0.58639999999999992,null,null,2,0.33429000000000003,306.87822,74,339,620.51,456.32,108.36,82,14,3.4,null,null,null,null,null,null,null,null,null,null,null,null,null,null,null,null,{"$f":"O60*0.74","v":54.76},0.57995139706720433,0.81015231828599998,186.25282507445968]
["Oliva polpa sense extracció, IAMZ ",68.5,0.52852566084554287,0.41188219318965796,114,44.703288467039997,84.482230931040007,-28.474597600000006,0.58639999999999992,null,null,2,0.45799999999999996,425.02399999999994,74,200,341,295,60.21,72,11.9,1.6,null,null,null,null,null,null,null,null,null,null,null,null,null,null,null,null,{"$f":"O61*0.74","v":54.76},0.54731158643493383,0.86623403119999987,299.4175208535824]
["Oliva polpa d'extracció (\"orujo\"), IAMZ",87.6,0.28358208219027031,0.16307856023765305,66,20.210481566827202,53.349659430507202,-38.259965412,0.58639999999999992,null,null,2,0.26932,252.89148,74,412,725.77,527.95000000000005,134.64000000000001,61,5.6,0.9,null,null,null,null,null,null,null,null,null,null,null,null,null,null,null,null,{"$f":"O62*0.74","v":54.76},0.60054601929246265,0.766594983324,152.52751727330252]
["Patata-ITEB",13,1.2240398770980918,1.2703481114883948,100,34.239489082499993,100.58316924249999,-56.862000250000008,0.12159999999999993,null,null,2,0.94450000000000001,901.99749999999995,0.8,30,174.97,48.46,7.2799999999999994,45,1,2,1,22,null,null,null,null,null,null,null,null,null,null,null,null,null,null,{"$f":"O63*0.8","v":0.64000000000000012},0.63329746986550162,0.93371292174999998,864.52724698655015]
["Patata polpa-ITEB",17,1.0475620581342135,1.0403259038381121,50,15.367721216250001,77.369791776250025,-80.57823525000002,0.12159999999999993,null,null,2,0.81010000000000004,789.84750000000008,2.5,150,348,199.08999999999997,43.7,25,5,0.5,0.8,6,null,null,null,null,null,null,null,null,null,null,null,null,null,null,{"$f":"O64*0.8","v":2},0.64892165618683528,0.87545822674999996,769.79358280934184]
["Poma deixalles",22,1.1001886495245434,1.1027604333914458,23,8.7955432171043988,71.564699576784406,-100.08680681200001,0.48679999999999995,null,null,2,0.82908000000000004,813.32747999999992,18,68,229.76,96.16,18,19,0.6,0.6,null,null,null,null,null,null,null,null,null,null,null,null,null,null,null,null,{"$f":"O65*0.9","v":16.2},0.57243623367851648,0.89440442012400012,785.49351337460575]
["Poma molinada (\"marc\") deshidratada",94.1,0.5535459390511992,0.42986523768137502,79,22.417724090135192,65.611793691415201,-39.820733751999995,0.48679999999999995,null,null,2,0.44367999999999996,435.25007999999991,39,478,354,610.79,121,19,1.9,1.6,null,null,null,null,null,null,null,null,null,null,null,null,null,null,null,null,35.1,0.64126377758117026,0.79102315750399976,367.90991842891236]
["Poma residu deshidratat, NRC",89,1.0175921929055001,0.98320116886366127,49,17.456201438843994,73.715111672443996,-76.134547240000003,0.48679999999999995,null,null,2,0.73319999999999996,717.06959999999992,51,170,376.83,260,50.24,22,1.3,1.1000000000000001,0.7,null,4.5999999999999996,1.2,0.2,null,10,null,null,300,7,null,null,null,null,null,45.9,{"$f":"1-(F67/(E67*AO67))","v":0.58855484528181679},{"$f":"(88.3+0.0371*E67-3.7*(10^-5)*(E67^2)-0.107*S67-0.00313*(100-N67))/100","v":0.86584810847999993},{"$f":"N67-E67*(1-AN67)-O67","v":645.90878741880897}]
["Raïm vinassa sense pinyols",67,0.66080505971637316,0.56171561481913768,172,20.015764349395198,59.872981870035204,-4.2369023759999997,0.58639999999999992,null,null,2,0.54432999999999998,483.36503999999996,97,103,777,685,536,112,6,2.5,null,null,null,null,null,null,null,null,null,null,null,null,null,null,null,null,{"$f":"O68*0.75","v":72.75},0.68913529881265156,0.37434524575200001,332.89631139577602]
["Raïm polpa",90,0.30489011965292578,0.18655481578623268,120,11.608508946144001,48.208402918624003,-20.987334332000007,0.58639999999999992,null,null,2,0.30492000000000002,292.41828000000004,7,372,754,653,499,41,8,4,null,null,null,null,null,null,null,null,null,null,null,null,null,null,null,null,{"$f":"O69*0.75","v":5.25},0.75465044300790995,0.39428469216400003,255.97633316094925]
["Raïm tortó de pinyols",89,0.16230419405379379,6.7872305095073068E-2,112,-1.6540106768192107,29.626211898540795,-16.035347774000005,0.58639999999999992,null,null,2,0.18833000000000005,181.17346000000003,16,503,847,751,644,38,6.6,1.3,null,null,null,null,null,null,null,null,null,null,null,null,null,null,null,null,{"$f":"O70*0.75","v":12},1.0632808876836617,0.23337144929799986,172.26091942057013]
["Remolatxa polpes ensitjades",22,1.0076659697674053,1.0014902800769032,98,33.631260467481596,93.731943465241613,-53.227317184,0.28759999999999997,null,null,2,0.85377999999999998,778.64736000000005,9,206,428.74,269.38,62.220000000000006,88,13,1,null,null,null,null,null,0.1,4.5999999999999996,0.3,null,null,52.4,0.03,9.6,null,null,null,{"$f":"O71*0.5","v":4.5},0.60575801718969247,0.87047078236799991,731.01164568458989]
["Remolatxa polpes deshidratades",90,1.0254716288107246,1.0191080235150367,98,34.16981376867458,94.986646944936979,-54.346301837909991,0.28759999999999997,null,null,2,0.85500100000000001,794.2104288999999,9,202.7,507.9,302.10000000000002,55.099999999999994,71.100000000000009,10.6,1,2.2333333333333334,0.4,4,2.2333333333333329,2.2000000000000002,9.3333333333333338E-2,7.7333333333333334,0.3,null,243,47.6,0.03,9.7333333333333325,null,0.6,null,4,0.60314025484359779,0.87857630642456985,746.31817387467254]
["Melassa Remolatxa",76,1.184004733191649,1.2070895142316092,146,10.219999999999994,76.740128512000027,17.642299199999986,-0.70840000000000014,null,null,3,0.89,878.25200000000007,2,0,0,0,0,13.200000000000001,3.5,0.5,16.5,null,55,12.5,null,null,null,null,null,null,null,null,null,null,null,null,2,0.93,1,866.03200000000004]
["Melassa canya",75,0.86106390989984793,0.83916162333276656,45,3.1499999999999977,61.811424000000009,-64.008475000000004,-1.5384,null,null,4,0.8,710.40000000000009,12,0,0,0,0,112,9.3000000000000007,1.1000000000000001,4.7,27,33,1.7,null,null,null,null,null,null,null,null,null,null,null,null,12,0.93,1,695.25000000000011]
["Grassa vegetal, mantega de porc (tots els tipus)",99.9,3.61,3.94,9.9999999999999995E-8,9.9999999999999995E-8,9.9999999999999995E-8,-14,0.25,null,null,2,0.9,9.9999999999999995E-8,999,9.9999999999999995E-8,9.9999999999999995E-8,9.9999999999999995E-8,9.9999999999999995E-8,9.9999999999999995E-8,9.9999999999999995E-8,9.9999999999999995E-8,9.9999999999999995E-8,9.9999999999999995E-8,9.9999999999999995E-8,9.9999999999999995E-8,9.9999999999999995E-8,9.9999999999999995E-8,9.9999999999999995E-8,9.9999999999999995E-8,9.9999999999999995E-8,9.9999999999999995E-8,9.9999999999999995E-8,9.9999999999999995E-8,9.9999999999999995E-8,1300,9.9999999999999995E-8,95,{"$f":"O75","v":999},0,0,0]
["Llevat cerveseria",93.3,1.18,1.17,476,87,143,278,0.15,null,null,2,0.84,756,40,21,88,25,7,32,3,13.5,2.4,null,null,null,null,null,null,null,null,null,null,null,null,null,null,null,32,{"$f":"1-(F76/(E76*AO76))","v":0.81515770697868817},{"$f":"(88.3+0.0371*E76-3.7*(10^-5)*(E76^2)-0.107*S76-0.00313*(100-N76))/100","v":0.98880568000000002},{"$f":"N76-E76*(1-AN76)-O76","v":628.0150685218556}]
["Urea",99,0.26,0.2,2870,9.9999999999999995E-7,71,2557,0.23,null,null,2,0.99,9.9999999999999995E-7,9.9999999999999995E-7,9.9999999999999995E-7,9.9999999999999995E-7,9.9999999999999995E-7,9.9999999999999995E-7,9.9999999999999995E-7,9.9999999999999995E-7,9.9999999999999995E-7,9.9999999999999995E-7,9.9999999999999995E-7,9.9999999999999995E-7,9.9999999999999995E-7,9.9999999999999995E-7,9.9999999999999995E-7,9.9999999999999995E-7,9.9999999999999995E-7,9.9999999999999995E-7,9.9999999999999995E-7,9.9999999999999995E-7,9.9999999999999995E-7,9.9999999999999995E-7,9.9999999999999995E-7,9.9999999999999995E-7,9.9999999999999995E-7,0,0,0,0]
["Residu pa deshidratat, NRC ",92,1.0961415666476575,1.0548754187213749,107,22.016129611689657,70.466557902495424,-10.723794204384003,0.29445700000000002,null,null,2,0.71421800000000002,628.16901535999989,127,130,180,130,10,44,1.4,2.6,2.6,16.100000000000001,5.3,12.4,0.2,1.05,5,null,null,31,71,null,16,2000,null,45,null,{"$f":"1-(F78/(E78*AO78))","v":0.77738842706928668},{"$f":"(88.3+0.0371*E78-3.7*(10^-5)*(E78^2)-0.107*S78-0.00313*(100-N78))/100","v":0.924292560180768},{"$f":"N78-E78*(1-AN78)-O78","v":477.34957705641352}]
["Mandioca",85,1.1420974625875657,1.1744543546403801,31,10.1054225265006,75.490022489380621,-97.453437442000009,0.12159999999999993,null,null,2,0.91761999999999999,861.64517999999998,8.1999999999999993,54,118,59,14.01,61,2.5,1,0.9,null,7.5,0.35,null,null,2,null,null,50,5,null,30,null,null,null,{"$f":"O79*0.8","v":6.56},{"$f":"1-(F79/(E79*AO79))","v":0.63899949400537248},{"$f":"(88.3+0.0371*E79-3.7*(10^-5)*(E79^2)-0.107*S79-0.00313*(100-N79))/100","v":0.90299422413399999},{"$f":"N79-E79*(1-AN79)-O79","v":842.25416431416647}]
["Alfals deshidratat i aglomerats",90.2,0.73987011742021469,0.6738447078476324,233,68.64631678888,116.14710297768001,51.380021579999976,0.37889999999999996,null,null,2,0.66579999999999995,579.91179999999997,34,237,405,280,76,129,24.1,3.2,null,null,null,null,null,null,null,null,null,null,null,null,null,null,null,null,{"$f":"O80*0.5","v":17},{"$f":"1-(F80/(E80*AO80))","v":0.66636436588674008},{"$f":"(88.3+0.0371*E80-3.7*(10^-5)*(E80^2)-0.107*S80-0.00313*(100-N80))/100","v":0.88305730933999993},{"$f":"N80-E80*(1-AN80)-O80","v":468.17469725161038}]
["Graminies deshidratades i aglomerades",91,0.82899594181392655,0.78514605944839444,105,26.822401345057497,80.520582379937494,-29.853407866999998,0.38187409999999999,null,null,2,0.72206999999999999,649.14093000000003,25,238,508,269,73.08,101,4.3,2.7,null,null,null,null,null,null,null,null,null,null,null,null,null,null,null,null,{"$f":"O81*0.5","v":12.5},{"$f":"1-(F81/(E81*AO81))","v":0.70187781135587579},{"$f":"(88.3+0.0371*E81-3.7*(10^-5)*(E81^2)-0.107*S81-0.00313*(100-N81))/100","v":0.85686826110900005},{"$f":"N81-E81*(1-AN81)-O81","v":592.83810019236694}]
[]
[]
[]
[]
[]
[]
[]
[]
[]
[]
[]
[]
[]
[]
[]
[]
[]
[]
[]
[]
[]
[]
[]
[]
[]
[]
[]
[]
[]
[]
[]
[]
[]
[]
[]
[]
[]
[]
[]
[]
[]
[]
[]
[]
[]
[]
[]
[]
[]
[]
[]
[]
[]
[]
[]
[]
[]
[]
[]
[]
[]
[]
[]
[]
[]
[]
[]
[]
[]
[]
[]
[]
[]
[]
[]
[]
[]
[]
[]
[]
[]
[]
[]
[]
[]
[]
[]
[]
[]
[]
[]
[]
[]
[]
[]
[]
[]
[]
[]
[]
[]
[]
[]
[]
[]
[]
[]
[]
["","","","","","","","",null,null,null,null,"","","","","","","","","","","","","","","","","","","","","","","","","",""]
["","","","","","","","",null,null,null,null,"","","","","","","","","","","","","","","","","","","","","","","","","",""]
[]
["","","","","","","","",null,null,null,null,"","","","","","","","","","","","","","","","","","","","","","","","","",""]
[]
[]
["","","","","","","","",null,null,null,null,"","","","","","","","","","","","","","","","","","","","","","","","","",""]
[]
["","","","","","","","",null,null,null,null,"","","","","","","","","","","","","","","","","","","","","","","","","",""]

{"sheet":"Taula Minerals-aa","index":3,"n_rows":28,"n_cols":42,"rows_kept":28,"cut":false,"hidden":false,"merged":[]}
["INGREDIENTS","MS","UFL","UFV","MNT_PB","PDIA","PDI","BPR","UEL","UEB","UEM","NI ref","dMO","MOD_TDN","EE","FB","NDF","ADF","Lignina","cendres","Ca","P","Mg","Cl","K","Na","S","Co","Cu","Mo","Iode","Fe","Mn","Se","Zn","Vit A","Vit D","Vit E","AG","DT_N","dr","MOF"]
[]
["Bicarbonat sòdic",99.7,null,null,null,null,null,null,null,null,null,null,null,null,null,null,null,null,null,null,null,null,null,null,null,270]
["Carbonat càlcic",98,null,null,null,null,null,null,null,null,null,null,null,null,null,null,null,null,null,955,383,0.2,14,0.2,0.7,0.7,0.7,null,12,null,null,620]
["Carbonat de cobalt",100,null,null,null,null,null,null,null,null,null,null,null,null,null,null,null,null,null,null,null,null,null,null,null,null,null,49]
["Carbonat de manganès",100,null,null,null,null,null,null,null,null,null,null,null,null,null,null,null,null,null,null,null,null,null,null,null,null,null,null,null,null,null,null,47]
["Carbonat de zinc",100,null,null,null,null,null,null,null,null,null,null,null,null,null,null,null,null,null,null,null,null,null,null,null,null,null,null,null,null,null,null,null,null,52]
["Clorur potàssic",100,null,null,null,null,null,null,null,null,null,null,null,null,null,null,null,null,null,null,null,null,null,null,52]
["Clorur sòdic",98,null,null,null,null,null,null,null,null,null,null,null,null,null,null,null,null,null,null,null,null,null,570,null,360]
["Farina d’ossos",100,null,null,null,null,null,null,null,null,null,null,null,null,null,null,null,null,null,null,29.5,15]
["Fosfat bicàlcic",98.8,null,null,null,null,null,null,null,null,null,null,null,null,null,null,null,null,null,836,244,180,5,0.4,1.2,0.8,11,null,15,null,null,7800]
["Fosfat monocàlcic",98.8,null,null,null,null,null,null,null,null,null,null,null,null,null,null,null,null,null,null,180,228]
["Fosfat monocàlcic",99,null,null,null,null,null,null,null,null,null,null,null,null,null,null,null,null,null,null,175,219,8,1.5,1.5,1,9,null,8,null,null,4000]
["Fosfat sòdic",100,null,null,null,null,null,null,null,null,null,null,null,null,null,null,null,null,null,null,null,20,null,null,null,19]
["Fosfòric",100,null,null,null,null,null,null,null,null,null,null,null,null,null,null,null,null,null,null,null,31.6]
["Iodur potàssic",100,null,null,null,null,null,null,null,null,null,null,null,null,null,null,null,null,null,null,null,null,null,null,null,null,null,null,null,null,76]
["Lisina-L (HCl)",98.5,null,null,950,null,null,null,null,null,null,null,null,null,null,null,null,null,null,200,0.4,null,null,194,null,0.3,null,null,null,null,null,null,null,null,null,null,null,780]
["Metionina-DL",99.7,null,null,585,null,null,null,null,null,null,null,null,null,null,null,null,null,null,5,0.2]
["Òxid de coure",100,null,null,null,null,null,null,null,null,null,null,null,null,null,null,null,null,null,null,null,null,null,null,null,null,null,null,80]
["Òxid de manganès",100,null,null,null,null,null,null,null,null,null,null,null,null,null,null,null,null,null,null,null,null,null,null,null,null,null,null,null,null,null,null,77]
["Òxid de zinc",100,null,null,null,null,null,null,null,null,null,null,null,null,null,null,null,null,null,null,null,null,null,null,null,null,null,null,null,null,null,null,null,null,80]
["Òxid magnèsic",100,null,null,null,null,null,null,null,null,null,null,null,null,null,null,null,null,null,null,30,null,510]
["Sulfat de cobalt",100,null,null,null,null,null,null,null,null,null,null,null,null,null,null,null,null,null,null,null,null,null,null,null,null,null,22]
["Sulfat de coure",100,null,null,null,null,null,null,null,null,null,null,null,null,null,null,null,null,null,null,null,null,null,null,null,null,null,null,25]
["Sulfat de zinc",100,null,null,null,null,null,null,null,null,null,null,null,null,null,null,null,null,null,null,null,null,null,null,null,null,null,null,null,null,null,null,null,null,23]
["Sulfat magnèsic",100,null,null,null,null,null,null,null,null,null,null,null,null,null,null,null,null,null,null,null,null,10,null,null,null,13]
["Sulfat sòdic",100,null,null,null,null,null,null,null,null,null,null,null,null,null,null,null,null,null,null,null,null,null,null,null,32,22]
["Triptòfan-L",99.3,null,null,851,null,null,null,null,null,null,null,null,null,null,null,null,null,null,10]

{"sheet":"CàlculsOVI","index":4,"n_rows":53,"n_cols":113,"rows_kept":53,"cut":false,"hidden":true,"merged":[[2,0,6,0],[7,0,18,0],[19,0,24,0]]}
[null,null,null,{"$f":"OFFSET('Taula Farratges'!$A$1,0,D2,1,1)","v":"MS %"},{"$f":"OFFSET('Taula Farratges'!$A$1,0,E2,1,1)","v":"UEM"},{"$f":"OFFSET('Taula Farratges'!$A$1,0,F2,1,1)","v":"UFL"},{"$f":"OFFSET('Taula Farratges'!$A$1,0,G2,1,1)","v":"PDI"},{"$f":"OFFSET('Taula Farratges'!$A$1,0,H2,1,1)","v":"BPR"},{"$f":"OFFSET('Taula Farratges'!$A$1,0,I2,1,1)","v":"Ca"},{"$f":"OFFSET('Taula Farratges'!$A$1,0,J2,1,1)","v":"P"},{"$f":"OFFSET('Taula Farratges'!$A$1,0,K2,1,1)","v":"Mg"},{"$f":"OFFSET('Taula Farratges'!$A$1,0,L2,1,1)","v":"K"},{"$f":"OFFSET('Taula Farratges'!$A$1,0,M2,1,1)","v":"Na"},{"$f":"OFFSET('Taula Farratges'!$A$1,0,N2,1,1)","v":"S"},{"$f":"OFFSET('Taula Farratges'!$A$1,0,O2,1,1)","v":"Cl"},{"$f":"OFFSET('Taula Farratges'!$A$1,0,P2,1,1)","v":"Fe"},{"$f":"OFFSET('Taula Farratges'!$A$1,0,Q2,1,1)","v":"Co"},{"$f":"OFFSET('Taula Farratges'!$A$1,0,R2,1,1)","v":"Cu"},{"$f":"OFFSET('Taula Farratges'!$A$1,0,S2,1,1)","v":"Mn"},{"$f":"OFFSET('Taula Farratges'!$A$1,0,T2,1,1)","v":"Zn"},{"$f":"OFFSET('Taula Farratges'!$A$1,0,U2,1,1)","v":"Iode"},{"$f":"OFFSET('Taula Farratges'!$A$1,0,V2,1,1)","v":"Se"},{"$f":"OFFSET('Taula Farratges'!$A$1,0,W2,1,1)","v":"Vit A"},{"$f":"OFFSET('Taula Farratges'!$A$1,0,X2,1,1)","v":"Vit D"},{"$f":"OFFSET('Taula Farratges'!$A$1,0,Y2,1,1)","v":"Vit E"},{"$f":"OFFSET('Taula Farratges'!$A$1,0,Z2,1,1)","v":"AG"},{"$f":"OFFSET('Taula Farratges'!$A$1,0,AA2,1,1)","v":"DT_N"},{"$f":"OFFSET('Taula Farratges'!$A$1,0,AB2,1,1)","v":"PF"},{"$f":"OFFSET('Taula Farratges'!$A$1,0,AC2,1,1)","v":"MNT_PB"},{"$f":"OFFSET('Taula Farratges'!$A$1,0,AD2,1,1)","v":"PDIA"},{"$f":"OFFSET('Taula Farratges'!$A$1,0,AE2,1,1)","v":"NI ref"},{"$f":"OFFSET('Taula Farratges'!$A$1,0,AF2,1,1)","v":"dMO"},{"$f":"OFFSET('Taula Farratges'!$A$1,0,AG2,1,1)","v":"MOD"},{"$f":"OFFSET('Taula Farratges'!$A$1,0,AH2,1,1)","v":"EE"},{"$f":"OFFSET('Taula Farratges'!$A$1,0,AI2,1,1)","v":"FB"},{"$f":"OFFSET('Taula Farratges'!$A$1,0,AJ2,1,1)","v":"NDF"},{"$f":"OFFSET('Taula Farratges'!$A$1,0,AK2,1,1)","v":"ADF"},{"$f":"OFFSET('Taula Farratges'!$A$1,0,AL2,1,1)","v":"Lignina"},{"$f":"OFFSET('Taula Farratges'!$A$1,0,AM2,1,1)","v":"cendres"},{"$f":"OFFSET('Taula Farratges'!$A$1,0,AN2,1,1)","v":"Mo"},{"$f":"OFFSET('Taula Farratges'!$A$1,0,AO2,1,1)","v":"MOF"}]
["TIPUS","INGREDIENTS UTILITZATS","Nº",1,10,{"$f":"F30+1","v":2},6,7,20,21,22,24,25,26,23,31,27,28,32,34,30,33,35,36,37,38,39,40,4,5,11,12,13,14,15,16,17,18,19,29,41,"UEM","UFL","PDI","BPR","NI ref","Ca","P","Mg","K","Na","S","Cl","Fe","Co","Cu","Mn","Zn","Iode","Se","Vit A","Vit D","Vit E","AG","MNT_PB","PDIA","dMO","MOD","EE","FB","NDF","ADF","Lignina","cendres","Mo","DT_N","MOF"]
["FARRATGES",{"$f":"IF(OFFSET('Taula Farratges'!$A$1,C3,0,1,1)=0,\"\",OFFSET('Taula Farratges'!$A$1,C3,0,1,1))","v":"VERD Enclova Inici Floració, 2n any"},31,{"$f":"OFFSET('Taula Farratges'!$A$1,$C3,$D$2,1,1)","v":15.37},{"$f":"OFFSET('Taula Farratges'!$A$1,$C3,$E$2,1,1)","v":1.0737438177302745},{"$f":"OFFSET('Taula Farratges'!$A$1,$C3,$F$2,1,1)","v":0.86881967024630535},{"$f":"OFFSET('Taula Farratges'!$A$1,$C3,$G$2,1,1)","v":80.223350325455058},{"$f":"OFFSET('Taula Farratges'!$A$1,$C3,$H$2,1,1)","v":18.721171366476486},{"$f":"OFFSET('Taula Farratges'!$A$1,$C3,$I$2,1,1)","v":0},{"$f":"OFFSET('Taula Farratges'!$A$1,$C3,$J$2,1,1)","v":0},{"$f":"OFFSET('Taula Farratges'!$A$1,$C3,$K$2,1,1)","v":0},{"$f":"OFFSET('Taula Farratges'!$A$1,$C3,$L$2,1,1)","v":0},{"$f":"OFFSET('Taula Farratges'!$A$1,$C3,$M$2,1,1)","v":0},{"$f":"OFFSET('Taula Farratges'!$A$1,$C3,$N$2,1,1)","v":0},{"$f":"OFFSET('Taula Farratges'!$A$1,$C3,$O$2,1,1)","v":0},{"$f":"OFFSET('Taula Farratges'!$A$1,$C3,$P$2,1,1)","v":0},{"$f":"OFFSET('Taula Farratges'!$A$1,$C3,$Q$2,1,1)","v":0},{"$f":"OFFSET('Taula Farratges'!$A$1,$C3,$R$2,1,1)","v":0},{"$f":"OFFSET('Taula Farratges'!$A$1,$C3,$S$2,1,1)","v":0},{"$f":"OFFSET('Taula Farratges'!$A$1,$C3,$T$2,1,1)","v":0},{"$f":"OFFSET('Taula Farratges'!$A$1,$C3,$U$2,1,1)","v":0},{"$f":"OFFSET('Taula Farratges'!$A$1,$C3,$V$2,1,1)","v":0},{"$f":"OFFSET('Taula Farratges'!$A$1,$C3,$W$2,1,1)","v":0},{"$f":"OFFSET('Taula Farratges'!$A$1,$C3,$X$2,1,1)","v":0},{"$f":"OFFSET('Taula Farratges'!$A$1,$C3,$Y$2,1,1)","v":0},{"$f":"OFFSET('Taula Farratges'!$A$1,$C3,$Z$2,1,1)","v":15.567499999999999},{"$f":"OFFSET('Taula Farratges'!$A$1,$C3,$AA$2,1,1)","v":0.74},{"$f":"OFFSET('Taula Farratges'!$A$1,$C3,$AB$2,1,1)","v":0},{"$f":"OFFSET('Taula Farratges'!$A$1,$C3,$AC$2,1,1)","v":151.5},{"$f":"OFFSET('Taula Farratges'!$A$1,$C3,$AD$2,1,1)","v":29.5425},{"$f":"OFFSET('Taula Farratges'!$A$1,$C3,$AE$2,1,1)","v":2.5097055696390158},{"$f":"OFFSET('Taula Farratges'!$A$1,$C3,$AF$2,1,1)","v":0.66603899999999994},{"$f":"OFFSET('Taula Farratges'!$A$1,$C3,$AG$2,1,1)","v":598.43604149999999},{"$f":"OFFSET('Taula Farratges'!$A$1,$C3,$AH$2,1,1)","v":23},{"$f":"OFFSET('Taula Farratges'!$A$1,$C3,$AI$2,1,1)","v":286.10000000000002},{"$f":"OFFSET('Taula Farratges'!$A$1,$C3,$AJ$2,1,1)","v":406},{"$f":"OFFSET('Taula Farratges'!$A$1,$C3,$AK$2,1,1)","v":371.5},{"$f":"OFFSET('Taula Farratges'!$A$1,$C3,$AL$2,1,1)","v":""},{"$f":"OFFSET('Taula Farratges'!$A$1,$C3,$AM$2,1,1)","v":101.5},{"$f":"OFFSET('Taula Farratges'!$A$1,$C3,$AN$2,1,1)","v":0},{"$f":"OFFSET('Taula Farratges'!$A$1,$C3,$AO$2,1,1)","v":521.819591565},{"$f":"IF('II_Plantejar Ració'!$E4>0,IF(E3>0,1,\"No\"),\"\")","v":1},{"$f":"IF('II_Plantejar Ració'!$E4>0,IF(F3>0,1,\"No\"),\"\")","v":1},{"$f":"IF('II_Plantejar Ració'!$E4>0,IF(G3>0,1,\"No\"),\"\")","v":1},{"$f":"IF('II_Plantejar Ració'!$E4>0,IF(H3=0,\"No\",1),\"\")","v":1},{"$f":"IF('II_Plantejar Ració'!$E4>0,IF(AE3>0,1,\"No\"),\"\")","v":1},{"$f":"IF('II_Plantejar Ració'!$E4>0,IF(I3>0,1,\"No\"),\"\")","v":"No"},{"$f":"IF('II_Plantejar Ració'!$E4>0,IF(J3>0,1,\"No\"),\"\")","v":"No"},{"$f":"IF('II_Plantejar Ració'!$E4>0,IF(K3>0,1,\"No\"),\"\")","v":"No"},{"$f":"IF('II_Plantejar Ració'!$E4>0,IF(L3>0,1,\"No\"),\"\")","v":"No"},{"$f":"IF('II_Plantejar Ració'!$E4>0,IF(M3>0,1,\"No\"),\"\")","v":"No"},{"$f":"IF('II_Plantejar Ració'!$E4>0,IF(N3>0,1,\"No\"),\"\")","v":"No"},{"$f":"IF('II_Plantejar Ració'!$E4>0,IF(O3>0,1,\"No\"),\"\")","v":"No"},{"$f":"IF('II_Plantejar Ració'!$E4>0,IF(P3>0,1,\"No\"),\"\")","v":"No"},{"$f":"IF('II_Plantejar Ració'!$E4>0,IF(Q3>0,1,\"No\"),\"\")","v":"No"},{"$f":"IF('II_Plantejar Ració'!$E4>0,IF(R3>0,1,\"No\"),\"\")","v":"No"},{"$f":"IF('II_Plantejar Ració'!$E4>0,IF(S3>0,1,\"No\"),\"\")","v":"No"},{"$f":"IF('II_Plantejar Ració'!$E4>0,IF(T3>0,1,\"No\"),\"\")","v":"No"},{"$f":"IF('II_Plantejar Ració'!$E4>0,IF(U3>0,1,\"No\"),\"\")","v":"No"},{"$f":"IF('II_Plantejar Ració'!$E4>0,IF(V3>0,1,\"No\"),\"\")","v":"No"},{"$f":"IF('II_Plantejar Ració'!$E4>0,IF(W3>0,1,\"No\"),\"\")","v":"No"},{"$f":"IF('II_Plantejar Ració'!$E4>0,IF(X3>0,1,\"No\"),\"\")","v":"No"},{"$f":"IF('II_Plantejar Ració'!$E4>0,IF(Y3>0,1,\"No\"),\"\")","v":"No"},{"$f":"IF('II_Plantejar Ració'!$E4>0,IF(Z3>0,1,\"No\"),\"\")","v":1},{"$f":"IF('II_Plantejar Ració'!$E4>0,IF(AA3>0,1,\"No\"),\"\")","v":1},{"$f":"IF('II_Plantejar Ració'!$E4>0,IF(AB3>0,1,\"No\"),\"\")","v":"No"},{"$f":"IF('II_Plantejar Ració'!$E4>0,IF(AC3>0,1,\"No\"),\"\")","v":1},{"$f":"IF('II_Plantejar Ració'!$E4>0,IF(AD3>0,1,\"No\"),\"\")","v":1},{"$f":"IF('II_Plantejar Ració'!$E4>0,IF(AE3>0,1,\"No\"),\"\")","v":1},{"$f":"IF('II_Plantejar Ració'!$E4>0,IF(AF3>0,1,\"No\"),\"\")","v":1},{"$f":"IF('II_Plantejar Ració'!$E4>0,IF(AG3>0,1,\"No\"),\"\")","v":1},{"$f":"IF('II_Plantejar Ració'!$E4>0,IF(AH3>0,1,\"No\"),\"\")","v":1},{"$f":"IF('II_Plantejar Ració'!$E4>0,IF(AI3>0,1,\"No\"),\"\")","v":1},{"$f":"IF('II_Plantejar Ració'!$E4>0,IF(AJ3>0,1,\"No\"),\"\")","v":1},{"$f":"IF('II_Plantejar Ració'!$E4>0,IF(AK3>0,1,\"No\"),\"\")","v":1},{"$f":"IF('II_Plantejar Ració'!$E4>0,IF(AL3>0,1,\"No\"),\"\")","v":1},{"$f":"IF('II_Plantejar Ració'!$E4>0,IF(AM3>0,1,\"No\"),\"\")","v":1},{"$f":"IF(AP3=\"\",0,1)","v":1},1,1,1,1,1,1,1,1,1,1,1,1,1,1,1,1,1,1,1,1,1,1,1,1,1,1,1,1,1,1,1,1,1,1,1]
[null,{"$f":"IF(OFFSET('Taula Farratges'!$A$1,C4,0,1,1)=0,\"\",OFFSET('Taula Farratges'!$A$1,C4,0,1,1))","v":"ENSITJAT Prat natural pla, gramínies en gran part"},40,{"$f":"OFFSET('Taula Farratges'!$A$1,$C4,$D$2,1,1)","v":48},{"$f":"OFFSET('Taula Farratges'!$A$1,$C4,$E$2,1,1)","v":1.6383431146859011},{"$f":"OFFSET('Taula Farratges'!$A$1,$C4,$F$2,1,1)","v":0.9301076693133391},{"$f":"OFFSET('Taula Farratges'!$A$1,$C4,$G$2,1,1)","v":51.530586601789764},{"$f":"OFFSET('Taula Farratges'!$A$1,$C4,$H$2,1,1)","v":18.011833434703501},{"$f":"OFFSET('Taula Farratges'!$A$1,$C4,$I$2,1,1)","v":8.6999999999999993},{"$f":"OFFSET('Taula Farratges'!$A$1,$C4,$J$2,1,1)","v":2.6},{"$f":"OFFSET('Taula Farratges'!$A$1,$C4,$K$2,1,1)","v":0},{"$f":"OFFSET('Taula Farratges'!$A$1,$C4,$L$2,1,1)","v":0},{"$f":"OFFSET('Taula Farratges'!$A$1,$C4,$M$2,1,1)","v":0},{"$f":"OFFSET('Taula Farratges'!$A$1,$C4,$N$2,1,1)","v":0},{"$f":"OFFSET('Taula Farratges'!$A$1,$C4,$O$2,1,1)","v":0},{"$f":"OFFSET('Taula Farratges'!$A$1,$C4,$P$2,1,1)","v":0},{"$f":"OFFSET('Taula Farratges'!$A$1,$C4,$Q$2,1,1)","v":0},{"$f":"OFFSET('Taula Farratges'!$A$1,$C4,$R$2,1,1)","v":0},{"$f":"OFFSET('Taula Farratges'!$A$1,$C4,$S$2,1,1)","v":0},{"$f":"OFFSET('Taula Farratges'!$A$1,$C4,$T$2,1,1)","v":0},{"$f":"OFFSET('Taula Farratges'!$A$1,$C4,$U$2,1,1)","v":0},{"$f":"OFFSET('Taula Farratges'!$A$1,$C4,$V$2,1,1)","v":0},{"$f":"OFFSET('Taula Farratges'!$A$1,$C4,$W$2,1,1)","v":8000},{"$f":"OFFSET('Taula Farratges'!$A$1,$C4,$X$2,1,1)","v":200},{"$f":"OFFSET('Taula Farratges'!$A$1,$C4,$Y$2,1,1)","v":5},{"$f":"OFFSET('Taula Farratges'!$A$1,$C4,$Z$2,1,1)","v":18.256900000000002},{"$f":"OFFSET('Taula Farratges'!$A$1,$C4,$AA$2,1,1)","v":0.78},{"$f":"OFFSET('Taula Farratges'!$A$1,$C4,$AB$2,1,1)","v":115},{"$f":"OFFSET('Taula Farratges'!$A$1,$C4,$AC$2,1,1)","v":114.3},{"$f":"OFFSET('Taula Farratges'!$A$1,$C4,$AD$2,1,1)","v":15.087599999999998},{"$f":"OFFSET('Taula Farratges'!$A$1,$C4,$AE$2,1,1)","v":1.6448208043647601},{"$f":"OFFSET('Taula Farratges'!$A$1,$C4,$AF$2,1,1)","v":0.66871099999999994},{"$f":"OFFSET('Taula Farratges'!$A$1,$C4,$AG$2,1,1)","v":599.16505599999994},{"$f":"OFFSET('Taula Farratges'!$A$1,$C4,$AH$2,1,1)","v":22.200000000000003},{"$f":"OFFSET('Taula Farratges'!$A$1,$C4,$AI$2,1,1)","v":311.3},{"$f":"OFFSET('Taula Farratges'!$A$1,$C4,$AJ$2,1,1)","v":584.20000000000005},{"$f":"OFFSET('Taula Farratges'!$A$1,$C4,$AK$2,1,1)","v":385},{"$f":"OFFSET('Taula Farratges'!$A$1,$C4,$AL$2,1,1)","v":0},{"$f":"OFFSET('Taula Farratges'!$A$1,$C4,$AM$2,1,1)","v":104},{"$f":"OFFSET('Taula Farratges'!$A$1,$C4,$AN$2,1,1)","v":0},{"$f":"OFFSET('Taula Farratges'!$A$1,$C4,$AO$2,1,1)","v":420.97955423500002},{"$f":"IF('II_Plantejar Ració'!$E5>0,IF(E4>0,1,\"No\"),\"\")","v":""},{"$f":"IF('II_Plantejar Ració'!$E5>0,IF(F4>0,1,\"No\"),\"\")","v":""},{"$f":"IF('II_Plantejar Ració'!$E5>0,IF(G4>0,1,\"No\"),\"\")","v":""},{"$f":"IF('II_Plantejar Ració'!$E5>0,IF(H4=0,\"No\",1),\"\")","v":""},{"$f":"IF('II_Plantejar Ració'!$E5>0,IF(AE4>0,1,\"No\"),\"\")","v":""},{"$f":"IF('II_Plantejar Ració'!$E5>0,IF(I4>0,1,\"No\"),\"\")","v":""},{"$f":"IF('II_Plantejar Ració'!$E5>0,IF(J4>0,1,\"No\"),\"\")","v":""},{"$f":"IF('II_Plantejar Ració'!$E5>0,IF(K4>0,1,\"No\"),\"\")","v":""},{"$f":"IF('II_Plantejar Ració'!$E5>0,IF(L4>0,1,\"No\"),\"\")","v":""},{"$f":"IF('II_Plantejar Ració'!$E5>0,IF(M4>0,1,\"No\"),\"\")","v":""},{"$f":"IF('II_Plantejar Ració'!$E5>0,IF(N4>0,1,\"No\"),\"\")","v":""},{"$f":"IF('II_Plantejar Ració'!$E5>0,IF(O4>0,1,\"No\"),\"\")","v":""},{"$f":"IF('II_Plantejar Ració'!$E5>0,IF(P4>0,1,\"No\"),\"\")","v":""},{"$f":"IF('II_Plantejar Ració'!$E5>0,IF(Q4>0,1,\"No\"),\"\")","v":""},{"$f":"IF('II_Plantejar Ració'!$E5>0,IF(R4>0,1,\"No\"),\"\")","v":""},{"$f":"IF('II_Plantejar Ració'!$E5>0,IF(S4>0,1,\"No\"),\"\")","v":""},{"$f":"IF('II_Plantejar Ració'!$E5>0,IF(T4>0,1,\"No\"),\"\")","v":""},{"$f":"IF('II_Plantejar Ració'!$E5>0,IF(U4>0,1,\"No\"),\"\")","v":""},{"$f":"IF('II_Plantejar Ració'!$E5>0,IF(V4>0,1,\"No\"),\"\")","v":""},{"$f":"IF('II_Plantejar Ració'!$E5>0,IF(W4>0,1,\"No\"),\"\")","v":""},{"$f":"IF('II_Plantejar Ració'!$E5>0,IF(X4>0,1,\"No\"),\"\")","v":""},{"$f":"IF('II_Plantejar Ració'!$E5>0,IF(Y4>0,1,\"No\"),\"\")","v":""},{"$f":"IF('II_Plantejar Ració'!$E5>0,IF(Z4>0,1,\"No\"),\"\")","v":""},{"$f":"IF('II_Plantejar Ració'!$E5>0,IF(AA4>0,1,\"No\"),\"\")","v":""},{"$f":"IF('II_Plantejar Ració'!$E5>0,IF(AB4>0,1,\"No\"),\"\")","v":""},{"$f":"IF('II_Plantejar Ració'!$E5>0,IF(AC4>0,1,\"No\"),\"\")","v":""},{"$f":"IF('II_Plantejar Ració'!$E5>0,IF(AD4>0,1,\"No\"),\"\")","v":""},{"$f":"IF('II_Plantejar Ració'!$E5>0,IF(AE4>0,1,\"No\"),\"\")","v":""},{"$f":"IF('II_Plantejar Ració'!$E5>0,IF(AF4>0,1,\"No\"),\"\")","v":""},{"$f":"IF('II_Plantejar Ració'!$E5>0,IF(AG4>0,1,\"No\"),\"\")","v":""},{"$f":"IF('II_Plantejar Ració'!$E5>0,IF(AH4>0,1,\"No\"),\"\")","v":""},{"$f":"IF('II_Plantejar Ració'!$E5>0,IF(AI4>0,1,\"No\"),\"\")","v":""},{"$f":"IF('II_Plantejar Ració'!$E5>0,IF(AJ4>0,1,\"No\"),\"\")","v":""},{"$f":"IF('II_Plantejar Ració'!$E5>0,IF(AK4>0,1,\"No\"),\"\")","v":""},{"$f":"IF('II_Plantejar Ració'!$E5>0,IF(AL4>0,1,\"No\"),\"\")","v":""},{"$f":"IF('II_Plantejar Ració'!$E5>0,IF(AM4>0,1,\"No\"),\"\")","v":""},{"$f":"IF(AP4=\"\",0,1)","v":0},{"$f":"IF(AQ4=\"\",0,1)","v":0},{"$f":"IF(AR4=\"\",0,1)","v":0},{"$f":"IF(AS4=\"\",0,1)","v":0},{"$f":"IF(AT4=\"\",0,1)","v":0},{"$f":"IF(AU4=\"\",0,1)","v":0},{"$f":"IF(AV4=\"\",0,1)","v":0},{"$f":"IF(AW4=\"\",0,1)","v":0},{"$f":"IF(AX4=\"\",0,1)","v":0},{"$f":"IF(AY4=\"\",0,1)","v":0},{"$f":"IF(AZ4=\"\",0,1)","v":0},{"$f":"IF(BA4=\"\",0,1)","v":0},{"$f":"IF(BB4=\"\",0,1)","v":0},{"$f":"IF(BC4=\"\",0,1)","v":0},{"$f":"IF(BD4=\"\",0,1)","v":0},{"$f":"IF(BE4=\"\",0,1)","v":0},{"$f":"IF(BF4=\"\",0,1)","v":0},{"$f":"IF(BG4=\"\",0,1)","v":0},{"$f":"IF(BH4=\"\",0,1)","v":0},{"$f":"IF(BI4=\"\",0,1)","v":0},{"$f":"IF(BJ4=\"\",0,1)","v":0},{"$f":"IF(BK4=\"\",0,1)","v":0},{"$f":"IF(BL4=\"\",0,1)","v":0},{"$f":"IF(BM4=\"\",0,1)","v":0},{"$f":"IF(BN4=\"\",0,1)","v":0},{"$f":"IF(BO4=\"\",0,1)","v":0},{"$f":"IF(BP4=\"\",0,1)","v":0},{"$f":"IF(BQ4=\"\",0,1)","v":0},{"$f":"IF(BR4=\"\",0,1)","v":0},{"$f":"IF(BS4=\"\",0,1)","v":0},{"$f":"IF(BT4=\"\",0,1)","v":0},{"$f":"IF(BU4=\"\",0,1)","v":0},{"$f":"IF(BV4=\"\",0,1)","v":0},{"$f":"IF(BW4=\"\",0,1)","v":0},{"$f":"IF(BX4=\"\",0,1)","v":0},{"$f":"IF(BY4=\"\",0,1)","v":0}]
[null,{"$f":"IF(OFFSET('Taula Farratges'!$A$1,C5,0,1,1)=0,\"\",OFFSET('Taula Farratges'!$A$1,C5,0,1,1))","v":"FENC Bromo Final vegetació"},55,{"$f":"OFFSET('Taula Farratges'!$A$1,$C5,$D$2,1,1)","v":85},{"$f":"OFFSET('Taula Farratges'!$A$1,$C5,$E$2,1,1)","v":1.4703700439119152},{"$f":"OFFSET('Taula Farratges'!$A$1,$C5,$F$2,1,1)","v":0.76419285183337515},{"$f":"OFFSET('Taula Farratges'!$A$1,$C5,$G$2,1,1)","v":58.493150019206396},{"$f":"OFFSET('Taula Farratges'!$A$1,$C5,$H$2,1,1)","v":-2.8767969050099929},{"$f":"OFFSET('Taula Farratges'!$A$1,$C5,$I$2,1,1)","v":3.1},{"$f":"OFFSET('Taula Farratges'!$A$1,$C5,$J$2,1,1)","v":2.9},{"$f":"OFFSET('Taula Farratges'!$A$1,$C5,$K$2,1,1)","v":0},{"$f":"OFFSET('Taula Farratges'!$A$1,$C5,$L$2,1,1)","v":0},{"$f":"OFFSET('Taula Farratges'!$A$1,$C5,$M$2,1,1)","v":0},{"$f":"OFFSET('Taula Farratges'!$A$1,$C5,$N$2,1,1)","v":0},{"$f":"OFFSET('Taula Farratges'!$A$1,$C5,$O$2,1,1)","v":0},{"$f":"OFFSET('Taula Farratges'!$A$1,$C5,$P$2,1,1)","v":0},{"$f":"OFFSET('Taula Farratges'!$A$1,$C5,$Q$2,1,1)","v":0},{"$f":"OFFSET('Taula Farratges'!$A$1,$C5,$R$2,1,1)","v":0},{"$f":"OFFSET('Taula Farratges'!$A$1,$C5,$S$2,1,1)","v":0},{"$f":"OFFSET('Taula Farratges'!$A$1,$C5,$T$2,1,1)","v":0},{"$f":"OFFSET('Taula Farratges'!$A$1,$C5,$U$2,1,1)","v":0},{"$f":"OFFSET('Taula Farratges'!$A$1,$C5,$V$2,1,1)","v":0},{"$f":"OFFSET('Taula Farratges'!$A$1,$C5,$W$2,1,1)","v":50000},{"$f":"OFFSET('Taula Farratges'!$A$1,$C5,$X$2,1,1)","v":50},{"$f":"OFFSET('Taula Farratges'!$A$1,$C5,$Y$2,1,1)","v":5},{"$f":"OFFSET('Taula Farratges'!$A$1,$C5,$Z$2,1,1)","v":15.93},{"$f":"OFFSET('Taula Farratges'!$A$1,$C5,$AA$2,1,1)","v":0.71},{"$f":"OFFSET('Taula Farratges'!$A$1,$C5,$AB$2,1,1)","v":0},{"$f":"OFFSET('Taula Farratges'!$A$1,$C5,$AC$2,1,1)","v":100},{"$f":"OFFSET('Taula Farratges'!$A$1,$C5,$AD$2,1,1)","v":20.3},{"$f":"OFFSET('Taula Farratges'!$A$1,$C5,$AE$2,1,1)","v":1.832722892363662},{"$f":"OFFSET('Taula Farratges'!$A$1,$C5,$AF$2,1,1)","v":0.62748999999999999},{"$f":"OFFSET('Taula Farratges'!$A$1,$C5,$AG$2,1,1)","v":564.74099999999999},{"$f":"OFFSET('Taula Farratges'!$A$1,$C5,$AH$2,1,1)","v":34},{"$f":"OFFSET('Taula Farratges'!$A$1,$C5,$AI$2,1,1)","v":320},{"$f":"OFFSET('Taula Farratges'!$A$1,$C5,$AJ$2,1,1)","v":640},{"$f":"OFFSET('Taula Farratges'!$A$1,$C5,$AK$2,1,1)","v":333},{"$f":"OFFSET('Taula Farratges'!$A$1,$C5,$AL$2,1,1)","v":0},{"$f":"OFFSET('Taula Farratges'!$A$1,$C5,$AM$2,1,1)","v":100},{"$f":"OFFSET('Taula Farratges'!$A$1,$C5,$AN$2,1,1)","v":0},{"$f":"OFFSET('Taula Farratges'!$A$1,$C5,$AO$2,1,1)","v":494.54585790000004},{"$f":"IF('II_Plantejar Ració'!$E6>0,IF(E5>0,1,\"No\"),\"\")","v":""},{"$f":"IF('II_Plantejar Ració'!$E6>0,IF(F5>0,1,\"No\"),\"\")","v":""},{"$f":"IF('II_Plantejar Ració'!$E6>0,IF(G5>0,1,\"No\"),\"\")","v":""},{"$f":"IF('II_Plantejar Ració'!$E6>0,IF(H5=0,\"No\",1),\"\")","v":""},{"$f":"IF('II_Plantejar Ració'!$E6>0,IF(AE5>0,1,\"No\"),\"\")","v":""},{"$f":"IF('II_Plantejar Ració'!$E6>0,IF(I5>0,1,\"No\"),\"\")","v":""},{"$f":"IF('II_Plantejar Ració'!$E6>0,IF(J5>0,1,\"No\"),\"\")","v":""},{"$f":"IF('II_Plantejar Ració'!$E6>0,IF(K5>0,1,\"No\"),\"\")","v":""},{"$f":"IF('II_Plantejar Ració'!$E6>0,IF(L5>0,1,\"No\"),\"\")","v":""},{"$f":"IF('II_Plantejar Ració'!$E6>0,IF(M5>0,1,\"No\"),\"\")","v":""},{"$f":"IF('II_Plantejar Ració'!$E6>0,IF(N5>0,1,\"No\"),\"\")","v":""},{"$f":"IF('II_Plantejar Ració'!$E6>0,IF(O5>0,1,\"No\"),\"\")","v":""},{"$f":"IF('II_Plantejar Ració'!$E6>0,IF(P5>0,1,\"No\"),\"\")","v":""},{"$f":"IF('II_Plantejar Ració'!$E6>0,IF(Q5>0,1,\"No\"),\"\")","v":""},{"$f":"IF('II_Plantejar Ració'!$E6>0,IF(R5>0,1,\"No\"),\"\")","v":""},{"$f":"IF('II_Plantejar Ració'!$E6>0,IF(S5>0,1,\"No\"),\"\")","v":""},{"$f":"IF('II_Plantejar Ració'!$E6>0,IF(T5>0,1,\"No\"),\"\")","v":""},{"$f":"IF('II_Plantejar Ració'!$E6>0,IF(U5>0,1,\"No\"),\"\")","v":""},{"$f":"IF('II_Plantejar Ració'!$E6>0,IF(V5>0,1,\"No\"),\"\")","v":""},{"$f":"IF('II_Plantejar Ració'!$E6>0,IF(W5>0,1,\"No\"),\"\")","v":""},{"$f":"IF('II_Plantejar Ració'!$E6>0,IF(X5>0,1,\"No\"),\"\")","v":""},{"$f":"IF('II_Plantejar Ració'!$E6>0,IF(Y5>0,1,\"No\"),\"\")","v":""},{"$f":"IF('II_Plantejar Ració'!$E6>0,IF(Z5>0,1,\"No\"),\"\")","v":""},{"$f":"IF('II_Plantejar Ració'!$E6>0,IF(AA5>0,1,\"No\"),\"\")","v":""},{"$f":"IF('II_Plantejar Ració'!$E6>0,IF(AB5>0,1,\"No\"),\"\")","v":""},{"$f":"IF('II_Plantejar Ració'!$E6>0,IF(AC5>0,1,\"No\"),\"\")","v":""},{"$f":"IF('II_Plantejar Ració'!$E6>0,IF(AD5>0,1,\"No\"),\"\")","v":""},{"$f":"IF('II_Plantejar Ració'!$E6>0,IF(AE5>0,1,\"No\"),\"\")","v":""},{"$f":"IF('II_Plantejar Ració'!$E6>0,IF(AF5>0,1,\"No\"),\"\")","v":""},{"$f":"IF('II_Plantejar Ració'!$E6>0,IF(AG5>0,1,\"No\"),\"\")","v":""},{"$f":"IF('II_Plantejar Ració'!$E6>0,IF(AH5>0,1,\"No\"),\"\")","v":""},{"$f":"IF('II_Plantejar Ració'!$E6>0,IF(AI5>0,1,\"No\"),\"\")","v":""},{"$f":"IF('II_Plantejar Ració'!$E6>0,IF(AJ5>0,1,\"No\"),\"\")","v":""},{"$f":"IF('II_Plantejar Ració'!$E6>0,IF(AK5>0,1,\"No\"),\"\")","v":""},{"$f":"IF('II_Plantejar Ració'!$E6>0,IF(AL5>0,1,\"No\"),\"\")","v":""},{"$f":"IF('II_Plantejar Ració'!$E6>0,IF(AM5>0,1,\"No\"),\"\")","v":""},0,0,0,0,0,0,0,0,0,0,0,0,0,0,0,0,0,0,0,0,0,0,0,0,0,0,0,0,0,0,0,0,0,0,0,0]
[null,{"$f":"IF(OFFSET('Taula Farratges'!$A$1,C6,0,1,1)=0,\"\",OFFSET('Taula Farratges'!$A$1,C6,0,1,1))","v":""},1,{"$f":"OFFSET('Taula Farratges'!$A$1,$C6,$D$2,1,1)","v":0},{"$f":"OFFSET('Taula Farratges'!$A$1,$C6,$E$2,1,1)","v":0},{"$f":"OFFSET('Taula Farratges'!$A$1,$C6,$F$2,1,1)","v":0},{"$f":"OFFSET('Taula Farratges'!$A$1,$C6,$G$2,1,1)","v":0},{"$f":"OFFSET('Taula Farratges'!$A$1,$C6,$H$2,1,1)","v":0},{"$f":"OFFSET('Taula Farratges'!$A$1,$C6,$I$2,1,1)","v":0},{"$f":"OFFSET('Taula Farratges'!$A$1,$C6,$J$2,1,1)","v":0},{"$f":"OFFSET('Taula Farratges'!$A$1,$C6,$K$2,1,1)","v":0},{"$f":"OFFSET('Taula Farratges'!$A$1,$C6,$L$2,1,1)","v":0},{"$f":"OFFSET('Taula Farratges'!$A$1,$C6,$M$2,1,1)","v":0},{"$f":"OFFSET('Taula Farratges'!$A$1,$C6,$N$2,1,1)","v":0},{"$f":"OFFSET('Taula Farratges'!$A$1,$C6,$O$2,1,1)","v":0},{"$f":"OFFSET('Taula Farratges'!$A$1,$C6,$P$2,1,1)","v":0},{"$f":"OFFSET('Taula Farratges'!$A$1,$C6,$Q$2,1,1)","v":0},{"$f":"OFFSET('Taula Farratges'!$A$1,$C6,$R$2,1,1)","v":0},{"$f":"OFFSET('Taula Farratges'!$A$1,$C6,$S$2,1,1)","v":0},{"$f":"OFFSET('Taula Farratges'!$A$1,$C6,$T$2,1,1)","v":0},{"$f":"OFFSET('Taula Farratges'!$A$1,$C6,$U$2,1,1)","v":0},{"$f":"OFFSET('Taula Farratges'!$A$1,$C6,$V$2,1,1)","v":0},{"$f":"OFFSET('Taula Farratges'!$A$1,$C6,$W$2,1,1)","v":0},{"$f":"OFFSET('Taula Farratges'!$A$1,$C6,$X$2,1,1)","v":0},{"$f":"OFFSET('Taula Farratges'!$A$1,$C6,$Y$2,1,1)","v":0},{"$f":"OFFSET('Taula Farratges'!$A$1,$C6,$Z$2,1,1)","v":0},{"$f":"OFFSET('Taula Farratges'!$A$1,$C6,$AA$2,1,1)","v":0},{"$f":"OFFSET('Taula Farratges'!$A$1,$C6,$AB$2,1,1)","v":0},{"$f":"OFFSET('Taula Farratges'!$A$1,$C6,$AC$2,1,1)","v":0},{"$f":"OFFSET('Taula Farratges'!$A$1,$C6,$AD$2,1,1)","v":0},{"$f":"OFFSET('Taula Farratges'!$A$1,$C6,$AE$2,1,1)","v":0},{"$f":"OFFSET('Taula Farratges'!$A$1,$C6,$AF$2,1,1)","v":0},{"$f":"OFFSET('Taula Farratges'!$A$1,$C6,$AG$2,1,1)","v":0},{"$f":"OFFSET('Taula Farratges'!$A$1,$C6,$AH$2,1,1)","v":0},{"$f":"OFFSET('Taula Farratges'!$A$1,$C6,$AI$2,1,1)","v":0},{"$f":"OFFSET('Taula Farratges'!$A$1,$C6,$AJ$2,1,1)","v":0},{"$f":"OFFSET('Taula Farratges'!$A$1,$C6,$AK$2,1,1)","v":0},{"$f":"OFFSET('Taula Farratges'!$A$1,$C6,$AL$2,1,1)","v":0},{"$f":"OFFSET('Taula Farratges'!$A$1,$C6,$AM$2,1,1)","v":0},{"$f":"OFFSET('Taula Farratges'!$A$1,$C6,$AN$2,1,1)","v":0},{"$f":"OFFSET('Taula Farratges'!$A$1,$C6,$AO$2,1,1)","v":0},{"$f":"IF('II_Plantejar Ració'!$E7>0,IF(E6>0,1,\"No\"),\"\")","v":""},{"$f":"IF('II_Plantejar Ració'!$E7>0,IF(F6>0,1,\"No\"),\"\")","v":""},{"$f":"IF('II_Plantejar Ració'!$E7>0,IF(G6>0,1,\"No\"),\"\")","v":""},{"$f":"IF('II_Plantejar Ració'!$E7>0,IF(H6=0,\"No\",1),\"\")","v":""},{"$f":"IF('II_Plantejar Ració'!$E7>0,IF(AE6>0,1,\"No\"),\"\")","v":""},{"$f":"IF('II_Plantejar Ració'!$E7>0,IF(I6>0,1,\"No\"),\"\")","v":""},{"$f":"IF('II_Plantejar Ració'!$E7>0,IF(J6>0,1,\"No\"),\"\")","v":""},{"$f":"IF('II_Plantejar Ració'!$E7>0,IF(K6>0,1,\"No\"),\"\")","v":""},{"$f":"IF('II_Plantejar Ració'!$E7>0,IF(L6>0,1,\"No\"),\"\")","v":""},{"$f":"IF('II_Plantejar Ració'!$E7>0,IF(M6>0,1,\"No\"),\"\")","v":""},{"$f":"IF('II_Plantejar Ració'!$E7>0,IF(N6>0,1,\"No\"),\"\")","v":""},{"$f":"IF('II_Plantejar Ració'!$E7>0,IF(O6>0,1,\"No\"),\"\")","v":""},{"$f":"IF('II_Plantejar Ració'!$E7>0,IF(P6>0,1,\"No\"),\"\")","v":""},{"$f":"IF('II_Plantejar Ració'!$E7>0,IF(Q6>0,1,\"No\"),\"\")","v":""},{"$f":"IF('II_Plantejar Ració'!$E7>0,IF(R6>0,1,\"No\"),\"\")","v":""},{"$f":"IF('II_Plantejar Ració'!$E7>0,IF(S6>0,1,\"No\"),\"\")","v":""},{"$f":"IF('II_Plantejar Ració'!$E7>0,IF(T6>0,1,\"No\"),\"\")","v":""},{"$f":"IF('II_Plantejar Ració'!$E7>0,IF(U6>0,1,\"No\"),\"\")","v":""},{"$f":"IF('II_Plantejar Ració'!$E7>0,IF(V6>0,1,\"No\"),\"\")","v":""},{"$f":"IF('II_Plantejar Ració'!$E7>0,IF(W6>0,1,\"No\"),\"\")","v":""},{"$f":"IF('II_Plantejar Ració'!$E7>0,IF(X6>0,1,\"No\"),\"\")","v":""},{"$f":"IF('II_Plantejar Ració'!$E7>0,IF(Y6>0,1,\"No\"),\"\")","v":""},{"$f":"IF('II_Plantejar Ració'!$E7>0,IF(Z6>0,1,\"No\"),\"\")","v":""},{"$f":"IF('II_Plantejar Ració'!$E7>0,IF(AA6>0,1,\"No\"),\"\")","v":""},{"$f":"IF('II_Plantejar Ració'!$E7>0,IF(AB6>0,1,\"No\"),\"\")","v":""},{"$f":"IF('II_Plantejar Ració'!$E7>0,IF(AC6>0,1,\"No\"),\"\")","v":""},{"$f":"IF('II_Plantejar Ració'!$E7>0,IF(AD6>0,1,\"No\"),\"\")","v":""},{"$f":"IF('II_Plantejar Ració'!$E7>0,IF(AE6>0,1,\"No\"),\"\")","v":""},{"$f":"IF('II_Plantejar Ració'!$E7>0,IF(AF6>0,1,\"No\"),\"\")","v":""},{"$f":"IF('II_Plantejar Ració'!$E7>0,IF(AG6>0,1,\"No\"),\"\")","v":""},{"$f":"IF('II_Plantejar Ració'!$E7>0,IF(AH6>0,1,\"No\"),\"\")","v":""},{"$f":"IF('II_Plantejar Ració'!$E7>0,IF(AI6>0,1,\"No\"),\"\")","v":""},{"$f":"IF('II_Plantejar Ració'!$E7>0,IF(AJ6>0,1,\"No\"),\"\")","v":""},{"$f":"IF('II_Plantejar Ració'!$E7>0,IF(AK6>0,1,\"No\"),\"\")","v":""},{"$f":"IF('II_Plantejar Ració'!$E7>0,IF(AL6>0,1,\"No\"),\"\")","v":""},{"$f":"IF('II_Plantejar Ració'!$E7>0,IF(AM6>0,1,\"No\"),\"\")","v":""},0,0,0,0,0,0,0,0,0,0,0,0,0,0,0,0,0,0,0,0,0,0,0,0,0,0,0,0,0,0,0,0,0,0,0,0]
[null,{"$f":"IF(OFFSET('Taula Farratges'!$A$1,C7,0,1,1)=0,\"\",OFFSET('Taula Farratges'!$A$1,C7,0,1,1))","v":""},1,{"$f":"OFFSET('Taula Farratges'!$A$1,$C7,$D$2,1,1)","v":0},{"$f":"OFFSET('Taula Farratges'!$A$1,$C7,$E$2,1,1)","v":0},{"$f":"OFFSET('Taula Farratges'!$A$1,$C7,$F$2,1,1)","v":0},{"$f":"OFFSET('Taula Farratges'!$A$1,$C7,$G$2,1,1)","v":0},{"$f":"OFFSET('Taula Farratges'!$A$1,$C7,$H$2,1,1)","v":0},{"$f":"OFFSET('Taula Farratges'!$A$1,$C7,$I$2,1,1)","v":0},{"$f":"OFFSET('Taula Farratges'!$A$1,$C7,$J$2,1,1)","v":0},{"$f":"OFFSET('Taula Farratges'!$A$1,$C7,$K$2,1,1)","v":0},{"$f":"OFFSET('Taula Farratges'!$A$1,$C7,$L$2,1,1)","v":0},{"$f":"OFFSET('Taula Farratges'!$A$1,$C7,$M$2,1,1)","v":0},{"$f":"OFFSET('Taula Farratges'!$A$1,$C7,$N$2,1,1)","v":0},{"$f":"OFFSET('Taula Farratges'!$A$1,$C7,$O$2,1,1)","v":0},{"$f":"OFFSET('Taula Farratges'!$A$1,$C7,$P$2,1,1)","v":0},{"$f":"OFFSET('Taula Farratges'!$A$1,$C7,$Q$2,1,1)","v":0},{"$f":"OFFSET('Taula Farratges'!$A$1,$C7,$R$2,1,1)","v":0},{"$f":"OFFSET('Taula Farratges'!$A$1,$C7,$S$2,1,1)","v":0},{"$f":"OFFSET('Taula Farratges'!$A$1,$C7,$T$2,1,1)","v":0},{"$f":"OFFSET('Taula Farratges'!$A$1,$C7,$U$2,1,1)","v":0},{"$f":"OFFSET('Taula Farratges'!$A$1,$C7,$V$2,1,1)","v":0},{"$f":"OFFSET('Taula Farratges'!$A$1,$C7,$W$2,1,1)","v":0},{"$f":"OFFSET('Taula Farratges'!$A$1,$C7,$X$2,1,1)","v":0},{"$f":"OFFSET('Taula Farratges'!$A$1,$C7,$Y$2,1,1)","v":0},{"$f":"OFFSET('Taula Farratges'!$A$1,$C7,$Z$2,1,1)","v":0},{"$f":"OFFSET('Taula Farratges'!$A$1,$C7,$AA$2,1,1)","v":0},{"$f":"OFFSET('Taula Farratges'!$A$1,$C7,$AB$2,1,1)","v":0},{"$f":"OFFSET('Taula Farratges'!$A$1,$C7,$AC$2,1,1)","v":0},{"$f":"OFFSET('Taula Farratges'!$A$1,$C7,$AD$2,1,1)","v":0},{"$f":"OFFSET('Taula Farratges'!$A$1,$C7,$AE$2,1,1)","v":0},{"$f":"OFFSET('Taula Farratges'!$A$1,$C7,$AF$2,1,1)","v":0},{"$f":"OFFSET('Taula Farratges'!$A$1,$C7,$AG$2,1,1)","v":0},{"$f":"OFFSET('Taula Farratges'!$A$1,$C7,$AH$2,1,1)","v":0},{"$f":"OFFSET('Taula Farratges'!$A$1,$C7,$AI$2,1,1)","v":0},{"$f":"OFFSET('Taula Farratges'!$A$1,$C7,$AJ$2,1,1)","v":0},{"$f":"OFFSET('Taula Farratges'!$A$1,$C7,$AK$2,1,1)","v":0},{"$f":"OFFSET('Taula Farratges'!$A$1,$C7,$AL$2,1,1)","v":0},{"$f":"OFFSET('Taula Farratges'!$A$1,$C7,$AM$2,1,1)","v":0},{"$f":"OFFSET('Taula Farratges'!$A$1,$C7,$AN$2,1,1)","v":0},{"$f":"OFFSET('Taula Farratges'!$A$1,$C7,$AO$2,1,1)","v":0},{"$f":"IF('II_Plantejar Ració'!$E8>0,IF(E7>0,1,\"No\"),\"\")","v":""},{"$f":"IF('II_Plantejar Ració'!$E8>0,IF(F7>0,1,\"No\"),\"\")","v":""},{"$f":"IF('II_Plantejar Ració'!$E8>0,IF(G7>0,1,\"No\"),\"\")","v":""},{"$f":"IF('II_Plantejar Ració'!$E8>0,IF(H7=0,\"No\",1),\"\")","v":""},{"$f":"IF('II_Plantejar Ració'!$E8>0,IF(AE7>0,1,\"No\"),\"\")","v":""},{"$f":"IF('II_Plantejar Ració'!$E8>0,IF(I7>0,1,\"No\"),\"\")","v":""},{"$f":"IF('II_Plantejar Ració'!$E8>0,IF(J7>0,1,\"No\"),\"\")","v":""},{"$f":"IF('II_Plantejar Ració'!$E8>0,IF(K7>0,1,\"No\"),\"\")","v":""},{"$f":"IF('II_Plantejar Ració'!$E8>0,IF(L7>0,1,\"No\"),\"\")","v":""},{"$f":"IF('II_Plantejar Ració'!$E8>0,IF(M7>0,1,\"No\"),\"\")","v":""},{"$f":"IF('II_Plantejar Ració'!$E8>0,IF(N7>0,1,\"No\"),\"\")","v":""},{"$f":"IF('II_Plantejar Ració'!$E8>0,IF(O7>0,1,\"No\"),\"\")","v":""},{"$f":"IF('II_Plantejar Ració'!$E8>0,IF(P7>0,1,\"No\"),\"\")","v":""},{"$f":"IF('II_Plantejar Ració'!$E8>0,IF(Q7>0,1,\"No\"),\"\")","v":""},{"$f":"IF('II_Plantejar Ració'!$E8>0,IF(R7>0,1,\"No\"),\"\")","v":""},{"$f":"IF('II_Plantejar Ració'!$E8>0,IF(S7>0,1,\"No\"),\"\")","v":""},{"$f":"IF('II_Plantejar Ració'!$E8>0,IF(T7>0,1,\"No\"),\"\")","v":""},{"$f":"IF('II_Plantejar Ració'!$E8>0,IF(U7>0,1,\"No\"),\"\")","v":""},{"$f":"IF('II_Plantejar Ració'!$E8>0,IF(V7>0,1,\"No\"),\"\")","v":""},{"$f":"IF('II_Plantejar Ració'!$E8>0,IF(W7>0,1,\"No\"),\"\")","v":""},{"$f":"IF('II_Plantejar Ració'!$E8>0,IF(X7>0,1,\"No\"),\"\")","v":""},{"$f":"IF('II_Plantejar Ració'!$E8>0,IF(Y7>0,1,\"No\"),\"\")","v":""},{"$f":"IF('II_Plantejar Ració'!$E8>0,IF(Z7>0,1,\"No\"),\"\")","v":""},{"$f":"IF('II_Plantejar Ració'!$E8>0,IF(AA7>0,1,\"No\"),\"\")","v":""},{"$f":"IF('II_Plantejar Ració'!$E8>0,IF(AB7>0,1,\"No\"),\"\")","v":""},{"$f":"IF('II_Plantejar Ració'!$E8>0,IF(AC7>0,1,\"No\"),\"\")","v":""},{"$f":"IF('II_Plantejar Ració'!$E8>0,IF(AD7>0,1,\"No\"),\"\")","v":""},{"$f":"IF('II_Plantejar Ració'!$E8>0,IF(AE7>0,1,\"No\"),\"\")","v":""},{"$f":"IF('II_Plantejar Ració'!$E8>0,IF(AF7>0,1,\"No\"),\"\")","v":""},{"$f":"IF('II_Plantejar Ració'!$E8>0,IF(AG7>0,1,\"No\"),\"\")","v":""},{"$f":"IF('II_Plantejar Ració'!$E8>0,IF(AH7>0,1,\"No\"),\"\")","v":""},{"$f":"IF('II_Plantejar Ració'!$E8>0,IF(AI7>0,1,\"No\"),\"\")","v":""},{"$f":"IF('II_Plantejar Ració'!$E8>0,IF(AJ7>0,1,\"No\"),\"\")","v":""},{"$f":"IF('II_Plantejar Ració'!$E8>0,IF(AK7>0,1,\"No\"),\"\")","v":""},{"$f":"IF('II_Plantejar Ració'!$E8>0,IF(AL7>0,1,\"No\"),\"\")","v":""},{"$f":"IF('II_Plantejar Ració'!$E8>0,IF(AM7>0,1,\"No\"),\"\")","v":""},0,0,0,0,0,0,0,0,0,0,0,0,0,0,0,0,0,0,0,0,0,0,0,0,0,0,0,0,0,0,0,0,0,0,0,0]
["CONCENTRATS",{"$f":"IF(OFFSET('Taula Concentrats'!$A$1,C8,0,1,1)=0,\"\",OFFSET('Taula Concentrats'!$A$1,C8,0,1,1))","v":"Ordi gra"},2,{"$f":"OFFSET('Taula Concentrats'!$A$1,$C8,$D$2,1,1)","v":87.2},{"$f":"OFFSET('Taula Concentrats'!$A$1,$C8,$E$2,1,1)","v":0},{"$f":"OFFSET('Taula Concentrats'!$A$1,$C8,$F$2,1,1)","v":1.0789699893040996},{"$f":"OFFSET('Taula Concentrats'!$A$1,$C8,$G$2,1,1)","v":89.462201893951999},{"$f":"OFFSET('Taula Concentrats'!$A$1,$C8,$H$2,1,1)","v":-31.347374120000008},{"$f":"OFFSET('Taula Concentrats'!$A$1,$C8,$I$2,1,1)","v":0.8},{"$f":"OFFSET('Taula Concentrats'!$A$1,$C8,$J$2,1,1)","v":3.9},{"$f":"OFFSET('Taula Concentrats'!$A$1,$C8,$K$2,1,1)","v":1.3},{"$f":"OFFSET('Taula Concentrats'!$A$1,$C8,$L$2,1,1)","v":5.55},{"$f":"OFFSET('Taula Concentrats'!$A$1,$C8,$M$2,1,1)","v":0.35},{"$f":"OFFSET('Taula Concentrats'!$A$1,$C8,$N$2,1,1)","v":0},{"$f":"OFFSET('Taula Concentrats'!$A$1,$C8,$O$2,1,1)","v":0},{"$f":"OFFSET('Taula Concentrats'!$A$1,$C8,$P$2,1,1)","v":90},{"$f":"OFFSET('Taula Concentrats'!$A$1,$C8,$Q$2,1,1)","v":0.01},{"$f":"OFFSET('Taula Concentrats'!$A$1,$C8,$R$2,1,1)","v":4.0999999999999996},{"$f":"OFFSET('Taula Concentrats'!$A$1,$C8,$S$2,1,1)","v":17.600000000000001},{"$f":"OFFSET('Taula Concentrats'!$A$1,$C8,$T$2,1,1)","v":24.4},{"$f":"OFFSET('Taula Concentrats'!$A$1,$C8,$U$2,1,1)","v":0},{"$f":"OFFSET('Taula Concentrats'!$A$1,$C8,$V$2,1,1)","v":0.02},{"$f":"OFFSET('Taula Concentrats'!$A$1,$C8,$W$2,1,1)","v":1000},{"$f":"OFFSET('Taula Concentrats'!$A$1,$C8,$X$2,1,1)","v":0},{"$f":"OFFSET('Taula Concentrats'!$A$1,$C8,$Y$2,1,1)","v":25},{"$f":"OFFSET('Taula Concentrats'!$A$1,$C8,$Z$2,1,1)","v":14.25},{"$f":"OFFSET('Taula Concentrats'!$A$1,$C8,$AA$2,1,1)","v":0.73492599485689536},{"$f":"OFFSET('Taula Concentrats'!$A$1,$C8,$AB$2,1,1)","v":0.92949387723999977},{"$f":"OFFSET('Taula Concentrats'!$A$1,$C8,$AC$2,1,1)","v":112},{"$f":"OFFSET('Taula Concentrats'!$A$1,$C8,$AD$2,1,1)","v":27.595082457151996},{"$f":"OFFSET('Taula Concentrats'!$A$1,$C8,$AE$2,1,1)","v":2},{"$f":"OFFSET('Taula Concentrats'!$A$1,$C8,$AF$2,1,1)","v":0.83732799999999996},{"$f":"OFFSET('Taula Concentrats'!$A$1,$C8,$AG$2,1,1)","v":816.39479999999992},{"$f":"OFFSET('Taula Concentrats'!$A$1,$C8,$AH$2,1,1)","v":19},{"$f":"OFFSET('Taula Concentrats'!$A$1,$C8,$AI$2,1,1)","v":54},{"$f":"OFFSET('Taula Concentrats'!$A$1,$C8,$AJ$2,1,1)","v":215},{"$f":"OFFSET('Taula Concentrats'!$A$1,$C8,$AK$2,1,1)","v":65},{"$f":"OFFSET('Taula Concentrats'!$A$1,$C8,$AL$2,1,1)","v":12},{"$f":"OFFSET('Taula Concentrats'!$A$1,$C8,$AM$2,1,1)","v":25},{"$f":"OFFSET('Taula Concentrats'!$A$1,$C8,$AN$2,1,1)","v":0.3},{"$f":"OFFSET('Taula Farratges'!$A$1,$C8,$AO$2,1,1)","v":566.53268820000017},{"$f":"IF('II_Plantejar Ració'!$E9>0,IF(E8>=0,1,\"No\"),\"\")","v":""},{"$f":"IF('II_Plantejar Ració'!$E9>0,IF(F8>0,1,\"No\"),\"\")","v":""},{"$f":"IF('II_Plantejar Ració'!$E9>0,IF(G8>0,1,\"No\"),\"\")","v":""},{"$f":"IF('II_Plantejar Ració'!$E9>0,IF(H8=0,\"No\",1),\"\")","v":""},{"$f":"IF('II_Plantejar Ració'!$E9>0,IF(AE8>0,1,\"No\"),\"\")","v":""},{"$f":"IF('II_Plantejar Ració'!$E9>0,IF(I8>0,1,\"No\"),\"\")","v":""},{"$f":"IF('II_Plantejar Ració'!$E9>0,IF(J8>0,1,\"No\"),\"\")","v":""},{"$f":"IF('II_Plantejar Ració'!$E9>0,IF(K8>0,1,\"No\"),\"\")","v":""},{"$f":"IF('II_Plantejar Ració'!$E9>0,IF(L8>0,1,\"No\"),\"\")","v":""},{"$f":"IF('II_Plantejar Ració'!$E9>0,IF(M8>0,1,\"No\"),\"\")","v":""},{"$f":"IF('II_Plantejar Ració'!$E9>0,IF(N8>0,1,\"No\"),\"\")","v":""},{"$f":"IF('II_Plantejar Ració'!$E9>0,IF(O8>0,1,\"No\"),\"\")","v":""},{"$f":"IF('II_Plantejar Ració'!$E9>0,IF(P8>0,1,\"No\"),\"\")","v":""},{"$f":"IF('II_Plantejar Ració'!$E9>0,IF(Q8>0,1,\"No\"),\"\")","v":""},{"$f":"IF('II_Plantejar Ració'!$E9>0,IF(R8>0,1,\"No\"),\"\")","v":""},{"$f":"IF('II_Plantejar Ració'!$E9>0,IF(S8>0,1,\"No\"),\"\")","v":""},{"$f":"IF('II_Plantejar Ració'!$E9>0,IF(T8>0,1,\"No\"),\"\")","v":""},{"$f":"IF('II_Plantejar Ració'!$E9>0,IF(U8>0,1,\"No\"),\"\")","v":""},{"$f":"IF('II_Plantejar Ració'!$E9>0,IF(V8>0,1,\"No\"),\"\")","v":""},{"$f":"IF('II_Plantejar Ració'!$E9>0,IF(W8>0,1,\"No\"),\"\")","v":""},{"$f":"IF('II_Plantejar Ració'!$E9>0,IF(X8>0,1,\"No\"),\"\")","v":""},{"$f":"IF('II_Plantejar Ració'!$E9>0,IF(Y8>0,1,\"No\"),\"\")","v":""},{"$f":"IF('II_Plantejar Ració'!$E9>0,IF(Z8>0,1,\"No\"),\"\")","v":""},{"$f":"IF('II_Plantejar Ració'!$E9>0,IF(AA8>0,1,\"No\"),\"\")","v":""},{"$f":"IF('II_Plantejar Ració'!$E9>0,IF(AB8>0,1,\"No\"),\"\")","v":""},{"$f":"IF('II_Plantejar Ració'!$E9>0,IF(AC8>0,1,\"No\"),\"\")","v":""},{"$f":"IF('II_Plantejar Ració'!$E9>0,IF(AD8>0,1,\"No\"),\"\")","v":""},{"$f":"IF('II_Plantejar Ració'!$E9>0,IF(AE8>0,1,\"No\"),\"\")","v":""},{"$f":"IF('II_Plantejar Ració'!$E9>0,IF(AF8>0,1,\"No\"),\"\")","v":""},{"$f":"IF('II_Plantejar Ració'!$E9>0,IF(AG8>0,1,\"No\"),\"\")","v":""},{"$f":"IF('II_Plantejar Ració'!$E9>0,IF(AH8>0,1,\"No\"),\"\")","v":""},{"$f":"IF('II_Plantejar Ració'!$E9>0,IF(AI8>0,1,\"No\"),\"\")","v":""},{"$f":"IF('II_Plantejar Ració'!$E9>0,IF(AJ8>0,1,\"No\"),\"\")","v":""},{"$f":"IF('II_Plantejar Ració'!$E9>0,IF(AK8>0,1,\"No\"),\"\")","v":""},{"$f":"IF('II_Plantejar Ració'!$E9>0,IF(AL8>0,1,\"No\"),\"\")","v":""},{"$f":"IF('II_Plantejar Ració'!$E9>0,IF(AM8>0,1,\"No\"),\"\")","v":""},0,0,0,0,0,0,0,0,0,0,0,0,0,0,0,0,0,0,0,0,0,0,0,0,0,0,0,0,0,0,0,0,0,0,0,0]
[null,{"$f":"IF(OFFSET('Taula Concentrats'!$A$1,C9,0,1,1)=0,\"\",OFFSET('Taula Concentrats'!$A$1,C9,0,1,1))","v":"Blat de moro gra"},3,{"$f":"OFFSET('Taula Concentrats'!$A$1,$C9,$D$2,1,1)","v":86},{"$f":"OFFSET('Taula Concentrats'!$A$1,$C9,$E$2,1,1)","v":0},{"$f":"OFFSET('Taula Concentrats'!$A$1,$C9,$F$2,1,1)","v":1.2447554097468898},{"$f":"OFFSET('Taula Concentrats'!$A$1,$C9,$G$2,1,1)","v":100.70571645287278},{"$f":"OFFSET('Taula Concentrats'!$A$1,$C9,$H$2,1,1)","v":-70.144731616400009},{"$f":"OFFSET('Taula Concentrats'!$A$1,$C9,$I$2,1,1)","v":0.5},{"$f":"OFFSET('Taula Concentrats'!$A$1,$C9,$J$2,1,1)","v":2.9},{"$f":"OFFSET('Taula Concentrats'!$A$1,$C9,$K$2,1,1)","v":1.4},{"$f":"OFFSET('Taula Concentrats'!$A$1,$C9,$L$2,1,1)","v":3.6},{"$f":"OFFSET('Taula Concentrats'!$A$1,$C9,$M$2,1,1)","v":0.33},{"$f":"OFFSET('Taula Concentrats'!$A$1,$C9,$N$2,1,1)","v":0},{"$f":"OFFSET('Taula Concentrats'!$A$1,$C9,$O$2,1,1)","v":0},{"$f":"OFFSET('Taula Concentrats'!$A$1,$C9,$P$2,1,1)","v":80},{"$f":"OFFSET('Taula Concentrats'!$A$1,$C9,$Q$2,1,1)","v":0.02},{"$f":"OFFSET('Taula Concentrats'!$A$1,$C9,$R$2,1,1)","v":2.2999999999999998},{"$f":"OFFSET('Taula Concentrats'!$A$1,$C9,$S$2,1,1)","v":10.8},{"$f":"OFFSET('Taula Concentrats'!$A$1,$C9,$T$2,1,1)","v":21.4},{"$f":"OFFSET('Taula Concentrats'!$A$1,$C9,$U$2,1,1)","v":0},{"$f":"OFFSET('Taula Concentrats'!$A$1,$C9,$V$2,1,1)","v":0.02},{"$f":"OFFSET('Taula Concentrats'!$A$1,$C9,$W$2,1,1)","v":0},{"$f":"OFFSET('Taula Concentrats'!$A$1,$C9,$X$2,1,1)","v":0},{"$f":"OFFSET('Taula Concentrats'!$A$1,$C9,$Y$2,1,1)","v":0},{"$f":"OFFSET('Taula Concentrats'!$A$1,$C9,$Z$2,1,1)","v":36.549999999999997},{"$f":"OFFSET('Taula Concentrats'!$A$1,$C9,$AA$2,1,1)","v":0.50925139963862587},{"$f":"OFFSET('Taula Concentrats'!$A$1,$C9,$AB$2,1,1)","v":0.87300444668280008},{"$f":"OFFSET('Taula Concentrats'!$A$1,$C9,$AC$2,1,1)","v":89},{"$f":"OFFSET('Taula Concentrats'!$A$1,$C9,$AD$2,1,1)","v":38.129888218376763},{"$f":"OFFSET('Taula Concentrats'!$A$1,$C9,$AE$2,1,1)","v":2},{"$f":"OFFSET('Taula Concentrats'!$A$1,$C9,$AF$2,1,1)","v":0.88284600000000013},{"$f":"OFFSET('Taula Concentrats'!$A$1,$C9,$AG$2,1,1)","v":870.48615600000005},{"$f":"OFFSET('Taula Concentrats'!$A$1,$C9,$AH$2,1,1)","v":43},{"$f":"OFFSET('Taula Concentrats'!$A$1,$C9,$AI$2,1,1)","v":26},{"$f":"OFFSET('Taula Concentrats'!$A$1,$C9,$AJ$2,1,1)","v":125},{"$f":"OFFSET('Taula Concentrats'!$A$1,$C9,$AK$2,1,1)","v":31},{"$f":"OFFSET('Taula Concentrats'!$A$1,$C9,$AL$2,1,1)","v":60},{"$f":"OFFSET('Taula Concentrats'!$A$1,$C9,$AM$2,1,1)","v":14},{"$f":"OFFSET('Taula Concentrats'!$A$1,$C9,$AN$2,1,1)","v":0.3},{"$f":"OFFSET('Taula Farratges'!$A$1,$C9,$AO$2,1,1)","v":628.16571895000016},{"$f":"IF('II_Plantejar Ració'!$E10>0,IF(E9>=0,1,\"No\"),\"\")","v":""},{"$f":"IF('II_Plantejar Ració'!$E10>0,IF(F9>0,1,\"No\"),\"\")","v":""},{"$f":"IF('II_Plantejar Ració'!$E10>0,IF(G9>0,1,\"No\"),\"\")","v":""},{"$f":"IF('II_Plantejar Ració'!$E10>0,IF(H9=0,\"No\",1),\"\")","v":""},{"$f":"IF('II_Plantejar Ració'!$E10>0,IF(AE9>0,1,\"No\"),\"\")","v":""},{"$f":"IF('II_Plantejar Ració'!$E10>0,IF(I9>0,1,\"No\"),\"\")","v":""},{"$f":"IF('II_Plantejar Ració'!$E10>0,IF(J9>0,1,\"No\"),\"\")","v":""},{"$f":"IF('II_Plantejar Ració'!$E10>0,IF(K9>0,1,\"No\"),\"\")","v":""},{"$f":"IF('II_Plantejar Ració'!$E10>0,IF(L9>0,1,\"No\"),\"\")","v":""},{"$f":"IF('II_Plantejar Ració'!$E10>0,IF(M9>0,1,\"No\"),\"\")","v":""},{"$f":"IF('II_Plantejar Ració'!$E10>0,IF(N9>0,1,\"No\"),\"\")","v":""},{"$f":"IF('II_Plantejar Ració'!$E10>0,IF(O9>0,1,\"No\"),\"\")","v":""},{"$f":"IF('II_Plantejar Ració'!$E10>0,IF(P9>0,1,\"No\"),\"\")","v":""},{"$f":"IF('II_Plantejar Ració'!$E10>0,IF(Q9>0,1,\"No\"),\"\")","v":""},{"$f":"IF('II_Plantejar Ració'!$E10>0,IF(R9>0,1,\"No\"),\"\")","v":""},{"$f":"IF('II_Plantejar Ració'!$E10>0,IF(S9>0,1,\"No\"),\"\")","v":""},{"$f":"IF('II_Plantejar Ració'!$E10>0,IF(T9>0,1,\"No\"),\"\")","v":""},{"$f":"IF('II_Plantejar Ració'!$E10>0,IF(U9>0,1,\"No\"),\"\")","v":""},{"$f":"IF('II_Plantejar Ració'!$E10>0,IF(V9>0,1,\"No\"),\"\")","v":""},{"$f":"IF('II_Plantejar Ració'!$E10>0,IF(W9>0,1,\"No\"),\"\")","v":""},{"$f":"IF('II_Plantejar Ració'!$E10>0,IF(X9>0,1,\"No\"),\"\")","v":""},{"$f":"IF('II_Plantejar Ració'!$E10>0,IF(Y9>0,1,\"No\"),\"\")","v":""},{"$f":"IF('II_Plantejar Ració'!$E10>0,IF(Z9>0,1,\"No\"),\"\")","v":""},{"$f":"IF('II_Plantejar Ració'!$E10>0,IF(AA9>0,1,\"No\"),\"\")","v":""},{"$f":"IF('II_Plantejar Ració'!$E10>0,IF(AB9>0,1,\"No\"),\"\")","v":""},{"$f":"IF('II_Plantejar Ració'!$E10>0,IF(AC9>0,1,\"No\"),\"\")","v":""},{"$f":"IF('II_Plantejar Ració'!$E10>0,IF(AD9>0,1,\"No\"),\"\")","v":""},{"$f":"IF('II_Plantejar Ració'!$E10>0,IF(AE9>0,1,\"No\"),\"\")","v":""},{"$f":"IF('II_Plantejar Ració'!$E10>0,IF(AF9>0,1,\"No\"),\"\")","v":""},{"$f":"IF('II_Plantejar Ració'!$E10>0,IF(AG9>0,1,\"No\"),\"\")","v":""},{"$f":"IF('II_Plantejar Ració'!$E10>0,IF(AH9>0,1,\"No\"),\"\")","v":""},{"$f":"IF('II_Plantejar Ració'!$E10>0,IF(AI9>0,1,\"No\"),\"\")","v":""},{"$f":"IF('II_Plantejar Ració'!$E10>0,IF(AJ9>0,1,\"No\"),\"\")","v":""},{"$f":"IF('II_Plantejar Ració'!$E10>0,IF(AK9>0,1,\"No\"),\"\")","v":""},{"$f":"IF('II_Plantejar Ració'!$E10>0,IF(AL9>0,1,\"No\"),\"\")","v":""},{"$f":"IF('II_Plantejar Ració'!$E10>0,IF(AM9>0,1,\"No\"),\"\")","v":""},0,0,0,0,0,0,0,0,0,0,0,0,0,0,0,0,0,0,0,0,0,0,0,0,0,0,0,0,0,0,0,0,0,0,0,0]
[null,{"$f":"IF(OFFSET('Taula Concentrats'!$A$1,C10,0,1,1)=0,\"\",OFFSET('Taula Concentrats'!$A$1,C10,0,1,1))","v":"Soja tortó 44"},48,{"$f":"OFFSET('Taula Concentrats'!$A$1,$C10,$D$2,1,1)","v":87.2},{"$f":"OFFSET('Taula Concentrats'!$A$1,$C10,$E$2,1,1)","v":0},{"$f":"OFFSET('Taula Concentrats'!$A$1,$C10,$F$2,1,1)","v":1.1656258626018918},{"$f":"OFFSET('Taula Concentrats'!$A$1,$C10,$G$2,1,1)","v":207.06952650471396},{"$f":"OFFSET('Taula Concentrats'!$A$1,$C10,$H$2,1,1)","v":219.17261164349998},{"$f":"OFFSET('Taula Concentrats'!$A$1,$C10,$I$2,1,1)","v":3.4},{"$f":"OFFSET('Taula Concentrats'!$A$1,$C10,$J$2,1,1)","v":7},{"$f":"OFFSET('Taula Concentrats'!$A$1,$C10,$K$2,1,1)","v":2.7},{"$f":"OFFSET('Taula Concentrats'!$A$1,$C10,$L$2,1,1)","v":20},{"$f":"OFFSET('Taula Concentrats'!$A$1,$C10,$M$2,1,1)","v":1.95},{"$f":"OFFSET('Taula Concentrats'!$A$1,$C10,$N$2,1,1)","v":0},{"$f":"OFFSET('Taula Concentrats'!$A$1,$C10,$O$2,1,1)","v":0},{"$f":"OFFSET('Taula Concentrats'!$A$1,$C10,$P$2,1,1)","v":200},{"$f":"OFFSET('Taula Concentrats'!$A$1,$C10,$Q$2,1,1)","v":0.3},{"$f":"OFFSET('Taula Concentrats'!$A$1,$C10,$R$2,1,1)","v":17.100000000000001},{"$f":"OFFSET('Taula Concentrats'!$A$1,$C10,$S$2,1,1)","v":43.7},{"$f":"OFFSET('Taula Concentrats'!$A$1,$C10,$T$2,1,1)","v":54.6},{"$f":"OFFSET('Taula Concentrats'!$A$1,$C10,$U$2,1,1)","v":0},{"$f":"OFFSET('Taula Concentrats'!$A$1,$C10,$V$2,1,1)","v":0.2},{"$f":"OFFSET('Taula Concentrats'!$A$1,$C10,$W$2,1,1)","v":0},{"$f":"OFFSET('Taula Concentrats'!$A$1,$C10,$X$2,1,1)","v":0},{"$f":"OFFSET('Taula Concentrats'!$A$1,$C10,$Y$2,1,1)","v":7},{"$f":"OFFSET('Taula Concentrats'!$A$1,$C10,$Z$2,1,1)","v":16.5},{"$f":"OFFSET('Taula Concentrats'!$A$1,$C10,$AA$2,1,1)","v":0.68199960346033861},{"$f":"OFFSET('Taula Concentrats'!$A$1,$C10,$AB$2,1,1)","v":0.9886316027755},{"$f":"OFFSET('Taula Concentrats'!$A$1,$C10,$AC$2,1,1)","v":488},{"$f":"OFFSET('Taula Concentrats'!$A$1,$C10,$AD$2,1,1)","v":153.41999795655397},{"$f":"OFFSET('Taula Concentrats'!$A$1,$C10,$AE$2,1,1)","v":2},{"$f":"OFFSET('Taula Concentrats'!$A$1,$C10,$AF$2,1,1)","v":0.84965499999999994},{"$f":"OFFSET('Taula Concentrats'!$A$1,$C10,$AG$2,1,1)","v":779.13363500000003},{"$f":"OFFSET('Taula Concentrats'!$A$1,$C10,$AH$2,1,1)","v":22},{"$f":"OFFSET('Taula Concentrats'!$A$1,$C10,$AI$2,1,1)","v":84},{"$f":"OFFSET('Taula Concentrats'!$A$1,$C10,$AJ$2,1,1)","v":163},{"$f":"OFFSET('Taula Concentrats'!$A$1,$C10,$AK$2,1,1)","v":104},{"$f":"OFFSET('Taula Concentrats'!$A$1,$C10,$AL$2,1,1)","v":8},{"$f":"OFFSET('Taula Concentrats'!$A$1,$C10,$AM$2,1,1)","v":83},{"$f":"OFFSET('Taula Concentrats'!$A$1,$C10,$AN$2,1,1)","v":2.2999999999999998},{"$f":"OFFSET('Taula Farratges'!$A$1,$C10,$AO$2,1,1)","v":492.0089099999999},{"$f":"IF('II_Plantejar Ració'!$E11>0,IF(E10>=0,1,\"No\"),\"\")","v":""},{"$f":"IF('II_Plantejar Ració'!$E11>0,IF(F10>0,1,\"No\"),\"\")","v":""},{"$f":"IF('II_Plantejar Ració'!$E11>0,IF(G10>0,1,\"No\"),\"\")","v":""},{"$f":"IF('II_Plantejar Ració'!$E11>0,IF(H10=0,\"No\",1),\"\")","v":""},{"$f":"IF('II_Plantejar Ració'!$E11>0,IF(AE10>0,1,\"No\"),\"\")","v":""},{"$f":"IF('II_Plantejar Ració'!$E11>0,IF(I10>0,1,\"No\"),\"\")","v":""},{"$f":"IF('II_Plantejar Ració'!$E11>0,IF(J10>0,1,\"No\"),\"\")","v":""},{"$f":"IF('II_Plantejar Ració'!$E11>0,IF(K10>0,1,\"No\"),\"\")","v":""},{"$f":"IF('II_Plantejar Ració'!$E11>0,IF(L10>0,1,\"No\"),\"\")","v":""},{"$f":"IF('II_Plantejar Ració'!$E11>0,IF(M10>0,1,\"No\"),\"\")","v":""},{"$f":"IF('II_Plantejar Ració'!$E11>0,IF(N10>0,1,\"No\"),\"\")","v":""},{"$f":"IF('II_Plantejar Ració'!$E11>0,IF(O10>0,1,\"No\"),\"\")","v":""},{"$f":"IF('II_Plantejar Ració'!$E11>0,IF(P10>0,1,\"No\"),\"\")","v":""},{"$f":"IF('II_Plantejar Ració'!$E11>0,IF(Q10>0,1,\"No\"),\"\")","v":""},{"$f":"IF('II_Plantejar Ració'!$E11>0,IF(R10>0,1,\"No\"),\"\")","v":""},{"$f":"IF('II_Plantejar Ració'!$E11>0,IF(S10>0,1,\"No\"),\"\")","v":""},{"$f":"IF('II_Plantejar Ració'!$E11>0,IF(T10>0,1,\"No\"),\"\")","v":""},{"$f":"IF('II_Plantejar Ració'!$E11>0,IF(U10>0,1,\"No\"),\"\")","v":""},{"$f":"IF('II_Plantejar Ració'!$E11>0,IF(V10>0,1,\"No\"),\"\")","v":""},{"$f":"IF('II_Plantejar Ració'!$E11>0,IF(W10>0,1,\"No\"),\"\")","v":""},{"$f":"IF('II_Plantejar Ració'!$E11>0,IF(X10>0,1,\"No\"),\"\")","v":""},{"$f":"IF('II_Plantejar Ració'!$E11>0,IF(Y10>0,1,\"No\"),\"\")","v":""},{"$f":"IF('II_Plantejar Ració'!$E11>0,IF(Z10>0,1,\"No\"),\"\")","v":""},{"$f":"IF('II_Plantejar Ració'!$E11>0,IF(AA10>0,1,\"No\"),\"\")","v":""},{"$f":"IF('II_Plantejar Ració'!$E11>0,IF(AB10>0,1,\"No\"),\"\")","v":""},{"$f":"IF('II_Plantejar Ració'!$E11>0,IF(AC10>0,1,\"No\"),\"\")","v":""},{"$f":"IF('II_Plantejar Ració'!$E11>0,IF(AD10>0,1,\"No\"),\"\")","v":""},{"$f":"IF('II_Plantejar Ració'!$E11>0,IF(AE10>0,1,\"No\"),\"\")","v":""},{"$f":"IF('II_Plantejar Ració'!$E11>0,IF(AF10>0,1,\"No\"),\"\")","v":""},{"$f":"IF('II_Plantejar Ració'!$E11>0,IF(AG10>0,1,\"No\"),\"\")","v":""},{"$f":"IF('II_Plantejar Ració'!$E11>0,IF(AH10>0,1,\"No\"),\"\")","v":""},{"$f":"IF('II_Plantejar Ració'!$E11>0,IF(AI10>0,1,\"No\"),\"\")","v":""},{"$f":"IF('II_Plantejar Ració'!$E11>0,IF(AJ10>0,1,\"No\"),\"\")","v":""},{"$f":"IF('II_Plantejar Ració'!$E11>0,IF(AK10>0,1,\"No\"),\"\")","v":""},{"$f":"IF('II_Plantejar Ració'!$E11>0,IF(AL10>0,1,\"No\"),\"\")","v":""},{"$f":"IF('II_Plantejar Ració'!$E11>0,IF(AM10>0,1,\"No\"),\"\")","v":""},0,0,0,0,0,0,0,0,0,0,0,0,0,0,0,0,0,0,0,0,0,0,0,0,0,0,0,0,0,0,0,0,0,0,0,0]
[null,{"$f":"IF(OFFSET('Taula Concentrats'!$A$1,C11,0,1,1)=0,\"\",OFFSET('Taula Concentrats'!$A$1,C11,0,1,1))","v":""},1,{"$f":"OFFSET('Taula Concentrats'!$A$1,$C11,$D$2,1,1)","v":0},{"$f":"OFFSET('Taula Concentrats'!$A$1,$C11,$E$2,1,1)","v":0},{"$f":"OFFSET('Taula Concentrats'!$A$1,$C11,$F$2,1,1)","v":0},{"$f":"OFFSET('Taula Concentrats'!$A$1,$C11,$G$2,1,1)","v":0},{"$f":"OFFSET('Taula Concentrats'!$A$1,$C11,$H$2,1,1)","v":0},{"$f":"OFFSET('Taula Concentrats'!$A$1,$C11,$I$2,1,1)","v":0},{"$f":"OFFSET('Taula Concentrats'!$A$1,$C11,$J$2,1,1)","v":0},{"$f":"OFFSET('Taula Concentrats'!$A$1,$C11,$K$2,1,1)","v":0},{"$f":"OFFSET('Taula Concentrats'!$A$1,$C11,$L$2,1,1)","v":0},{"$f":"OFFSET('Taula Concentrats'!$A$1,$C11,$M$2,1,1)","v":0},{"$f":"OFFSET('Taula Concentrats'!$A$1,$C11,$N$2,1,1)","v":0},{"$f":"OFFSET('Taula Concentrats'!$A$1,$C11,$O$2,1,1)","v":0},{"$f":"OFFSET('Taula Concentrats'!$A$1,$C11,$P$2,1,1)","v":0},{"$f":"OFFSET('Taula Concentrats'!$A$1,$C11,$Q$2,1,1)","v":0},{"$f":"OFFSET('Taula Concentrats'!$A$1,$C11,$R$2,1,1)","v":0},{"$f":"OFFSET('Taula Concentrats'!$A$1,$C11,$S$2,1,1)","v":0},{"$f":"OFFSET('Taula Concentrats'!$A$1,$C11,$T$2,1,1)","v":0},{"$f":"OFFSET('Taula Concentrats'!$A$1,$C11,$U$2,1,1)","v":0},{"$f":"OFFSET('Taula Concentrats'!$A$1,$C11,$V$2,1,1)","v":0},{"$f":"OFFSET('Taula Concentrats'!$A$1,$C11,$W$2,1,1)","v":0},{"$f":"OFFSET('Taula Concentrats'!$A$1,$C11,$X$2,1,1)","v":0},{"$f":"OFFSET('Taula Concentrats'!$A$1,$C11,$Y$2,1,1)","v":0},{"$f":"OFFSET('Taula Concentrats'!$A$1,$C11,$Z$2,1,1)","v":0},{"$f":"OFFSET('Taula Concentrats'!$A$1,$C11,$AA$2,1,1)","v":0},{"$f":"OFFSET('Taula Concentrats'!$A$1,$C11,$AB$2,1,1)","v":0},{"$f":"OFFSET('Taula Concentrats'!$A$1,$C11,$AC$2,1,1)","v":0},{"$f":"OFFSET('Taula Concentrats'!$A$1,$C11,$AD$2,1,1)","v":0},{"$f":"OFFSET('Taula Concentrats'!$A$1,$C11,$AE$2,1,1)","v":0},{"$f":"OFFSET('Taula Concentrats'!$A$1,$C11,$AF$2,1,1)","v":0},{"$f":"OFFSET('Taula Concentrats'!$A$1,$C11,$AG$2,1,1)","v":0},{"$f":"OFFSET('Taula Concentrats'!$A$1,$C11,$AH$2,1,1)","v":0},{"$f":"OFFSET('Taula Concentrats'!$A$1,$C11,$AI$2,1,1)","v":0},{"$f":"OFFSET('Taula Concentrats'!$A$1,$C11,$AJ$2,1,1)","v":0},{"$f":"OFFSET('Taula Concentrats'!$A$1,$C11,$AK$2,1,1)","v":0},{"$f":"OFFSET('Taula Concentrats'!$A$1,$C11,$AL$2,1,1)","v":0},{"$f":"OFFSET('Taula Concentrats'!$A$1,$C11,$AM$2,1,1)","v":0},{"$f":"OFFSET('Taula Concentrats'!$A$1,$C11,$AN$2,1,1)","v":0},{"$f":"OFFSET('Taula Farratges'!$A$1,$C11,$AO$2,1,1)","v":0},{"$f":"IF('II_Plantejar Ració'!$E12>0,IF(E11>=0,1,\"No\"),\"\")","v":""},{"$f":"IF('II_Plantejar Ració'!$E12>0,IF(F11>0,1,\"No\"),\"\")","v":""},{"$f":"IF('II_Plantejar Ració'!$E12>0,IF(G11>0,1,\"No\"),\"\")","v":""},{"$f":"IF('II_Plantejar Ració'!$E12>0,IF(H11=0,\"No\",1),\"\")","v":""},{"$f":"IF('II_Plantejar Ració'!$E12>0,IF(AE11>0,1,\"No\"),\"\")","v":""},{"$f":"IF('II_Plantejar Ració'!$E12>0,IF(I11>0,1,\"No\"),\"\")","v":""},{"$f":"IF('II_Plantejar Ració'!$E12>0,IF(J11>0,1,\"No\"),\"\")","v":""},{"$f":"IF('II_Plantejar Ració'!$E12>0,IF(K11>0,1,\"No\"),\"\")","v":""},{"$f":"IF('II_Plantejar Ració'!$E12>0,IF(L11>0,1,\"No\"),\"\")","v":""},{"$f":"IF('II_Plantejar Ració'!$E12>0,IF(M11>0,1,\"No\"),\"\")","v":""},{"$f":"IF('II_Plantejar Ració'!$E12>0,IF(N11>0,1,\"No\"),\"\")","v":""},{"$f":"IF('II_Plantejar Ració'!$E12>0,IF(O11>0,1,\"No\"),\"\")","v":""},{"$f":"IF('II_Plantejar Ració'!$E12>0,IF(P11>0,1,\"No\"),\"\")","v":""},{"$f":"IF('II_Plantejar Ració'!$E12>0,IF(Q11>0,1,\"No\"),\"\")","v":""},{"$f":"IF('II_Plantejar Ració'!$E12>0,IF(R11>0,1,\"No\"),\"\")","v":""},{"$f":"IF('II_Plantejar Ració'!$E12>0,IF(S11>0,1,\"No\"),\"\")","v":""},{"$f":"IF('II_Plantejar Ració'!$E12>0,IF(T11>0,1,\"No\"),\"\")","v":""},{"$f":"IF('II_Plantejar Ració'!$E12>0,IF(U11>0,1,\"No\"),\"\")","v":""},{"$f":"IF('II_Plantejar Ració'!$E12>0,IF(V11>0,1,\"No\"),\"\")","v":""},{"$f":"IF('II_Plantejar Ració'!$E12>0,IF(W11>0,1,\"No\"),\"\")","v":""},{"$f":"IF('II_Plantejar Ració'!$E12>0,IF(X11>0,1,\"No\"),\"\")","v":""},{"$f":"IF('II_Plantejar Ració'!$E12>0,IF(Y11>0,1,\"No\"),\"\")","v":""},{"$f":"IF('II_Plantejar Ració'!$E12>0,IF(Z11>0,1,\"No\"),\"\")","v":""},{"$f":"IF('II_Plantejar Ració'!$E12>0,IF(AA11>0,1,\"No\"),\"\")","v":""},{"$f":"IF('II_Plantejar Ració'!$E12>0,IF(AB11>0,1,\"No\"),\"\")","v":""},{"$f":"IF('II_Plantejar Ració'!$E12>0,IF(AC11>0,1,\"No\"),\"\")","v":""},{"$f":"IF('II_Plantejar Ració'!$E12>0,IF(AD11>0,1,\"No\"),\"\")","v":""},{"$f":"IF('II_Plantejar Ració'!$E12>0,IF(AE11>0,1,\"No\"),\"\")","v":""},{"$f":"IF('II_Plantejar Ració'!$E12>0,IF(AF11>0,1,\"No\"),\"\")","v":""},{"$f":"IF('II_Plantejar Ració'!$E12>0,IF(AG11>0,1,\"No\"),\"\")","v":""},{"$f":"IF('II_Plantejar Ració'!$E12>0,IF(AH11>0,1,\"No\"),\"\")","v":""},{"$f":"IF('II_Plantejar Ració'!$E12>0,IF(AI11>0,1,\"No\"),\"\")","v":""},{"$f":"IF('II_Plantejar Ració'!$E12>0,IF(AJ11>0,1,\"No\"),\"\")","v":""},{"$f":"IF('II_Plantejar Ració'!$E12>0,IF(AK11>0,1,\"No\"),\"\")","v":""},{"$f":"IF('II_Plantejar Ració'!$E12>0,IF(AL11>0,1,\"No\"),\"\")","v":""},{"$f":"IF('II_Plantejar Ració'!$E12>0,IF(AM11>0,1,\"No\"),\"\")","v":""},0,0,0,0,0,0,0,0,0,0,0,0,0,0,0,0,0,0,0,0,0,0,0,0,0,0,0,0,0,0,0,0,0,0,0,0]
[null,{"$f":"IF(OFFSET('Taula Concentrats'!$A$1,C12,0,1,1)=0,\"\",OFFSET('Taula Concentrats'!$A$1,C12,0,1,1))","v":""},1,{"$f":"OFFSET('Taula Concentrats'!$A$1,$C12,$D$2,1,1)","v":0},{"$f":"OFFSET('Taula Concentrats'!$A$1,$C12,$E$2,1,1)","v":0},{"$f":"OFFSET('Taula Concentrats'!$A$1,$C12,$F$2,1,1)","v":0},{"$f":"OFFSET('Taula Concentrats'!$A$1,$C12,$G$2,1,1)","v":0},{"$f":"OFFSET('Taula Concentrats'!$A$1,$C12,$H$2,1,1)","v":0},{"$f":"OFFSET('Taula Concentrats'!$A$1,$C12,$I$2,1,1)","v":0},{"$f":"OFFSET('Taula Concentrats'!$A$1,$C12,$J$2,1,1)","v":0},{"$f":"OFFSET('Taula Concentrats'!$A$1,$C12,$K$2,1,1)","v":0},{"$f":"OFFSET('Taula Concentrats'!$A$1,$C12,$L$2,1,1)","v":0},{"$f":"OFFSET('Taula Concentrats'!$A$1,$C12,$M$2,1,1)","v":0},{"$f":"OFFSET('Taula Concentrats'!$A$1,$C12,$N$2,1,1)","v":0},{"$f":"OFFSET('Taula Concentrats'!$A$1,$C12,$O$2,1,1)","v":0},{"$f":"OFFSET('Taula Concentrats'!$A$1,$C12,$P$2,1,1)","v":0},{"$f":"OFFSET('Taula Concentrats'!$A$1,$C12,$Q$2,1,1)","v":0},{"$f":"OFFSET('Taula Concentrats'!$A$1,$C12,$R$2,1,1)","v":0},{"$f":"OFFSET('Taula Concentrats'!$A$1,$C12,$S$2,1,1)","v":0},{"$f":"OFFSET('Taula Concentrats'!$A$1,$C12,$T$2,1,1)","v":0},{"$f":"OFFSET('Taula Concentrats'!$A$1,$C12,$U$2,1,1)","v":0},{"$f":"OFFSET('Taula Concentrats'!$A$1,$C12,$V$2,1,1)","v":0},{"$f":"OFFSET('Taula Concentrats'!$A$1,$C12,$W$2,1,1)","v":0},{"$f":"OFFSET('Taula Concentrats'!$A$1,$C12,$X$2,1,1)","v":0},{"$f":"OFFSET('Taula Concentrats'!$A$1,$C12,$Y$2,1,1)","v":0},{"$f":"OFFSET('Taula Concentrats'!$A$1,$C12,$Z$2,1,1)","v":0},{"$f":"OFFSET('Taula Concentrats'!$A$1,$C12,$AA$2,1,1)","v":0},{"$f":"OFFSET('Taula Concentrats'!$A$1,$C12,$AB$2,1,1)","v":0},{"$f":"OFFSET('Taula Concentrats'!$A$1,$C12,$AC$2,1,1)","v":0},{"$f":"OFFSET('Taula Concentrats'!$A$1,$C12,$AD$2,1,1)","v":0},{"$f":"OFFSET('Taula Concentrats'!$A$1,$C12,$AE$2,1,1)","v":0},{"$f":"OFFSET('Taula Concentrats'!$A$1,$C12,$AF$2,1,1)","v":0},{"$f":"OFFSET('Taula Concentrats'!$A$1,$C12,$AG$2,1,1)","v":0},{"$f":"OFFSET('Taula Concentrats'!$A$1,$C12,$AH$2,1,1)","v":0},{"$f":"OFFSET('Taula Concentrats'!$A$1,$C12,$AI$2,1,1)","v":0},{"$f":"OFFSET('Taula Concentrats'!$A$1,$C12,$AJ$2,1,1)","v":0},{"$f":"OFFSET('Taula Concentrats'!$A$1,$C12,$AK$2,1,1)","v":0},{"$f":"OFFSET('Taula Concentrats'!$A$1,$C12,$AL$2,1,1)","v":0},{"$f":"OFFSET('Taula Concentrats'!$A$1,$C12,$AM$2,1,1)","v":0},{"$f":"OFFSET('Taula Concentrats'!$A$1,$C12,$AN$2,1,1)","v":0},{"$f":"OFFSET('Taula Farratges'!$A$1,$C12,$AO$2,1,1)","v":0},{"$f":"IF('II_Plantejar Ració'!$E13>0,IF(E12>=0,1,\"No\"),\"\")","v":""},{"$f":"IF('II_Plantejar Ració'!$E13>0,IF(F12>0,1,\"No\"),\"\")","v":""},{"$f":"IF('II_Plantejar Ració'!$E13>0,IF(G12>0,1,\"No\"),\"\")","v":""},{"$f":"IF('II_Plantejar Ració'!$E13>0,IF(H12=0,\"No\",1),\"\")","v":""},{"$f":"IF('II_Plantejar Ració'!$E13>0,IF(AE12>0,1,\"No\"),\"\")","v":""},{"$f":"IF('II_Plantejar Ració'!$E13>0,IF(I12>0,1,\"No\"),\"\")","v":""},{"$f":"IF('II_Plantejar Ració'!$E13>0,IF(J12>0,1,\"No\"),\"\")","v":""},{"$f":"IF('II_Plantejar Ració'!$E13>0,IF(K12>0,1,\"No\"),\"\")","v":""},{"$f":"IF('II_Plantejar Ració'!$E13>0,IF(L12>0,1,\"No\"),\"\")","v":""},{"$f":"IF('II_Plantejar Ració'!$E13>0,IF(M12>0,1,\"No\"),\"\")","v":""},{"$f":"IF('II_Plantejar Ració'!$E13>0,IF(N12>0,1,\"No\"),\"\")","v":""},{"$f":"IF('II_Plantejar Ració'!$E13>0,IF(O12>0,1,\"No\"),\"\")","v":""},{"$f":"IF('II_Plantejar Ració'!$E13>0,IF(P12>0,1,\"No\"),\"\")","v":""},{"$f":"IF('II_Plantejar Ració'!$E13>0,IF(Q12>0,1,\"No\"),\"\")","v":""},{"$f":"IF('II_Plantejar Ració'!$E13>0,IF(R12>0,1,\"No\"),\"\")","v":""},{"$f":"IF('II_Plantejar Ració'!$E13>0,IF(S12>0,1,\"No\"),\"\")","v":""},{"$f":"IF('II_Plantejar Ració'!$E13>0,IF(T12>0,1,\"No\"),\"\")","v":""},{"$f":"IF('II_Plantejar Ració'!$E13>0,IF(U12>0,1,\"No\"),\"\")","v":""},{"$f":"IF('II_Plantejar Ració'!$E13>0,IF(V12>0,1,\"No\"),\"\")","v":""},{"$f":"IF('II_Plantejar Ració'!$E13>0,IF(W12>0,1,\"No\"),\"\")","v":""},{"$f":"IF('II_Plantejar Ració'!$E13>0,IF(X12>0,1,\"No\"),\"\")","v":""},{"$f":"IF('II_Plantejar Ració'!$E13>0,IF(Y12>0,1,\"No\"),\"\")","v":""},{"$f":"IF('II_Plantejar Ració'!$E13>0,IF(Z12>0,1,\"No\"),\"\")","v":""},{"$f":"IF('II_Plantejar Ració'!$E13>0,IF(AA12>0,1,\"No\"),\"\")","v":""},{"$f":"IF('II_Plantejar Ració'!$E13>0,IF(AB12>0,1,\"No\"),\"\")","v":""},{"$f":"IF('II_Plantejar Ració'!$E13>0,IF(AC12>0,1,\"No\"),\"\")","v":""},{"$f":"IF('II_Plantejar Ració'!$E13>0,IF(AD12>0,1,\"No\"),\"\")","v":""},{"$f":"IF('II_Plantejar Ració'!$E13>0,IF(AE12>0,1,\"No\"),\"\")","v":""},{"$f":"IF('II_Plantejar Ració'!$E13>0,IF(AF12>0,1,\"No\"),\"\")","v":""},{"$f":"IF('II_Plantejar Ració'!$E13>0,IF(AG12>0,1,\"No\"),\"\")","v":""},{"$f":"IF('II_Plantejar Ració'!$E13>0,IF(AH12>0,1,\"No\"),\"\")","v":""},{"$f":"IF('II_Plantejar Ració'!$E13>0,IF(AI12>0,1,\"No\"),\"\")","v":""},{"$f":"IF('II_Plantejar Ració'!$E13>0,IF(AJ12>0,1,\"No\"),\"\")","v":""},{"$f":"IF('II_Plantejar Ració'!$E13>0,IF(AK12>0,1,\"No\"),\"\")","v":""},{"$f":"IF('II_Plantejar Ració'!$E13>0,IF(AL12>0,1,\"No\"),\"\")","v":""},{"$f":"IF('II_Plantejar Ració'!$E13>0,IF(AM12>0,1,\"No\"),\"\")","v":""},0,0,0,0,0,0,0,0,0,0,0,0,0,0,0,0,0,0,0,0,0,0,0,0,0,0,0,0,0,0,0,0,0,0,0,0]
[null,{"$f":"IF(OFFSET('Taula Concentrats'!$A$1,C13,0,1,1)=0,\"\",OFFSET('Taula Concentrats'!$A$1,C13,0,1,1))","v":""},1,{"$f":"OFFSET('Taula Concentrats'!$A$1,$C13,$D$2,1,1)","v":0},{"$f":"OFFSET('Taula Concentrats'!$A$1,$C13,$E$2,1,1)","v":0},{"$f":"OFFSET('Taula Concentrats'!$A$1,$C13,$F$2,1,1)","v":0},{"$f":"OFFSET('Taula Concentrats'!$A$1,$C13,$G$2,1,1)","v":0},{"$f":"OFFSET('Taula Concentrats'!$A$1,$C13,$H$2,1,1)","v":0},{"$f":"OFFSET('Taula Concentrats'!$A$1,$C13,$I$2,1,1)","v":0},{"$f":"OFFSET('Taula Concentrats'!$A$1,$C13,$J$2,1,1)","v":0},{"$f":"OFFSET('Taula Concentrats'!$A$1,$C13,$K$2,1,1)","v":0},{"$f":"OFFSET('Taula Concentrats'!$A$1,$C13,$L$2,1,1)","v":0},{"$f":"OFFSET('Taula Concentrats'!$A$1,$C13,$M$2,1,1)","v":0},{"$f":"OFFSET('Taula Concentrats'!$A$1,$C13,$N$2,1,1)","v":0},{"$f":"OFFSET('Taula Concentrats'!$A$1,$C13,$O$2,1,1)","v":0},{"$f":"OFFSET('Taula Concentrats'!$A$1,$C13,$P$2,1,1)","v":0},{"$f":"OFFSET('Taula Concentrats'!$A$1,$C13,$Q$2,1,1)","v":0},{"$f":"OFFSET('Taula Concentrats'!$A$1,$C13,$R$2,1,1)","v":0},{"$f":"OFFSET('Taula Concentrats'!$A$1,$C13,$S$2,1,1)","v":0},{"$f":"OFFSET('Taula Concentrats'!$A$1,$C13,$T$2,1,1)","v":0},{"$f":"OFFSET('Taula Concentrats'!$A$1,$C13,$U$2,1,1)","v":0},{"$f":"OFFSET('Taula Concentrats'!$A$1,$C13,$V$2,1,1)","v":0},{"$f":"OFFSET('Taula Concentrats'!$A$1,$C13,$W$2,1,1)","v":0},{"$f":"OFFSET('Taula Concentrats'!$A$1,$C13,$X$2,1,1)","v":0},{"$f":"OFFSET('Taula Concentrats'!$A$1,$C13,$Y$2,1,1)","v":0},{"$f":"OFFSET('Taula Concentrats'!$A$1,$C13,$Z$2,1,1)","v":0},{"$f":"OFFSET('Taula Concentrats'!$A$1,$C13,$AA$2,1,1)","v":0},{"$f":"OFFSET('Taula Concentrats'!$A$1,$C13,$AB$2,1,1)","v":0},{"$f":"OFFSET('Taula Concentrats'!$A$1,$C13,$AC$2,1,1)","v":0},{"$f":"OFFSET('Taula Concentrats'!$A$1,$C13,$AD$2,1,1)","v":0},{"$f":"OFFSET('Taula Concentrats'!$A$1,$C13,$AE$2,1,1)","v":0},{"$f":"OFFSET('Taula Concentrats'!$A$1,$C13,$AF$2,1,1)","v":0},{"$f":"OFFSET('Taula Concentrats'!$A$1,$C13,$AG$2,1,1)","v":0},{"$f":"OFFSET('Taula Concentrats'!$A$1,$C13,$AH$2,1,1)","v":0},{"$f":"OFFSET('Taula Concentrats'!$A$1,$C13,$AI$2,1,1)","v":0},{"$f":"OFFSET('Taula Concentrats'!$A$1,$C13,$AJ$2,1,1)","v":0},{"$f":"OFFSET('Taula Concentrats'!$A$1,$C13,$AK$2,1,1)","v":0},{"$f":"OFFSET('Taula Concentrats'!$A$1,$C13,$AL$2,1,1)","v":0},{"$f":"OFFSET('Taula Concentrats'!$A$1,$C13,$AM$2,1,1)","v":0},{"$f":"OFFSET('Taula Concentrats'!$A$1,$C13,$AN$2,1,1)","v":0},{"$f":"OFFSET('Taula Farratges'!$A$1,$C13,$AO$2,1,1)","v":0},{"$f":"IF('II_Plantejar Ració'!$E14>0,IF(E13>=0,1,\"No\"),\"\")","v":""},{"$f":"IF('II_Plantejar Ració'!$E14>0,IF(F13>0,1,\"No\"),\"\")","v":""},{"$f":"IF('II_Plantejar Ració'!$E14>0,IF(G13>0,1,\"No\"),\"\")","v":""},{"$f":"IF('II_Plantejar Ració'!$E14>0,IF(H13=0,\"No\",1),\"\")","v":""},{"$f":"IF('II_Plantejar Ració'!$E14>0,IF(AE13>0,1,\"No\"),\"\")","v":""},{"$f":"IF('II_Plantejar Ració'!$E14>0,IF(I13>0,1,\"No\"),\"\")","v":""},{"$f":"IF('II_Plantejar Ració'!$E14>0,IF(J13>0,1,\"No\"),\"\")","v":""},{"$f":"IF('II_Plantejar Ració'!$E14>0,IF(K13>0,1,\"No\"),\"\")","v":""},{"$f":"IF('II_Plantejar Ració'!$E14>0,IF(L13>0,1,\"No\"),\"\")","v":""},{"$f":"IF('II_Plantejar Ració'!$E14>0,IF(M13>0,1,\"No\"),\"\")","v":""},{"$f":"IF('II_Plantejar Ració'!$E14>0,IF(N13>0,1,\"No\"),\"\")","v":""},{"$f":"IF('II_Plantejar Ració'!$E14>0,IF(O13>0,1,\"No\"),\"\")","v":""},{"$f":"IF('II_Plantejar Ració'!$E14>0,IF(P13>0,1,\"No\"),\"\")","v":""},{"$f":"IF('II_Plantejar Ració'!$E14>0,IF(Q13>0,1,\"No\"),\"\")","v":""},{"$f":"IF('II_Plantejar Ració'!$E14>0,IF(R13>0,1,\"No\"),\"\")","v":""},{"$f":"IF('II_Plantejar Ració'!$E14>0,IF(S13>0,1,\"No\"),\"\")","v":""},{"$f":"IF('II_Plantejar Ració'!$E14>0,IF(T13>0,1,\"No\"),\"\")","v":""},{"$f":"IF('II_Plantejar Ració'!$E14>0,IF(U13>0,1,\"No\"),\"\")","v":""},{"$f":"IF('II_Plantejar Ració'!$E14>0,IF(V13>0,1,\"No\"),\"\")","v":""},{"$f":"IF('II_Plantejar Ració'!$E14>0,IF(W13>0,1,\"No\"),\"\")","v":""},{"$f":"IF('II_Plantejar Ració'!$E14>0,IF(X13>0,1,\"No\"),\"\")","v":""},{"$f":"IF('II_Plantejar Ració'!$E14>0,IF(Y13>0,1,\"No\"),\"\")","v":""},{"$f":"IF('II_Plantejar Ració'!$E14>0,IF(Z13>0,1,\"No\"),\"\")","v":""},{"$f":"IF('II_Plantejar Ració'!$E14>0,IF(AA13>0,1,\"No\"),\"\")","v":""},{"$f":"IF('II_Plantejar Ració'!$E14>0,IF(AB13>0,1,\"No\"),\"\")","v":""},{"$f":"IF('II_Plantejar Ració'!$E14>0,IF(AC13>0,1,\"No\"),\"\")","v":""},{"$f":"IF('II_Plantejar Ració'!$E14>0,IF(AD13>0,1,\"No\"),\"\")","v":""},{"$f":"IF('II_Plantejar Ració'!$E14>0,IF(AE13>0,1,\"No\"),\"\")","v":""},{"$f":"IF('II_Plantejar Ració'!$E14>0,IF(AF13>0,1,\"No\"),\"\")","v":""},{"$f":"IF('II_Plantejar Ració'!$E14>0,IF(AG13>0,1,\"No\"),\"\")","v":""},{"$f":"IF('II_Plantejar Ració'!$E14>0,IF(AH13>0,1,\"No\"),\"\")","v":""},{"$f":"IF('II_Plantejar Ració'!$E14>0,IF(AI13>0,1,\"No\"),\"\")","v":""},{"$f":"IF('II_Plantejar Ració'!$E14>0,IF(AJ13>0,1,\"No\"),\"\")","v":""},{"$f":"IF('II_Plantejar Ració'!$E14>0,IF(AK13>0,1,\"No\"),\"\")","v":""},{"$f":"IF('II_Plantejar Ració'!$E14>0,IF(AL13>0,1,\"No\"),\"\")","v":""},{"$f":"IF('II_Plantejar Ració'!$E14>0,IF(AM13>0,1,\"No\"),\"\")","v":""},0,0,0,0,0,0,0,0,0,0,0,0,0,0,0,0,0,0,0,0,0,0,0,0,0,0,0,0,0,0,0,0,0,0,0,0]
[null,{"$f":"IF(OFFSET('Taula Concentrats'!$A$1,C14,0,1,1)=0,\"\",OFFSET('Taula Concentrats'!$A$1,C14,0,1,1))","v":""},1,{"$f":"OFFSET('Taula Concentrats'!$A$1,$C14,$D$2,1,1)","v":0},{"$f":"OFFSET('Taula Concentrats'!$A$1,$C14,$E$2,1,1)","v":0},{"$f":"OFFSET('Taula Concentrats'!$A$1,$C14,$F$2,1,1)","v":0},{"$f":"OFFSET('Taula Concentrats'!$A$1,$C14,$G$2,1,1)","v":0},{"$f":"OFFSET('Taula Concentrats'!$A$1,$C14,$H$2,1,1)","v":0},{"$f":"OFFSET('Taula Concentrats'!$A$1,$C14,$I$2,1,1)","v":0},{"$f":"OFFSET('Taula Concentrats'!$A$1,$C14,$J$2,1,1)","v":0},{"$f":"OFFSET('Taula Concentrats'!$A$1,$C14,$K$2,1,1)","v":0},{"$f":"OFFSET('Taula Concentrats'!$A$1,$C14,$L$2,1,1)","v":0},{"$f":"OFFSET('Taula Concentrats'!$A$1,$C14,$M$2,1,1)","v":0},{"$f":"OFFSET('Taula Concentrats'!$A$1,$C14,$N$2,1,1)","v":0},{"$f":"OFFSET('Taula Concentrats'!$A$1,$C14,$O$2,1,1)","v":0},{"$f":"OFFSET('Taula Concentrats'!$A$1,$C14,$P$2,1,1)","v":0},{"$f":"OFFSET('Taula Concentrats'!$A$1,$C14,$Q$2,1,1)","v":0},{"$f":"OFFSET('Taula Concentrats'!$A$1,$C14,$R$2,1,1)","v":0},{"$f":"OFFSET('Taula Concentrats'!$A$1,$C14,$S$2,1,1)","v":0},{"$f":"OFFSET('Taula Concentrats'!$A$1,$C14,$T$2,1,1)","v":0},{"$f":"OFFSET('Taula Concentrats'!$A$1,$C14,$U$2,1,1)","v":0},{"$f":"OFFSET('Taula Concentrats'!$A$1,$C14,$V$2,1,1)","v":0},{"$f":"OFFSET('Taula Concentrats'!$A$1,$C14,$W$2,1,1)","v":0},{"$f":"OFFSET('Taula Concentrats'!$A$1,$C14,$X$2,1,1)","v":0},{"$f":"OFFSET('Taula Concentrats'!$A$1,$C14,$Y$2,1,1)","v":0},{"$f":"OFFSET('Taula Concentrats'!$A$1,$C14,$Z$2,1,1)","v":0},{"$f":"OFFSET('Taula Concentrats'!$A$1,$C14,$AA$2,1,1)","v":0},{"$f":"OFFSET('Taula Concentrats'!$A$1,$C14,$AB$2,1,1)","v":0},{"$f":"OFFSET('Taula Concentrats'!$A$1,$C14,$AC$2,1,1)","v":0},{"$f":"OFFSET('Taula Concentrats'!$A$1,$C14,$AD$2,1,1)","v":0},{"$f":"OFFSET('Taula Concentrats'!$A$1,$C14,$AE$2,1,1)","v":0},{"$f":"OFFSET('Taula Concentrats'!$A$1,$C14,$AF$2,1,1)","v":0},{"$f":"OFFSET('Taula Concentrats'!$A$1,$C14,$AG$2,1,1)","v":0},{"$f":"OFFSET('Taula Concentrats'!$A$1,$C14,$AH$2,1,1)","v":0},{"$f":"OFFSET('Taula Concentrats'!$A$1,$C14,$AI$2,1,1)","v":0},{"$f":"OFFSET('Taula Concentrats'!$A$1,$C14,$AJ$2,1,1)","v":0},{"$f":"OFFSET('Taula Concentrats'!$A$1,$C14,$AK$2,1,1)","v":0},{"$f":"OFFSET('Taula Concentrats'!$A$1,$C14,$AL$2,1,1)","v":0},{"$f":"OFFSET('Taula Concentrats'!$A$1,$C14,$AM$2,1,1)","v":0},{"$f":"OFFSET('Taula Concentrats'!$A$1,$C14,$AN$2,1,1)","v":0},{"$f":"OFFSET('Taula Farratges'!$A$1,$C14,$AO$2,1,1)","v":0},{"$f":"IF('II_Plantejar Ració'!$E15>0,IF(E14>=0,1,\"No\"),\"\")","v":""},{"$f":"IF('II_Plantejar Ració'!$E15>0,IF(F14>0,1,\"No\"),\"\")","v":""},{"$f":"IF('II_Plantejar Ració'!$E15>0,IF(G14>0,1,\"No\"),\"\")","v":""},{"$f":"IF('II_Plantejar Ració'!$E15>0,IF(H14=0,\"No\",1),\"\")","v":""},{"$f":"IF('II_Plantejar Ració'!$E15>0,IF(AE14>0,1,\"No\"),\"\")","v":""},{"$f":"IF('II_Plantejar Ració'!$E15>0,IF(I14>0,1,\"No\"),\"\")","v":""},{"$f":"IF('II_Plantejar Ració'!$E15>0,IF(J14>0,1,\"No\"),\"\")","v":""},{"$f":"IF('II_Plantejar Ració'!$E15>0,IF(K14>0,1,\"No\"),\"\")","v":""},{"$f":"IF('II_Plantejar Ració'!$E15>0,IF(L14>0,1,\"No\"),\"\")","v":""},{"$f":"IF('II_Plantejar Ració'!$E15>0,IF(M14>0,1,\"No\"),\"\")","v":""},{"$f":"IF('II_Plantejar Ració'!$E15>0,IF(N14>0,1,\"No\"),\"\")","v":""},{"$f":"IF('II_Plantejar Ració'!$E15>0,IF(O14>0,1,\"No\"),\"\")","v":""},{"$f":"IF('II_Plantejar Ració'!$E15>0,IF(P14>0,1,\"No\"),\"\")","v":""},{"$f":"IF('II_Plantejar Ració'!$E15>0,IF(Q14>0,1,\"No\"),\"\")","v":""},{"$f":"IF('II_Plantejar Ració'!$E15>0,IF(R14>0,1,\"No\"),\"\")","v":""},{"$f":"IF('II_Plantejar Ració'!$E15>0,IF(S14>0,1,\"No\"),\"\")","v":""},{"$f":"IF('II_Plantejar Ració'!$E15>0,IF(T14>0,1,\"No\"),\"\")","v":""},{"$f":"IF('II_Plantejar Ració'!$E15>0,IF(U14>0,1,\"No\"),\"\")","v":""},{"$f":"IF('II_Plantejar Ració'!$E15>0,IF(V14>0,1,\"No\"),\"\")","v":""},{"$f":"IF('II_Plantejar Ració'!$E15>0,IF(W14>0,1,\"No\"),\"\")","v":""},{"$f":"IF('II_Plantejar Ració'!$E15>0,IF(X14>0,1,\"No\"),\"\")","v":""},{"$f":"IF('II_Plantejar Ració'!$E15>0,IF(Y14>0,1,\"No\"),\"\")","v":""},{"$f":"IF('II_Plantejar Ració'!$E15>0,IF(Z14>0,1,\"No\"),\"\")","v":""},{"$f":"IF('II_Plantejar Ració'!$E15>0,IF(AA14>0,1,\"No\"),\"\")","v":""},{"$f":"IF('II_Plantejar Ració'!$E15>0,IF(AB14>0,1,\"No\"),\"\")","v":""},{"$f":"IF('II_Plantejar Ració'!$E15>0,IF(AC14>0,1,\"No\"),\"\")","v":""},{"$f":"IF('II_Plantejar Ració'!$E15>0,IF(AD14>0,1,\"No\"),\"\")","v":""},{"$f":"IF('II_Plantejar Ració'!$E15>0,IF(AE14>0,1,\"No\"),\"\")","v":""},{"$f":"IF('II_Plantejar Ració'!$E15>0,IF(AF14>0,1,\"No\"),\"\")","v":""},{"$f":"IF('II_Plantejar Ració'!$E15>0,IF(AG14>0,1,\"No\"),\"\")","v":""},{"$f":"IF('II_Plantejar Ració'!$E15>0,IF(AH14>0,1,\"No\"),\"\")","v":""},{"$f":"IF('II_Plantejar Ració'!$E15>0,IF(AI14>0,1,\"No\"),\"\")","v":""},{"$f":"IF('II_Plantejar Ració'!$E15>0,IF(AJ14>0,1,\"No\"),\"\")","v":""},{"$f":"IF('II_Plantejar Ració'!$E15>0,IF(AK14>0,1,\"No\"),\"\")","v":""},{"$f":"IF('II_Plantejar Ració'!$E15>0,IF(AL14>0,1,\"No\"),\"\")","v":""},{"$f":"IF('II_Plantejar Ració'!$E15>0,IF(AM14>0,1,\"No\"),\"\")","v":""},0,0,0,0,0,0,0,0,0,0,0,0,0,0,0,0,0,0,0,0,0,0,0,0,0,0,0,0,0,0,0,0,0,0,0,0]
[null,{"$f":"IF(OFFSET('Taula Concentrats'!$A$1,C15,0,1,1)=0,\"\",OFFSET('Taula Concentrats'!$A$1,C15,0,1,1))","v":"Grassa vegetal, mantega de porc (tots els tipus)"},74,{"$f":"OFFSET('Taula Concentrats'!$A$1,$C15,$D$2,1,1)","v":99.9},{"$f":"OFFSET('Taula Concentrats'!$A$1,$C15,$E$2,1,1)","v":0},{"$f":"OFFSET('Taula Concentrats'!$A$1,$C15,$F$2,1,1)","v":3.61},{"$f":"OFFSET('Taula Concentrats'!$A$1,$C15,$G$2,1,1)","v":9.9999999999999995E-8},{"$f":"OFFSET('Taula Concentrats'!$A$1,$C15,$H$2,1,1)","v":-14},{"$f":"OFFSET('Taula Concentrats'!$A$1,$C15,$I$2,1,1)","v":9.9999999999999995E-8},{"$f":"OFFSET('Taula Concentrats'!$A$1,$C15,$J$2,1,1)","v":9.9999999999999995E-8},{"$f":"OFFSET('Taula Concentrats'!$A$1,$C15,$K$2,1,1)","v":9.9999999999999995E-8},{"$f":"OFFSET('Taula Concentrats'!$A$1,$C15,$L$2,1,1)","v":9.9999999999999995E-8},{"$f":"OFFSET('Taula Concentrats'!$A$1,$C15,$M$2,1,1)","v":9.9999999999999995E-8},{"$f":"OFFSET('Taula Concentrats'!$A$1,$C15,$N$2,1,1)","v":9.9999999999999995E-8},{"$f":"OFFSET('Taula Concentrats'!$A$1,$C15,$O$2,1,1)","v":9.9999999999999995E-8},{"$f":"OFFSET('Taula Concentrats'!$A$1,$C15,$P$2,1,1)","v":9.9999999999999995E-8},{"$f":"OFFSET('Taula Concentrats'!$A$1,$C15,$Q$2,1,1)","v":9.9999999999999995E-8},{"$f":"OFFSET('Taula Concentrats'!$A$1,$C15,$R$2,1,1)","v":9.9999999999999995E-8},{"$f":"OFFSET('Taula Concentrats'!$A$1,$C15,$S$2,1,1)","v":9.9999999999999995E-8},{"$f":"OFFSET('Taula Concentrats'!$A$1,$C15,$T$2,1,1)","v":9.9999999999999995E-8},{"$f":"OFFSET('Taula Concentrats'!$A$1,$C15,$U$2,1,1)","v":9.9999999999999995E-8},{"$f":"OFFSET('Taula Concentrats'!$A$1,$C15,$V$2,1,1)","v":9.9999999999999995E-8},{"$f":"OFFSET('Taula Concentrats'!$A$1,$C15,$W$2,1,1)","v":1300},{"$f":"OFFSET('Taula Concentrats'!$A$1,$C15,$X$2,1,1)","v":9.9999999999999995E-8},{"$f":"OFFSET('Taula Concentrats'!$A$1,$C15,$Y$2,1,1)","v":95},{"$f":"OFFSET('Taula Concentrats'!$A$1,$C15,$Z$2,1,1)","v":999},{"$f":"OFFSET('Taula Concentrats'!$A$1,$C15,$AA$2,1,1)","v":0},{"$f":"OFFSET('Taula Concentrats'!$A$1,$C15,$AB$2,1,1)","v":0},{"$f":"OFFSET('Taula Concentrats'!$A$1,$C15,$AC$2,1,1)","v":9.9999999999999995E-8},{"$f":"OFFSET('Taula Concentrats'!$A$1,$C15,$AD$2,1,1)","v":9.9999999999999995E-8},{"$f":"OFFSET('Taula Concentrats'!$A$1,$C15,$AE$2,1,1)","v":2},{"$f":"OFFSET('Taula Concentrats'!$A$1,$C15,$AF$2,1,1)","v":0.9},{"$f":"OFFSET('Taula Concentrats'!$A$1,$C15,$AG$2,1,1)","v":9.9999999999999995E-8},{"$f":"OFFSET('Taula Concentrats'!$A$1,$C15,$AH$2,1,1)","v":999},{"$f":"OFFSET('Taula Concentrats'!$A$1,$C15,$AI$2,1,1)","v":9.9999999999999995E-8},{"$f":"OFFSET('Taula Concentrats'!$A$1,$C15,$AJ$2,1,1)","v":9.9999999999999995E-8},{"$f":"OFFSET('Taula Concentrats'!$A$1,$C15,$AK$2,1,1)","v":9.9999999999999995E-8},{"$f":"OFFSET('Taula Concentrats'!$A$1,$C15,$AL$2,1,1)","v":9.9999999999999995E-8},{"$f":"OFFSET('Taula Concentrats'!$A$1,$C15,$AM$2,1,1)","v":9.9999999999999995E-8},{"$f":"OFFSET('Taula Concentrats'!$A$1,$C15,$AN$2,1,1)","v":9.9999999999999995E-8},{"$f":"OFFSET('Taula Farratges'!$A$1,$C15,$AO$2,1,1)","v":460.05302034499999},{"$f":"IF('II_Plantejar Ració'!$E16>0,IF(E15>=0,1,\"No\"),\"\")","v":""},{"$f":"IF('II_Plantejar Ració'!$E16>0,IF(F15>0,1,\"No\"),\"\")","v":""},{"$f":"IF('II_Plantejar Ració'!$E16>0,IF(G15>0,1,\"No\"),\"\")","v":""},{"$f":"IF('II_Plantejar Ració'!$E16>0,IF(H15=0,\"No\",1),\"\")","v":""},{"$f":"IF('II_Plantejar Ració'!$E16>0,IF(AE15>0,1,\"No\"),\"\")","v":""},{"$f":"IF('II_Plantejar Ració'!$E16>0,IF(I15>0,1,\"No\"),\"\")","v":""},{"$f":"IF('II_Plantejar Ració'!$E16>0,IF(J15>0,1,\"No\"),\"\")","v":""},{"$f":"IF('II_Plantejar Ració'!$E16>0,IF(K15>0,1,\"No\"),\"\")","v":""},{"$f":"IF('II_Plantejar Ració'!$E16>0,IF(L15>0,1,\"No\"),\"\")","v":""},{"$f":"IF('II_Plantejar Ració'!$E16>0,IF(M15>0,1,\"No\"),\"\")","v":""},{"$f":"IF('II_Plantejar Ració'!$E16>0,IF(N15>0,1,\"No\"),\"\")","v":""},{"$f":"IF('II_Plantejar Ració'!$E16>0,IF(O15>0,1,\"No\"),\"\")","v":""},{"$f":"IF('II_Plantejar Ració'!$E16>0,IF(P15>0,1,\"No\"),\"\")","v":""},{"$f":"IF('II_Plantejar Ració'!$E16>0,IF(Q15>0,1,\"No\"),\"\")","v":""},{"$f":"IF('II_Plantejar Ració'!$E16>0,IF(R15>0,1,\"No\"),\"\")","v":""},{"$f":"IF('II_Plantejar Ració'!$E16>0,IF(S15>0,1,\"No\"),\"\")","v":""},{"$f":"IF('II_Plantejar Ració'!$E16>0,IF(T15>0,1,\"No\"),\"\")","v":""},{"$f":"IF('II_Plantejar Ració'!$E16>0,IF(U15>0,1,\"No\"),\"\")","v":""},{"$f":"IF('II_Plantejar Ració'!$E16>0,IF(V15>0,1,\"No\"),\"\")","v":""},{"$f":"IF('II_Plantejar Ració'!$E16>0,IF(W15>0,1,\"No\"),\"\")","v":""},{"$f":"IF('II_Plantejar Ració'!$E16>0,IF(X15>0,1,\"No\"),\"\")","v":""},{"$f":"IF('II_Plantejar Ració'!$E16>0,IF(Y15>0,1,\"No\"),\"\")","v":""},{"$f":"IF('II_Plantejar Ració'!$E16>0,IF(Z15>0,1,\"No\"),\"\")","v":""},{"$f":"IF('II_Plantejar Ració'!$E16>0,IF(AA15>0,1,\"No\"),\"\")","v":""},{"$f":"IF('II_Plantejar Ració'!$E16>0,IF(AB15>0,1,\"No\"),\"\")","v":""},{"$f":"IF('II_Plantejar Ració'!$E16>0,IF(AC15>0,1,\"No\"),\"\")","v":""},{"$f":"IF('II_Plantejar Ració'!$E16>0,IF(AD15>0,1,\"No\"),\"\")","v":""},{"$f":"IF('II_Plantejar Ració'!$E16>0,IF(AE15>0,1,\"No\"),\"\")","v":""},{"$f":"IF('II_Plantejar Ració'!$E16>0,IF(AF15>0,1,\"No\"),\"\")","v":""},{"$f":"IF('II_Plantejar Ració'!$E16>0,IF(AG15>0,1,\"No\"),\"\")","v":""},{"$f":"IF('II_Plantejar Ració'!$E16>0,IF(AH15>0,1,\"No\"),\"\")","v":""},{"$f":"IF('II_Plantejar Ració'!$E16>0,IF(AI15>0,1,\"No\"),\"\")","v":""},{"$f":"IF('II_Plantejar Ració'!$E16>0,IF(AJ15>0,1,\"No\"),\"\")","v":""},{"$f":"IF('II_Plantejar Ració'!$E16>0,IF(AK15>0,1,\"No\"),\"\")","v":""},{"$f":"IF('II_Plantejar Ració'!$E16>0,IF(AL15>0,1,\"No\"),\"\")","v":""},{"$f":"IF('II_Plantejar Ració'!$E16>0,IF(AM15>0,1,\"No\"),\"\")","v":""},0,0,0,0,0,0,0,0,0,0,0,0,0,0,0,0,0,0,0,0,0,0,0,0,0,0,0,0,0,0,0,0,0,0,0,0]
[null,{"$f":"IF(OFFSET('Taula Concentrats'!$A$1,C16,0,1,1)=0,\"\",OFFSET('Taula Concentrats'!$A$1,C16,0,1,1))","v":""},1,{"$f":"OFFSET('Taula Concentrats'!$A$1,$C16,$D$2,1,1)","v":0},{"$f":"OFFSET('Taula Concentrats'!$A$1,$C16,$E$2,1,1)","v":0},{"$f":"OFFSET('Taula Concentrats'!$A$1,$C16,$F$2,1,1)","v":0},{"$f":"OFFSET('Taula Concentrats'!$A$1,$C16,$G$2,1,1)","v":0},{"$f":"OFFSET('Taula Concentrats'!$A$1,$C16,$H$2,1,1)","v":0},{"$f":"OFFSET('Taula Concentrats'!$A$1,$C16,$I$2,1,1)","v":0},{"$f":"OFFSET('Taula Concentrats'!$A$1,$C16,$J$2,1,1)","v":0},{"$f":"OFFSET('Taula Concentrats'!$A$1,$C16,$K$2,1,1)","v":0},{"$f":"OFFSET('Taula Concentrats'!$A$1,$C16,$L$2,1,1)","v":0},{"$f":"OFFSET('Taula Concentrats'!$A$1,$C16,$M$2,1,1)","v":0},{"$f":"OFFSET('Taula Concentrats'!$A$1,$C16,$N$2,1,1)","v":0},{"$f":"OFFSET('Taula Concentrats'!$A$1,$C16,$O$2,1,1)","v":0},{"$f":"OFFSET('Taula Concentrats'!$A$1,$C16,$P$2,1,1)","v":0},{"$f":"OFFSET('Taula Concentrats'!$A$1,$C16,$Q$2,1,1)","v":0},{"$f":"OFFSET('Taula Concentrats'!$A$1,$C16,$R$2,1,1)","v":0},{"$f":"OFFSET('Taula Concentrats'!$A$1,$C16,$S$2,1,1)","v":0},{"$f":"OFFSET('Taula Concentrats'!$A$1,$C16,$T$2,1,1)","v":0},{"$f":"OFFSET('Taula Concentrats'!$A$1,$C16,$U$2,1,1)","v":0},{"$f":"OFFSET('Taula Concentrats'!$A$1,$C16,$V$2,1,1)","v":0},{"$f":"OFFSET('Taula Concentrats'!$A$1,$C16,$W$2,1,1)","v":0},{"$f":"OFFSET('Taula Concentrats'!$A$1,$C16,$X$2,1,1)","v":0},{"$f":"OFFSET('Taula Concentrats'!$A$1,$C16,$Y$2,1,1)","v":0},{"$f":"OFFSET('Taula Concentrats'!$A$1,$C16,$Z$2,1,1)","v":0},{"$f":"OFFSET('Taula Concentrats'!$A$1,$C16,$AA$2,1,1)","v":0},{"$f":"OFFSET('Taula Concentrats'!$A$1,$C16,$AB$2,1,1)","v":0},{"$f":"OFFSET('Taula Concentrats'!$A$1,$C16,$AC$2,1,1)","v":0},{"$f":"OFFSET('Taula Concentrats'!$A$1,$C16,$AD$2,1,1)","v":0},{"$f":"OFFSET('Taula Concentrats'!$A$1,$C16,$AE$2,1,1)","v":0},{"$f":"OFFSET('Taula Concentrats'!$A$1,$C16,$AF$2,1,1)","v":0},{"$f":"OFFSET('Taula Concentrats'!$A$1,$C16,$AG$2,1,1)","v":0},{"$f":"OFFSET('Taula Concentrats'!$A$1,$C16,$AH$2,1,1)","v":0},{"$f":"OFFSET('Taula Concentrats'!$A$1,$C16,$AI$2,1,1)","v":0},{"$f":"OFFSET('Taula Concentrats'!$A$1,$C16,$AJ$2,1,1)","v":0},{"$f":"OFFSET('Taula Concentrats'!$A$1,$C16,$AK$2,1,1)","v":0},{"$f":"OFFSET('Taula Concentrats'!$A$1,$C16,$AL$2,1,1)","v":0},{"$f":"OFFSET('Taula Concentrats'!$A$1,$C16,$AM$2,1,1)","v":0},{"$f":"OFFSET('Taula Concentrats'!$A$1,$C16,$AN$2,1,1)","v":0},{"$f":"OFFSET('Taula Farratges'!$A$1,$C16,$AO$2,1,1)","v":0},{"$f":"IF('II_Plantejar Ració'!$E17>0,IF(E16>=0,1,\"No\"),\"\")","v":""},{"$f":"IF('II_Plantejar Ració'!$E17>0,IF(F16>0,1,\"No\"),\"\")","v":""},{"$f":"IF('II_Plantejar Ració'!$E17>0,IF(G16>0,1,\"No\"),\"\")","v":""},{"$f":"IF('II_Plantejar Ració'!$E17>0,IF(H16=0,\"No\",1),\"\")","v":""},{"$f":"IF('II_Plantejar Ració'!$E17>0,IF(AE16>0,1,\"No\"),\"\")","v":""},{"$f":"IF('II_Plantejar Ració'!$E17>0,IF(I16>0,1,\"No\"),\"\")","v":""},{"$f":"IF('II_Plantejar Ració'!$E17>0,IF(J16>0,1,\"No\"),\"\")","v":""},{"$f":"IF('II_Plantejar Ració'!$E17>0,IF(K16>0,1,\"No\"),\"\")","v":""},{"$f":"IF('II_Plantejar Ració'!$E17>0,IF(L16>0,1,\"No\"),\"\")","v":""},{"$f":"IF('II_Plantejar Ració'!$E17>0,IF(M16>0,1,\"No\"),\"\")","v":""},{"$f":"IF('II_Plantejar Ració'!$E17>0,IF(N16>0,1,\"No\"),\"\")","v":""},{"$f":"IF('II_Plantejar Ració'!$E17>0,IF(O16>0,1,\"No\"),\"\")","v":""},{"$f":"IF('II_Plantejar Ració'!$E17>0,IF(P16>0,1,\"No\"),\"\")","v":""},{"$f":"IF('II_Plantejar Ració'!$E17>0,IF(Q16>0,1,\"No\"),\"\")","v":""},{"$f":"IF('II_Plantejar Ració'!$E17>0,IF(R16>0,1,\"No\"),\"\")","v":""},{"$f":"IF('II_Plantejar Ració'!$E17>0,IF(S16>0,1,\"No\"),\"\")","v":""},{"$f":"IF('II_Plantejar Ració'!$E17>0,IF(T16>0,1,\"No\"),\"\")","v":""},{"$f":"IF('II_Plantejar Ració'!$E17>0,IF(U16>0,1,\"No\"),\"\")","v":""},{"$f":"IF('II_Plantejar Ració'!$E17>0,IF(V16>0,1,\"No\"),\"\")","v":""},{"$f":"IF('II_Plantejar Ració'!$E17>0,IF(W16>0,1,\"No\"),\"\")","v":""},{"$f":"IF('II_Plantejar Ració'!$E17>0,IF(X16>0,1,\"No\"),\"\")","v":""},{"$f":"IF('II_Plantejar Ració'!$E17>0,IF(Y16>0,1,\"No\"),\"\")","v":""},{"$f":"IF('II_Plantejar Ració'!$E17>0,IF(Z16>0,1,\"No\"),\"\")","v":""},{"$f":"IF('II_Plantejar Ració'!$E17>0,IF(AA16>0,1,\"No\"),\"\")","v":""},{"$f":"IF('II_Plantejar Ració'!$E17>0,IF(AB16>0,1,\"No\"),\"\")","v":""},{"$f":"IF('II_Plantejar Ració'!$E17>0,IF(AC16>0,1,\"No\"),\"\")","v":""},{"$f":"IF('II_Plantejar Ració'!$E17>0,IF(AD16>0,1,\"No\"),\"\")","v":""},{"$f":"IF('II_Plantejar Ració'!$E17>0,IF(AE16>0,1,\"No\"),\"\")","v":""},{"$f":"IF('II_Plantejar Ració'!$E17>0,IF(AF16>0,1,\"No\"),\"\")","v":""},{"$f":"IF('II_Plantejar Ració'!$E17>0,IF(AG16>0,1,\"No\"),\"\")","v":""},{"$f":"IF('II_Plantejar Ració'!$E17>0,IF(AH16>0,1,\"No\"),\"\")","v":""},{"$f":"IF('II_Plantejar Ració'!$E17>0,IF(AI16>0,1,\"No\"),\"\")","v":""},{"$f":"IF('II_Plantejar Ració'!$E17>0,IF(AJ16>0,1,\"No\"),\"\")","v":""},{"$f":"IF('II_Plantejar Ració'!$E17>0,IF(AK16>0,1,\"No\"),\"\")","v":""},{"$f":"IF('II_Plantejar Ració'!$E17>0,IF(AL16>0,1,\"No\"),\"\")","v":""},{"$f":"IF('II_Plantejar Ració'!$E17>0,IF(AM16>0,1,\"No\"),\"\")","v":""},0,0,0,0,0,0,0,0,0,0,0,0,0,0,0,0,0,0,0,0,0,0,0,0,0,0,0,0,0,0,0,0,0,0,0,0]
[null,{"$f":"IF(OFFSET('Taula Concentrats'!$A$1,C17,0,1,1)=0,\"\",OFFSET('Taula Concentrats'!$A$1,C17,0,1,1))","v":""},1,{"$f":"OFFSET('Taula Concentrats'!$A$1,$C17,$D$2,1,1)","v":0},{"$f":"OFFSET('Taula Concentrats'!$A$1,$C17,$E$2,1,1)","v":0},{"$f":"OFFSET('Taula Concentrats'!$A$1,$C17,$F$2,1,1)","v":0},{"$f":"OFFSET('Taula Concentrats'!$A$1,$C17,$G$2,1,1)","v":0},{"$f":"OFFSET('Taula Concentrats'!$A$1,$C17,$H$2,1,1)","v":0},{"$f":"OFFSET('Taula Concentrats'!$A$1,$C17,$I$2,1,1)","v":0},{"$f":"OFFSET('Taula Concentrats'!$A$1,$C17,$J$2,1,1)","v":0},{"$f":"OFFSET('Taula Concentrats'!$A$1,$C17,$K$2,1,1)","v":0},{"$f":"OFFSET('Taula Concentrats'!$A$1,$C17,$L$2,1,1)","v":0},{"$f":"OFFSET('Taula Concentrats'!$A$1,$C17,$M$2,1,1)","v":0},{"$f":"OFFSET('Taula Concentrats'!$A$1,$C17,$N$2,1,1)","v":0},{"$f":"OFFSET('Taula Concentrats'!$A$1,$C17,$O$2,1,1)","v":0},{"$f":"OFFSET('Taula Concentrats'!$A$1,$C17,$P$2,1,1)","v":0},{"$f":"OFFSET('Taula Concentrats'!$A$1,$C17,$Q$2,1,1)","v":0},{"$f":"OFFSET('Taula Concentrats'!$A$1,$C17,$R$2,1,1)","v":0},{"$f":"OFFSET('Taula Concentrats'!$A$1,$C17,$S$2,1,1)","v":0},{"$f":"OFFSET('Taula Concentrats'!$A$1,$C17,$T$2,1,1)","v":0},{"$f":"OFFSET('Taula Concentrats'!$A$1,$C17,$U$2,1,1)","v":0},{"$f":"OFFSET('Taula Concentrats'!$A$1,$C17,$V$2,1,1)","v":0},{"$f":"OFFSET('Taula Concentrats'!$A$1,$C17,$W$2,1,1)","v":0},{"$f":"OFFSET('Taula Concentrats'!$A$1,$C17,$X$2,1,1)","v":0},{"$f":"OFFSET('Taula Concentrats'!$A$1,$C17,$Y$2,1,1)","v":0},{"$f":"OFFSET('Taula Concentrats'!$A$1,$C17,$Z$2,1,1)","v":0},{"$f":"OFFSET('Taula Concentrats'!$A$1,$C17,$AA$2,1,1)","v":0},{"$f":"OFFSET('Taula Concentrats'!$A$1,$C17,$AB$2,1,1)","v":0},{"$f":"OFFSET('Taula Concentrats'!$A$1,$C17,$AC$2,1,1)","v":0},{"$f":"OFFSET('Taula Concentrats'!$A$1,$C17,$AD$2,1,1)","v":0},{"$f":"OFFSET('Taula Concentrats'!$A$1,$C17,$AE$2,1,1)","v":0},{"$f":"OFFSET('Taula Concentrats'!$A$1,$C17,$AF$2,1,1)","v":0},{"$f":"OFFSET('Taula Concentrats'!$A$1,$C17,$AG$2,1,1)","v":0},{"$f":"OFFSET('Taula Concentrats'!$A$1,$C17,$AH$2,1,1)","v":0},{"$f":"OFFSET('Taula Concentrats'!$A$1,$C17,$AI$2,1,1)","v":0},{"$f":"OFFSET('Taula Concentrats'!$A$1,$C17,$AJ$2,1,1)","v":0},{"$f":"OFFSET('Taula Concentrats'!$A$1,$C17,$AK$2,1,1)","v":0},{"$f":"OFFSET('Taula Concentrats'!$A$1,$C17,$AL$2,1,1)","v":0},{"$f":"OFFSET('Taula Concentrats'!$A$1,$C17,$AM$2,1,1)","v":0},{"$f":"OFFSET('Taula Concentrats'!$A$1,$C17,$AN$2,1,1)","v":0},{"$f":"OFFSET('Taula Farratges'!$A$1,$C17,$AO$2,1,1)","v":0},{"$f":"IF('II_Plantejar Ració'!$E18>0,IF(E17>=0,1,\"No\"),\"\")","v":""},{"$f":"IF('II_Plantejar Ració'!$E18>0,IF(F17>0,1,\"No\"),\"\")","v":""},{"$f":"IF('II_Plantejar Ració'!$E18>0,IF(G17>0,1,\"No\"),\"\")","v":""},{"$f":"IF('II_Plantejar Ració'!$E18>0,IF(H17=0,\"No\",1),\"\")","v":""},{"$f":"IF('II_Plantejar Ració'!$E18>0,IF(AE17>0,1,\"No\"),\"\")","v":""},{"$f":"IF('II_Plantejar Ració'!$E18>0,IF(I17>0,1,\"No\"),\"\")","v":""},{"$f":"IF('II_Plantejar Ració'!$E18>0,IF(J17>0,1,\"No\"),\"\")","v":""},{"$f":"IF('II_Plantejar Ració'!$E18>0,IF(K17>0,1,\"No\"),\"\")","v":""},{"$f":"IF('II_Plantejar Ració'!$E18>0,IF(L17>0,1,\"No\"),\"\")","v":""},{"$f":"IF('II_Plantejar Ració'!$E18>0,IF(M17>0,1,\"No\"),\"\")","v":""},{"$f":"IF('II_Plantejar Ració'!$E18>0,IF(N17>0,1,\"No\"),\"\")","v":""},{"$f":"IF('II_Plantejar Ració'!$E18>0,IF(O17>0,1,\"No\"),\"\")","v":""},{"$f":"IF('II_Plantejar Ració'!$E18>0,IF(P17>0,1,\"No\"),\"\")","v":""},{"$f":"IF('II_Plantejar Ració'!$E18>0,IF(Q17>0,1,\"No\"),\"\")","v":""},{"$f":"IF('II_Plantejar Ració'!$E18>0,IF(R17>0,1,\"No\"),\"\")","v":""},{"$f":"IF('II_Plantejar Ració'!$E18>0,IF(S17>0,1,\"No\"),\"\")","v":""},{"$f":"IF('II_Plantejar Ració'!$E18>0,IF(T17>0,1,\"No\"),\"\")","v":""},{"$f":"IF('II_Plantejar Ració'!$E18>0,IF(U17>0,1,\"No\"),\"\")","v":""},{"$f":"IF('II_Plantejar Ració'!$E18>0,IF(V17>0,1,\"No\"),\"\")","v":""},{"$f":"IF('II_Plantejar Ració'!$E18>0,IF(W17>0,1,\"No\"),\"\")","v":""},{"$f":"IF('II_Plantejar Ració'!$E18>0,IF(X17>0,1,\"No\"),\"\")","v":""},{"$f":"IF('II_Plantejar Ració'!$E18>0,IF(Y17>0,1,\"No\"),\"\")","v":""},{"$f":"IF('II_Plantejar Ració'!$E18>0,IF(Z17>0,1,\"No\"),\"\")","v":""},{"$f":"IF('II_Plantejar Ració'!$E18>0,IF(AA17>0,1,\"No\"),\"\")","v":""},{"$f":"IF('II_Plantejar Ració'!$E18>0,IF(AB17>0,1,\"No\"),\"\")","v":""},{"$f":"IF('II_Plantejar Ració'!$E18>0,IF(AC17>0,1,\"No\"),\"\")","v":""},{"$f":"IF('II_Plantejar Ració'!$E18>0,IF(AD17>0,1,\"No\"),\"\")","v":""},{"$f":"IF('II_Plantejar Ració'!$E18>0,IF(AE17>0,1,\"No\"),\"\")","v":""},{"$f":"IF('II_Plantejar Ració'!$E18>0,IF(AF17>0,1,\"No\"),\"\")","v":""},{"$f":"IF('II_Plantejar Ració'!$E18>0,IF(AG17>0,1,\"No\"),\"\")","v":""},{"$f":"IF('II_Plantejar Ració'!$E18>0,IF(AH17>0,1,\"No\"),\"\")","v":""},{"$f":"IF('II_Plantejar Ració'!$E18>0,IF(AI17>0,1,\"No\"),\"\")","v":""},{"$f":"IF('II_Plantejar Ració'!$E18>0,IF(AJ17>0,1,\"No\"),\"\")","v":""},{"$f":"IF('II_Plantejar Ració'!$E18>0,IF(AK17>0,1,\"No\"),\"\")","v":""},{"$f":"IF('II_Plantejar Ració'!$E18>0,IF(AL17>0,1,\"No\"),\"\")","v":""},{"$f":"IF('II_Plantejar Ració'!$E18>0,IF(AM17>0,1,\"No\"),\"\")","v":""},0,0,0,0,0,0,0,0,0,0,0,0,0,0,0,0,0,0,0,0,0,0,0,0,0,0,0,0,0,0,0,0,0,0,0,0]
[null,{"$f":"IF(OFFSET('Taula Concentrats'!$A$1,C18,0,1,1)=0,\"\",OFFSET('Taula Concentrats'!$A$1,C18,0,1,1))","v":""},176,{"$f":"OFFSET('Taula Concentrats'!$A$1,$C18,$D$2,1,1)","v":0},{"$f":"OFFSET('Taula Concentrats'!$A$1,$C18,$E$2,1,1)","v":0},{"$f":"OFFSET('Taula Concentrats'!$A$1,$C18,$F$2,1,1)","v":0},{"$f":"OFFSET('Taula Concentrats'!$A$1,$C18,$G$2,1,1)","v":0},{"$f":"OFFSET('Taula Concentrats'!$A$1,$C18,$H$2,1,1)","v":0},{"$f":"OFFSET('Taula Concentrats'!$A$1,$C18,$I$2,1,1)","v":0},{"$f":"OFFSET('Taula Concentrats'!$A$1,$C18,$J$2,1,1)","v":0},{"$f":"OFFSET('Taula Concentrats'!$A$1,$C18,$K$2,1,1)","v":0},{"$f":"OFFSET('Taula Concentrats'!$A$1,$C18,$L$2,1,1)","v":0},{"$f":"OFFSET('Taula Concentrats'!$A$1,$C18,$M$2,1,1)","v":0},{"$f":"OFFSET('Taula Concentrats'!$A$1,$C18,$N$2,1,1)","v":0},{"$f":"OFFSET('Taula Concentrats'!$A$1,$C18,$O$2,1,1)","v":0},{"$f":"OFFSET('Taula Concentrats'!$A$1,$C18,$P$2,1,1)","v":0},{"$f":"OFFSET('Taula Concentrats'!$A$1,$C18,$Q$2,1,1)","v":0},{"$f":"OFFSET('Taula Concentrats'!$A$1,$C18,$R$2,1,1)","v":0},{"$f":"OFFSET('Taula Concentrats'!$A$1,$C18,$S$2,1,1)","v":0},{"$f":"OFFSET('Taula Concentrats'!$A$1,$C18,$T$2,1,1)","v":0},{"$f":"OFFSET('Taula Concentrats'!$A$1,$C18,$U$2,1,1)","v":0},{"$f":"OFFSET('Taula Concentrats'!$A$1,$C18,$V$2,1,1)","v":0},{"$f":"OFFSET('Taula Concentrats'!$A$1,$C18,$W$2,1,1)","v":0},{"$f":"OFFSET('Taula Concentrats'!$A$1,$C18,$X$2,1,1)","v":0},{"$f":"OFFSET('Taula Concentrats'!$A$1,$C18,$Y$2,1,1)","v":0},{"$f":"OFFSET('Taula Concentrats'!$A$1,$C18,$Z$2,1,1)","v":0},{"$f":"OFFSET('Taula Concentrats'!$A$1,$C18,$AA$2,1,1)","v":0},{"$f":"OFFSET('Taula Concentrats'!$A$1,$C18,$AB$2,1,1)","v":0},{"$f":"OFFSET('Taula Concentrats'!$A$1,$C18,$AC$2,1,1)","v":0},{"$f":"OFFSET('Taula Concentrats'!$A$1,$C18,$AD$2,1,1)","v":0},{"$f":"OFFSET('Taula Concentrats'!$A$1,$C18,$AE$2,1,1)","v":0},{"$f":"OFFSET('Taula Concentrats'!$A$1,$C18,$AF$2,1,1)","v":0},{"$f":"OFFSET('Taula Concentrats'!$A$1,$C18,$AG$2,1,1)","v":0},{"$f":"OFFSET('Taula Concentrats'!$A$1,$C18,$AH$2,1,1)","v":0},{"$f":"OFFSET('Taula Concentrats'!$A$1,$C18,$AI$2,1,1)","v":0},{"$f":"OFFSET('Taula Concentrats'!$A$1,$C18,$AJ$2,1,1)","v":0},{"$f":"OFFSET('Taula Concentrats'!$A$1,$C18,$AK$2,1,1)","v":0},{"$f":"OFFSET('Taula Concentrats'!$A$1,$C18,$AL$2,1,1)","v":0},{"$f":"OFFSET('Taula Concentrats'!$A$1,$C18,$AM$2,1,1)","v":0},{"$f":"OFFSET('Taula Concentrats'!$A$1,$C18,$AN$2,1,1)","v":0},{"$f":"OFFSET('Taula Farratges'!$A$1,$C18,$AO$2,1,1)","v":0},{"$f":"IF('II_Plantejar Ració'!$E19>0,IF(E18>=0,1,\"No\"),\"\")","v":""},{"$f":"IF('II_Plantejar Ració'!$E19>0,IF(F18>0,1,\"No\"),\"\")","v":""},{"$f":"IF('II_Plantejar Ració'!$E19>0,IF(G18>0,1,\"No\"),\"\")","v":""},{"$f":"IF('II_Plantejar Ració'!$E19>0,IF(H18=0,\"No\",1),\"\")","v":""},{"$f":"IF('II_Plantejar Ració'!$E19>0,IF(AE18>0,1,\"No\"),\"\")","v":""},{"$f":"IF('II_Plantejar Ració'!$E19>0,IF(I18>0,1,\"No\"),\"\")","v":""},{"$f":"IF('II_Plantejar Ració'!$E19>0,IF(J18>0,1,\"No\"),\"\")","v":""},{"$f":"IF('II_Plantejar Ració'!$E19>0,IF(K18>0,1,\"No\"),\"\")","v":""},{"$f":"IF('II_Plantejar Ració'!$E19>0,IF(L18>0,1,\"No\"),\"\")","v":""},{"$f":"IF('II_Plantejar Ració'!$E19>0,IF(M18>0,1,\"No\"),\"\")","v":""},{"$f":"IF('II_Plantejar Ració'!$E19>0,IF(N18>0,1,\"No\"),\"\")","v":""},{"$f":"IF('II_Plantejar Ració'!$E19>0,IF(O18>0,1,\"No\"),\"\")","v":""},{"$f":"IF('II_Plantejar Ració'!$E19>0,IF(P18>0,1,\"No\"),\"\")","v":""},{"$f":"IF('II_Plantejar Ració'!$E19>0,IF(Q18>0,1,\"No\"),\"\")","v":""},{"$f":"IF('II_Plantejar Ració'!$E19>0,IF(R18>0,1,\"No\"),\"\")","v":""},{"$f":"IF('II_Plantejar Ració'!$E19>0,IF(S18>0,1,\"No\"),\"\")","v":""},{"$f":"IF('II_Plantejar Ració'!$E19>0,IF(T18>0,1,\"No\"),\"\")","v":""},{"$f":"IF('II_Plantejar Ració'!$E19>0,IF(U18>0,1,\"No\"),\"\")","v":""},{"$f":"IF('II_Plantejar Ració'!$E19>0,IF(V18>0,1,\"No\"),\"\")","v":""},{"$f":"IF('II_Plantejar Ració'!$E19>0,IF(W18>0,1,\"No\"),\"\")","v":""},{"$f":"IF('II_Plantejar Ració'!$E19>0,IF(X18>0,1,\"No\"),\"\")","v":""},{"$f":"IF('II_Plantejar Ració'!$E19>0,IF(Y18>0,1,\"No\"),\"\")","v":""},{"$f":"IF('II_Plantejar Ració'!$E19>0,IF(Z18>0,1,\"No\"),\"\")","v":""},{"$f":"IF('II_Plantejar Ració'!$E19>0,IF(AA18>0,1,\"No\"),\"\")","v":""},{"$f":"IF('II_Plantejar Ració'!$E19>0,IF(AB18>0,1,\"No\"),\"\")","v":""},{"$f":"IF('II_Plantejar Ració'!$E19>0,IF(AC18>0,1,\"No\"),\"\")","v":""},{"$f":"IF('II_Plantejar Ració'!$E19>0,IF(AD18>0,1,\"No\"),\"\")","v":""},{"$f":"IF('II_Plantejar Ració'!$E19>0,IF(AE18>0,1,\"No\"),\"\")","v":""},{"$f":"IF('II_Plantejar Ració'!$E19>0,IF(AF18>0,1,\"No\"),\"\")","v":""},{"$f":"IF('II_Plantejar Ració'!$E19>0,IF(AG18>0,1,\"No\"),\"\")","v":""},{"$f":"IF('II_Plantejar Ració'!$E19>0,IF(AH18>0,1,\"No\"),\"\")","v":""},{"$f":"IF('II_Plantejar Ració'!$E19>0,IF(AI18>0,1,\"No\"),\"\")","v":""},{"$f":"IF('II_Plantejar Ració'!$E19>0,IF(AJ18>0,1,\"No\"),\"\")","v":""},{"$f":"IF('II_Plantejar Ració'!$E19>0,IF(AK18>0,1,\"No\"),\"\")","v":""},{"$f":"IF('II_Plantejar Ració'!$E19>0,IF(AL18>0,1,\"No\"),\"\")","v":""},{"$f":"IF('II_Plantejar Ració'!$E19>0,IF(AM18>0,1,\"No\"),\"\")","v":""},0,0,0,0,0,0,0,0,0,0,0,0,0,0,0,0,0,0,0,0,0,0,0,0,0,0,0,0,0,0,0,0,0,0,0,0]
[null,{"$f":"IF(OFFSET('Taula Concentrats'!$A$1,C19,0,1,1)=0,\"\",OFFSET('Taula Concentrats'!$A$1,C19,0,1,1))","v":""},168,{"$f":"OFFSET('Taula Concentrats'!$A$1,$C19,$D$2,1,1)","v":0},{"$f":"OFFSET('Taula Concentrats'!$A$1,$C19,$E$2,1,1)","v":0},{"$f":"OFFSET('Taula Concentrats'!$A$1,$C19,$F$2,1,1)","v":0},{"$f":"OFFSET('Taula Concentrats'!$A$1,$C19,$G$2,1,1)","v":0},{"$f":"OFFSET('Taula Concentrats'!$A$1,$C19,$H$2,1,1)","v":0},{"$f":"OFFSET('Taula Concentrats'!$A$1,$C19,$I$2,1,1)","v":0},{"$f":"OFFSET('Taula Concentrats'!$A$1,$C19,$J$2,1,1)","v":0},{"$f":"OFFSET('Taula Concentrats'!$A$1,$C19,$K$2,1,1)","v":0},{"$f":"OFFSET('Taula Concentrats'!$A$1,$C19,$L$2,1,1)","v":0},{"$f":"OFFSET('Taula Concentrats'!$A$1,$C19,$M$2,1,1)","v":0},{"$f":"OFFSET('Taula Concentrats'!$A$1,$C19,$N$2,1,1)","v":0},{"$f":"OFFSET('Taula Concentrats'!$A$1,$C19,$O$2,1,1)","v":0},{"$f":"OFFSET('Taula Concentrats'!$A$1,$C19,$P$2,1,1)","v":0},{"$f":"OFFSET('Taula Concentrats'!$A$1,$C19,$Q$2,1,1)","v":0},{"$f":"OFFSET('Taula Concentrats'!$A$1,$C19,$R$2,1,1)","v":0},{"$f":"OFFSET('Taula Concentrats'!$A$1,$C19,$S$2,1,1)","v":0},{"$f":"OFFSET('Taula Concentrats'!$A$1,$C19,$T$2,1,1)","v":0},{"$f":"OFFSET('Taula Concentrats'!$A$1,$C19,$U$2,1,1)","v":0},{"$f":"OFFSET('Taula Concentrats'!$A$1,$C19,$V$2,1,1)","v":0},{"$f":"OFFSET('Taula Concentrats'!$A$1,$C19,$W$2,1,1)","v":0},{"$f":"OFFSET('Taula Concentrats'!$A$1,$C19,$X$2,1,1)","v":0},{"$f":"OFFSET('Taula Concentrats'!$A$1,$C19,$Y$2,1,1)","v":0},{"$f":"OFFSET('Taula Concentrats'!$A$1,$C19,$Z$2,1,1)","v":0},{"$f":"OFFSET('Taula Concentrats'!$A$1,$C19,$AA$2,1,1)","v":0},{"$f":"OFFSET('Taula Concentrats'!$A$1,$C19,$AB$2,1,1)","v":0},{"$f":"OFFSET('Taula Concentrats'!$A$1,$C19,$AC$2,1,1)","v":0},{"$f":"OFFSET('Taula Concentrats'!$A$1,$C19,$AD$2,1,1)","v":0},{"$f":"OFFSET('Taula Concentrats'!$A$1,$C19,$AE$2,1,1)","v":0},{"$f":"OFFSET('Taula Concentrats'!$A$1,$C19,$AF$2,1,1)","v":0},{"$f":"OFFSET('Taula Concentrats'!$A$1,$C19,$AG$2,1,1)","v":0},{"$f":"OFFSET('Taula Concentrats'!$A$1,$C19,$AH$2,1,1)","v":0},{"$f":"OFFSET('Taula Concentrats'!$A$1,$C19,$AI$2,1,1)","v":0},{"$f":"OFFSET('Taula Concentrats'!$A$1,$C19,$AJ$2,1,1)","v":0},{"$f":"OFFSET('Taula Concentrats'!$A$1,$C19,$AK$2,1,1)","v":0},{"$f":"OFFSET('Taula Concentrats'!$A$1,$C19,$AL$2,1,1)","v":0},{"$f":"OFFSET('Taula Concentrats'!$A$1,$C19,$AM$2,1,1)","v":0},{"$f":"OFFSET('Taula Concentrats'!$A$1,$C19,$AN$2,1,1)","v":0},{"$f":"OFFSET('Taula Farratges'!$A$1,$C19,$AO$2,1,1)","v":0},{"$f":"IF('II_Plantejar Ració'!$E20>0,IF(E19>=0,1,\"No\"),\"\")","v":""},{"$f":"IF('II_Plantejar Ració'!$E20>0,IF(F19>0,1,\"No\"),\"\")","v":""},{"$f":"IF('II_Plantejar Ració'!$E20>0,IF(G19>0,1,\"No\"),\"\")","v":""},{"$f":"IF('II_Plantejar Ració'!$E20>0,IF(H19=0,\"No\",1),\"\")","v":""},{"$f":"IF('II_Plantejar Ració'!$E20>0,IF(AE19>0,1,\"No\"),\"\")","v":""},{"$f":"IF('II_Plantejar Ració'!$E20>0,IF(I19>0,1,\"No\"),\"\")","v":""},{"$f":"IF('II_Plantejar Ració'!$E20>0,IF(J19>0,1,\"No\"),\"\")","v":""},{"$f":"IF('II_Plantejar Ració'!$E20>0,IF(K19>0,1,\"No\"),\"\")","v":""},{"$f":"IF('II_Plantejar Ració'!$E20>0,IF(L19>0,1,\"No\"),\"\")","v":""},{"$f":"IF('II_Plantejar Ració'!$E20>0,IF(M19>0,1,\"No\"),\"\")","v":""},{"$f":"IF('II_Plantejar Ració'!$E20>0,IF(N19>0,1,\"No\"),\"\")","v":""},{"$f":"IF('II_Plantejar Ració'!$E20>0,IF(O19>0,1,\"No\"),\"\")","v":""},{"$f":"IF('II_Plantejar Ració'!$E20>0,IF(P19>0,1,\"No\"),\"\")","v":""},{"$f":"IF('II_Plantejar Ració'!$E20>0,IF(Q19>0,1,\"No\"),\"\")","v":""},{"$f":"IF('II_Plantejar Ració'!$E20>0,IF(R19>0,1,\"No\"),\"\")","v":""},{"$f":"IF('II_Plantejar Ració'!$E20>0,IF(S19>0,1,\"No\"),\"\")","v":""},{"$f":"IF('II_Plantejar Ració'!$E20>0,IF(T19>0,1,\"No\"),\"\")","v":""},{"$f":"IF('II_Plantejar Ració'!$E20>0,IF(U19>0,1,\"No\"),\"\")","v":""},{"$f":"IF('II_Plantejar Ració'!$E20>0,IF(V19>0,1,\"No\"),\"\")","v":""},{"$f":"IF('II_Plantejar Ració'!$E20>0,IF(W19>0,1,\"No\"),\"\")","v":""},{"$f":"IF('II_Plantejar Ració'!$E20>0,IF(X19>0,1,\"No\"),\"\")","v":""},{"$f":"IF('II_Plantejar Ració'!$E20>0,IF(Y19>0,1,\"No\"),\"\")","v":""},{"$f":"IF('II_Plantejar Ració'!$E20>0,IF(Z19>0,1,\"No\"),\"\")","v":""},{"$f":"IF('II_Plantejar Ració'!$E20>0,IF(AA19>0,1,\"No\"),\"\")","v":""},{"$f":"IF('II_Plantejar Ració'!$E20>0,IF(AB19>0,1,\"No\"),\"\")","v":""},{"$f":"IF('II_Plantejar Ració'!$E20>0,IF(AC19>0,1,\"No\"),\"\")","v":""},{"$f":"IF('II_Plantejar Ració'!$E20>0,IF(AD19>0,1,\"No\"),\"\")","v":""},{"$f":"IF('II_Plantejar Ració'!$E20>0,IF(AE19>0,1,\"No\"),\"\")","v":""},{"$f":"IF('II_Plantejar Ració'!$E20>0,IF(AF19>0,1,\"No\"),\"\")","v":""},{"$f":"IF('II_Plantejar Ració'!$E20>0,IF(AG19>0,1,\"No\"),\"\")","v":""},{"$f":"IF('II_Plantejar Ració'!$E20>0,IF(AH19>0,1,\"No\"),\"\")","v":""},{"$f":"IF('II_Plantejar Ració'!$E20>0,IF(AI19>0,1,\"No\"),\"\")","v":""},{"$f":"IF('II_Plantejar Ració'!$E20>0,IF(AJ19>0,1,\"No\"),\"\")","v":""},{"$f":"IF('II_Plantejar Ració'!$E20>0,IF(AK19>0,1,\"No\"),\"\")","v":""},{"$f":"IF('II_Plantejar Ració'!$E20>0,IF(AL19>0,1,\"No\"),\"\")","v":""},{"$f":"IF('II_Plantejar Ració'!$E20>0,IF(AM19>0,1,\"No\"),\"\")","v":""},0,0,0,0,0,0,0,0,0,0,0,0,0,0,0,0,0,0,0,0,0,0,0,0,0,0,0,0,0,0,0,0,0,0,0,0]
["MINERALS",{"$f":"IF(OFFSET('Taula Minerals-aa'!$A$1,C20,0,1,1)=0,\"\",OFFSET('Taula Minerals-aa'!$A$1,C20,0,1,1))","v":"Fosfat bicàlcic"},10,{"$f":"OFFSET('Taula Minerals-aa'!$A$1,$C20,D2,1,1)","v":98.8},{"$f":"OFFSET('Taula Minerals-aa'!$A$1,$C20,E2,1,1)","v":0},{"$f":"OFFSET('Taula Minerals-aa'!$A$1,$C20,F2,1,1)","v":0},{"$f":"OFFSET('Taula Minerals-aa'!$A$1,$C20,G2,1,1)","v":0},{"$f":"OFFSET('Taula Minerals-aa'!$A$1,$C20,H2,1,1)","v":0},{"$f":"OFFSET('Taula Minerals-aa'!$A$1,$C20,I2,1,1)","v":244},{"$f":"OFFSET('Taula Minerals-aa'!$A$1,$C20,J2,1,1)","v":180},{"$f":"OFFSET('Taula Minerals-aa'!$A$1,$C20,K$2,1,1)","v":5},{"$f":"OFFSET('Taula Minerals-aa'!$A$1,$C20,L$2,1,1)","v":1.2},{"$f":"OFFSET('Taula Minerals-aa'!$A$1,$C20,M$2,1,1)","v":0.8},{"$f":"OFFSET('Taula Minerals-aa'!$A$1,$C20,N$2,1,1)","v":11},{"$f":"OFFSET('Taula Minerals-aa'!$A$1,$C20,O$2,1,1)","v":0.4},{"$f":"OFFSET('Taula Minerals-aa'!$A$1,$C20,P$2,1,1)","v":7800},{"$f":"OFFSET('Taula Minerals-aa'!$A$1,$C20,Q$2,1,1)","v":0},{"$f":"OFFSET('Taula Minerals-aa'!$A$1,$C20,$R$2,1,1)","v":15},{"$f":"OFFSET('Taula Minerals-aa'!$A$1,$C20,$S$2,1,1)","v":0},{"$f":"OFFSET('Taula Minerals-aa'!$A$1,$C20,$T$2,1,1)","v":0},{"$f":"OFFSET('Taula Minerals-aa'!$A$1,$C20,$U$2,1,1)","v":0},{"$f":"OFFSET('Taula Minerals-aa'!$A$1,$C20,$V$2,1,1)","v":0},{"$f":"OFFSET('Taula Minerals-aa'!$A$1,$C20,$W$2,1,1)","v":0},{"$f":"OFFSET('Taula Minerals-aa'!$A$1,$C20,$X$2,1,1)","v":0},{"$f":"OFFSET('Taula Minerals-aa'!$A$1,$C20,$Y$2,1,1)","v":0},{"$f":"OFFSET('Taula Minerals-aa'!$A$1,$C20,$Z$2,1,1)","v":0},{"$f":"OFFSET('Taula Minerals-aa'!$A$1,$C20,$AA$2,1,1)","v":0},{"$f":"OFFSET('Taula Minerals-aa'!$A$1,$C20,$AB$2,1,1)","v":0},{"$f":"OFFSET('Taula Minerals-aa'!$A$1,$C20,$AC$2,1,1)","v":0},{"$f":"OFFSET('Taula Minerals-aa'!$A$1,$C20,$AD$2,1,1)","v":0},{"$f":"OFFSET('Taula Minerals-aa'!$A$1,$C20,$AE$2,1,1)","v":0},{"$f":"OFFSET('Taula Minerals-aa'!$A$1,$C20,$AF$2,1,1)","v":0},{"$f":"OFFSET('Taula Minerals-aa'!$A$1,$C20,$AG$2,1,1)","v":0},{"$f":"OFFSET('Taula Minerals-aa'!$A$1,$C20,$AH$2,1,1)","v":0},{"$f":"OFFSET('Taula Minerals-aa'!$A$1,$C20,$AI$2,1,1)","v":0},{"$f":"OFFSET('Taula Minerals-aa'!$A$1,$C20,$AJ$2,1,1)","v":0},{"$f":"OFFSET('Taula Minerals-aa'!$A$1,$C20,$AK$2,1,1)","v":0},{"$f":"OFFSET('Taula Minerals-aa'!$A$1,$C20,$AL$2,1,1)","v":0},{"$f":"OFFSET('Taula Minerals-aa'!$A$1,$C20,$AM$2,1,1)","v":836},{"$f":"OFFSET('Taula Minerals-aa'!$A$1,$C20,$AN$2,1,1)","v":0},{"$f":"OFFSET('Taula Farratges'!$A$1,$C20,$AO$2,1,1)","v":534.27091229999985},{"$f":"SUM(AP3:AP19)","v":1},1,1,1,1,0,0,0,0,0,0,0,0,0,0,0,0,0,0,0,0,0,1,1,0,1,1,1,1,1,1,1,1,1,1,1,{"$f":"SUM(BZ3:BZ19)","v":1},{"$f":"SUM(CA3:CA19)","v":1},1,1,1,1,1,1,1,1,1,1,1,1,1,1,1,1,1,1,1,1,1,1,1,1,1,1,1,{"$f":"SUM(DC3:DC19)","v":1},1,1,1,1,1,1]
[null,{"$f":"IF(OFFSET('Taula Minerals-aa'!$A$1,C21,0,1,1)=0,\"\",OFFSET('Taula Minerals-aa'!$A$1,C21,0,1,1))","v":"Carbonat càlcic"},3,{"$f":"OFFSET('Taula Minerals-aa'!$A$1,$C21,D2,1,1)","v":98},{"$f":"OFFSET('Taula Minerals-aa'!$A$1,$C21,E2,1,1)","v":0},{"$f":"OFFSET('Taula Minerals-aa'!$A$1,$C21,F2,1,1)","v":0},{"$f":"OFFSET('Taula Minerals-aa'!$A$1,$C21,G2,1,1)","v":0},{"$f":"OFFSET('Taula Minerals-aa'!$A$1,$C21,H2,1,1)","v":0},{"$f":"OFFSET('Taula Minerals-aa'!$A$1,$C21,I2,1,1)","v":383},{"$f":"OFFSET('Taula Minerals-aa'!$A$1,$C21,J2,1,1)","v":0.2},{"$f":"OFFSET('Taula Minerals-aa'!$A$1,$C21,K$2,1,1)","v":14},{"$f":"OFFSET('Taula Minerals-aa'!$A$1,$C21,L$2,1,1)","v":0.7},{"$f":"OFFSET('Taula Minerals-aa'!$A$1,$C21,M$2,1,1)","v":0.7},{"$f":"OFFSET('Taula Minerals-aa'!$A$1,$C21,N$2,1,1)","v":0.7},{"$f":"OFFSET('Taula Minerals-aa'!$A$1,$C21,O$2,1,1)","v":0.2},{"$f":"OFFSET('Taula Minerals-aa'!$A$1,$C21,P$2,1,1)","v":620},{"$f":"OFFSET('Taula Minerals-aa'!$A$1,$C21,Q$2,1,1)","v":0},{"$f":"OFFSET('Taula Minerals-aa'!$A$1,$C21,$R$2,1,1)","v":12},{"$f":"OFFSET('Taula Minerals-aa'!$A$1,$C21,$S$2,1,1)","v":0},{"$f":"OFFSET('Taula Minerals-aa'!$A$1,$C21,$T$2,1,1)","v":0},{"$f":"OFFSET('Taula Minerals-aa'!$A$1,$C21,$U$2,1,1)","v":0},{"$f":"OFFSET('Taula Minerals-aa'!$A$1,$C21,$V$2,1,1)","v":0},{"$f":"OFFSET('Taula Minerals-aa'!$A$1,$C21,$W$2,1,1)","v":0},{"$f":"OFFSET('Taula Minerals-aa'!$A$1,$C21,$X$2,1,1)","v":0},{"$f":"OFFSET('Taula Minerals-aa'!$A$1,$C21,$Y$2,1,1)","v":0},{"$f":"OFFSET('Taula Minerals-aa'!$A$1,$C21,$Z$2,1,1)","v":0},{"$f":"OFFSET('Taula Minerals-aa'!$A$1,$C21,$AA$2,1,1)","v":0},{"$f":"OFFSET('Taula Minerals-aa'!$A$1,$C21,$AB$2,1,1)","v":0},{"$f":"OFFSET('Taula Minerals-aa'!$A$1,$C21,$AC$2,1,1)","v":0},{"$f":"OFFSET('Taula Minerals-aa'!$A$1,$C21,$AD$2,1,1)","v":0},{"$f":"OFFSET('Taula Minerals-aa'!$A$1,$C21,$AE$2,1,1)","v":0},{"$f":"OFFSET('Taula Minerals-aa'!$A$1,$C21,$AF$2,1,1)","v":0},{"$f":"OFFSET('Taula Minerals-aa'!$A$1,$C21,$AG$2,1,1)","v":0},{"$f":"OFFSET('Taula Minerals-aa'!$A$1,$C21,$AH$2,1,1)","v":0},{"$f":"OFFSET('Taula Minerals-aa'!$A$1,$C21,$AI$2,1,1)","v":0},{"$f":"OFFSET('Taula Minerals-aa'!$A$1,$C21,$AJ$2,1,1)","v":0},{"$f":"OFFSET('Taula Minerals-aa'!$A$1,$C21,$AK$2,1,1)","v":0},{"$f":"OFFSET('Taula Minerals-aa'!$A$1,$C21,$AL$2,1,1)","v":0},{"$f":"OFFSET('Taula Minerals-aa'!$A$1,$C21,$AM$2,1,1)","v":955},{"$f":"OFFSET('Taula Minerals-aa'!$A$1,$C21,$AN$2,1,1)","v":0},{"$f":"OFFSET('Taula Farratges'!$A$1,$C21,$AO$2,1,1)","v":628.16571895000016},{"$f":"IF(AP20/BZ20=1,\"\",AP2)","v":""},"","","","","Ca","P",{"$f":"IF(AW20/CG20=1,\"\", AW2)","v":"Mg"},"K","Na","S","Cl","Fe","Co","Cu","Mn","Zn","Iode","Se","Vit A","Vit D","Vit E","","","PDIA","","","","","","","","","",""]
[null,{"$f":"IF(OFFSET('Taula Minerals-aa'!$A$1,C22,0,1,1)=0,\"\",OFFSET('Taula Minerals-aa'!$A$1,C22,0,1,1))","v":"Bicarbonat sòdic"},2,{"$f":"OFFSET('Taula Minerals-aa'!$A$1,$C22,D2,1,1)","v":99.7},{"$f":"OFFSET('Taula Minerals-aa'!$A$1,$C22,E2,1,1)","v":0},{"$f":"OFFSET('Taula Minerals-aa'!$A$1,$C22,F2,1,1)","v":0},{"$f":"OFFSET('Taula Minerals-aa'!$A$1,$C22,G2,1,1)","v":0},{"$f":"OFFSET('Taula Minerals-aa'!$A$1,$C22,H2,1,1)","v":0},{"$f":"OFFSET('Taula Minerals-aa'!$A$1,$C22,I2,1,1)","v":0},{"$f":"OFFSET('Taula Minerals-aa'!$A$1,$C22,J2,1,1)","v":0},{"$f":"OFFSET('Taula Minerals-aa'!$A$1,$C22,K$2,1,1)","v":0},{"$f":"OFFSET('Taula Minerals-aa'!$A$1,$C22,L$2,1,1)","v":0},{"$f":"OFFSET('Taula Minerals-aa'!$A$1,$C22,M$2,1,1)","v":270},{"$f":"OFFSET('Taula Minerals-aa'!$A$1,$C22,N$2,1,1)","v":0},{"$f":"OFFSET('Taula Minerals-aa'!$A$1,$C22,O$2,1,1)","v":0},{"$f":"OFFSET('Taula Minerals-aa'!$A$1,$C22,P$2,1,1)","v":0},{"$f":"OFFSET('Taula Minerals-aa'!$A$1,$C22,Q$2,1,1)","v":0},{"$f":"OFFSET('Taula Minerals-aa'!$A$1,$C22,$R$2,1,1)","v":0},{"$f":"OFFSET('Taula Minerals-aa'!$A$1,$C22,$S$2,1,1)","v":0},{"$f":"OFFSET('Taula Minerals-aa'!$A$1,$C22,$T$2,1,1)","v":0},{"$f":"OFFSET('Taula Minerals-aa'!$A$1,$C22,$U$2,1,1)","v":0},{"$f":"OFFSET('Taula Minerals-aa'!$A$1,$C22,$V$2,1,1)","v":0},{"$f":"OFFSET('Taula Minerals-aa'!$A$1,$C22,$W$2,1,1)","v":0},{"$f":"OFFSET('Taula Minerals-aa'!$A$1,$C22,$X$2,1,1)","v":0},{"$f":"OFFSET('Taula Minerals-aa'!$A$1,$C22,$Y$2,1,1)","v":0},{"$f":"OFFSET('Taula Minerals-aa'!$A$1,$C22,$Z$2,1,1)","v":0},{"$f":"OFFSET('Taula Minerals-aa'!$A$1,$C22,$AA$2,1,1)","v":0},{"$f":"OFFSET('Taula Minerals-aa'!$A$1,$C22,$AB$2,1,1)","v":0},{"$f":"OFFSET('Taula Minerals-aa'!$A$1,$C22,$AC$2,1,1)","v":0},{"$f":"OFFSET('Taula Minerals-aa'!$A$1,$C22,$AD$2,1,1)","v":0},{"$f":"OFFSET('Taula Minerals-aa'!$A$1,$C22,$AE$2,1,1)","v":0},{"$f":"OFFSET('Taula Minerals-aa'!$A$1,$C22,$AF$2,1,1)","v":0},{"$f":"OFFSET('Taula Minerals-aa'!$A$1,$C22,$AG$2,1,1)","v":0},{"$f":"OFFSET('Taula Minerals-aa'!$A$1,$C22,$AH$2,1,1)","v":0},{"$f":"OFFSET('Taula Minerals-aa'!$A$1,$C22,$AI$2,1,1)","v":0},{"$f":"OFFSET('Taula Minerals-aa'!$A$1,$C22,$AJ$2,1,1)","v":0},{"$f":"OFFSET('Taula Minerals-aa'!$A$1,$C22,$AK$2,1,1)","v":0},{"$f":"OFFSET('Taula Minerals-aa'!$A$1,$C22,$AL$2,1,1)","v":0},{"$f":"OFFSET('Taula Minerals-aa'!$A$1,$C22,$AM$2,1,1)","v":0},{"$f":"OFFSET('Taula Minerals-aa'!$A$1,$C22,$AN$2,1,1)","v":0},{"$f":"OFFSET('Taula Farratges'!$A$1,$C22,$AO$2,1,1)","v":566.53268820000017}]
[null,{"$f":"IF(OFFSET('Taula Minerals-aa'!$A$1,C23,0,1,1)=0,\"\",OFFSET('Taula Minerals-aa'!$A$1,C23,0,1,1))","v":""},1,{"$f":"OFFSET('Taula Minerals-aa'!$A$1,$C23,D2,1,1)","v":0},{"$f":"OFFSET('Taula Minerals-aa'!$A$1,$C23,E2,1,1)","v":0},{"$f":"OFFSET('Taula Minerals-aa'!$A$1,$C23,F2,1,1)","v":0},{"$f":"OFFSET('Taula Minerals-aa'!$A$1,$C23,G2,1,1)","v":0},{"$f":"OFFSET('Taula Minerals-aa'!$A$1,$C23,H2,1,1)","v":0},{"$f":"OFFSET('Taula Minerals-aa'!$A$1,$C23,I2,1,1)","v":0},{"$f":"OFFSET('Taula Minerals-aa'!$A$1,$C23,J2,1,1)","v":0},{"$f":"OFFSET('Taula Minerals-aa'!$A$1,$C23,K$2,1,1)","v":0},{"$f":"OFFSET('Taula Minerals-aa'!$A$1,$C23,L$2,1,1)","v":0},{"$f":"OFFSET('Taula Minerals-aa'!$A$1,$C23,M$2,1,1)","v":0},{"$f":"OFFSET('Taula Minerals-aa'!$A$1,$C23,N$2,1,1)","v":0},{"$f":"OFFSET('Taula Minerals-aa'!$A$1,$C23,O$2,1,1)","v":0},{"$f":"OFFSET('Taula Minerals-aa'!$A$1,$C23,P$2,1,1)","v":0},{"$f":"OFFSET('Taula Minerals-aa'!$A$1,$C23,Q$2,1,1)","v":0},{"$f":"OFFSET('Taula Minerals-aa'!$A$1,$C23,$R$2,1,1)","v":0},{"$f":"OFFSET('Taula Minerals-aa'!$A$1,$C23,$S$2,1,1)","v":0},{"$f":"OFFSET('Taula Minerals-aa'!$A$1,$C23,$T$2,1,1)","v":0},{"$f":"OFFSET('Taula Minerals-aa'!$A$1,$C23,$U$2,1,1)","v":0},{"$f":"OFFSET('Taula Minerals-aa'!$A$1,$C23,$V$2,1,1)","v":0},{"$f":"OFFSET('Taula Minerals-aa'!$A$1,$C23,$W$2,1,1)","v":0},{"$f":"OFFSET('Taula Minerals-aa'!$A$1,$C23,$X$2,1,1)","v":0},{"$f":"OFFSET('Taula Minerals-aa'!$A$1,$C23,$Y$2,1,1)","v":0},{"$f":"OFFSET('Taula Minerals-aa'!$A$1,$C23,$Z$2,1,1)","v":0},{"$f":"OFFSET('Taula Minerals-aa'!$A$1,$C23,$AA$2,1,1)","v":0},{"$f":"OFFSET('Taula Minerals-aa'!$A$1,$C23,$AB$2,1,1)","v":0},{"$f":"OFFSET('Taula Minerals-aa'!$A$1,$C23,$AC$2,1,1)","v":0},{"$f":"OFFSET('Taula Minerals-aa'!$A$1,$C23,$AD$2,1,1)","v":0},{"$f":"OFFSET('Taula Minerals-aa'!$A$1,$C23,$AE$2,1,1)","v":0},{"$f":"OFFSET('Taula Minerals-aa'!$A$1,$C23,$AF$2,1,1)","v":0},{"$f":"OFFSET('Taula Minerals-aa'!$A$1,$C23,$AG$2,1,1)","v":0},{"$f":"OFFSET('Taula Minerals-aa'!$A$1,$C23,$AH$2,1,1)","v":0},{"$f":"OFFSET('Taula Minerals-aa'!$A$1,$C23,$AI$2,1,1)","v":0},{"$f":"OFFSET('Taula Minerals-aa'!$A$1,$C23,$AJ$2,1,1)","v":0},{"$f":"OFFSET('Taula Minerals-aa'!$A$1,$C23,$AK$2,1,1)","v":0},{"$f":"OFFSET('Taula Minerals-aa'!$A$1,$C23,$AL$2,1,1)","v":0},{"$f":"OFFSET('Taula Minerals-aa'!$A$1,$C23,$AM$2,1,1)","v":0},{"$f":"OFFSET('Taula Minerals-aa'!$A$1,$C23,$AN$2,1,1)","v":0},{"$f":"OFFSET('Taula Farratges'!$A$1,$C23,$AO$2,1,1)","v":0}]
[null,{"$f":"IF(OFFSET('Taula Minerals-aa'!$A$1,C24,0,1,1)=0,\"\",OFFSET('Taula Minerals-aa'!$A$1,C24,0,1,1))","v":""},1,{"$f":"OFFSET('Taula Minerals-aa'!$A$1,$C24,D2,1,1)","v":0},{"$f":"OFFSET('Taula Minerals-aa'!$A$1,$C24,E2,1,1)","v":0},{"$f":"OFFSET('Taula Minerals-aa'!$A$1,$C24,F2,1,1)","v":0},{"$f":"OFFSET('Taula Minerals-aa'!$A$1,$C24,G2,1,1)","v":0},{"$f":"OFFSET('Taula Minerals-aa'!$A$1,$C24,H2,1,1)","v":0},{"$f":"OFFSET('Taula Minerals-aa'!$A$1,$C24,I2,1,1)","v":0},{"$f":"OFFSET('Taula Minerals-aa'!$A$1,$C24,J2,1,1)","v":0},{"$f":"OFFSET('Taula Minerals-aa'!$A$1,$C24,K$2,1,1)","v":0},{"$f":"OFFSET('Taula Minerals-aa'!$A$1,$C24,L$2,1,1)","v":0},{"$f":"OFFSET('Taula Minerals-aa'!$A$1,$C24,M$2,1,1)","v":0},{"$f":"OFFSET('Taula Minerals-aa'!$A$1,$C24,N$2,1,1)","v":0},{"$f":"OFFSET('Taula Minerals-aa'!$A$1,$C24,O$2,1,1)","v":0},{"$f":"OFFSET('Taula Minerals-aa'!$A$1,$C24,P$2,1,1)","v":0},{"$f":"OFFSET('Taula Minerals-aa'!$A$1,$C24,Q$2,1,1)","v":0},{"$f":"OFFSET('Taula Minerals-aa'!$A$1,$C24,$R$2,1,1)","v":0},{"$f":"OFFSET('Taula Minerals-aa'!$A$1,$C24,$S$2,1,1)","v":0},{"$f":"OFFSET('Taula Minerals-aa'!$A$1,$C24,$T$2,1,1)","v":0},{"$f":"OFFSET('Taula Minerals-aa'!$A$1,$C24,$U$2,1,1)","v":0},{"$f":"OFFSET('Taula Minerals-aa'!$A$1,$C24,$V$2,1,1)","v":0},{"$f":"OFFSET('Taula Minerals-aa'!$A$1,$C24,$W$2,1,1)","v":0},{"$f":"OFFSET('Taula Minerals-aa'!$A$1,$C24,$X$2,1,1)","v":0},{"$f":"OFFSET('Taula Minerals-aa'!$A$1,$C24,$Y$2,1,1)","v":0},{"$f":"OFFSET('Taula Minerals-aa'!$A$1,$C24,$Z$2,1,1)","v":0},{"$f":"OFFSET('Taula Minerals-aa'!$A$1,$C24,$AA$2,1,1)","v":0},{"$f":"OFFSET('Taula Minerals-aa'!$A$1,$C24,$AB$2,1,1)","v":0},{"$f":"OFFSET('Taula Minerals-aa'!$A$1,$C24,$AC$2,1,1)","v":0},{"$f":"OFFSET('Taula Minerals-aa'!$A$1,$C24,$AD$2,1,1)","v":0},{"$f":"OFFSET('Taula Minerals-aa'!$A$1,$C24,$AE$2,1,1)","v":0},{"$f":"OFFSET('Taula Minerals-aa'!$A$1,$C24,$AF$2,1,1)","v":0},{"$f":"OFFSET('Taula Minerals-aa'!$A$1,$C24,$AG$2,1,1)","v":0},{"$f":"OFFSET('Taula Minerals-aa'!$A$1,$C24,$AH$2,1,1)","v":0},{"$f":"OFFSET('Taula Minerals-aa'!$A$1,$C24,$AI$2,1,1)","v":0},{"$f":"OFFSET('Taula Minerals-aa'!$A$1,$C24,$AJ$2,1,1)","v":0},{"$f":"OFFSET('Taula Minerals-aa'!$A$1,$C24,$AK$2,1,1)","v":0},{"$f":"OFFSET('Taula Minerals-aa'!$A$1,$C24,$AL$2,1,1)","v":0},{"$f":"OFFSET('Taula Minerals-aa'!$A$1,$C24,$AM$2,1,1)","v":0},{"$f":"OFFSET('Taula Minerals-aa'!$A$1,$C24,$AN$2,1,1)","v":0},{"$f":"OFFSET('Taula Farratges'!$A$1,$C24,$AO$2,1,1)","v":0}]
[null,{"$f":"IF(OFFSET('Taula Minerals-aa'!$A$1,C25,0,1,1)=0,\"\",OFFSET('Taula Minerals-aa'!$A$1,C25,0,1,1))","v":""},1,{"$f":"OFFSET('Taula Minerals-aa'!$A$1,$C25,D2,1,1)","v":0},{"$f":"OFFSET('Taula Minerals-aa'!$A$1,$C25,E2,1,1)","v":0},{"$f":"OFFSET('Taula Minerals-aa'!$A$1,$C25,F2,1,1)","v":0},{"$f":"OFFSET('Taula Minerals-aa'!$A$1,$C25,G2,1,1)","v":0},{"$f":"OFFSET('Taula Minerals-aa'!$A$1,$C25,H2,1,1)","v":0},{"$f":"OFFSET('Taula Minerals-aa'!$A$1,$C25,I2,1,1)","v":0},{"$f":"OFFSET('Taula Minerals-aa'!$A$1,$C25,J2,1,1)","v":0},{"$f":"OFFSET('Taula Minerals-aa'!$A$1,$C25,K$2,1,1)","v":0},{"$f":"OFFSET('Taula Minerals-aa'!$A$1,$C25,L$2,1,1)","v":0},{"$f":"OFFSET('Taula Minerals-aa'!$A$1,$C25,M$2,1,1)","v":0},{"$f":"OFFSET('Taula Minerals-aa'!$A$1,$C25,N$2,1,1)","v":0},{"$f":"OFFSET('Taula Minerals-aa'!$A$1,$C25,O$2,1,1)","v":0},{"$f":"OFFSET('Taula Minerals-aa'!$A$1,$C25,P$2,1,1)","v":0},{"$f":"OFFSET('Taula Minerals-aa'!$A$1,$C25,Q$2,1,1)","v":0},{"$f":"OFFSET('Taula Minerals-aa'!$A$1,$C25,$R$2,1,1)","v":0},{"$f":"OFFSET('Taula Minerals-aa'!$A$1,$C25,$S$2,1,1)","v":0},{"$f":"OFFSET('Taula Minerals-aa'!$A$1,$C25,$T$2,1,1)","v":0},{"$f":"OFFSET('Taula Minerals-aa'!$A$1,$C25,$U$2,1,1)","v":0},{"$f":"OFFSET('Taula Minerals-aa'!$A$1,$C25,$V$2,1,1)","v":0},{"$f":"OFFSET('Taula Minerals-aa'!$A$1,$C25,$W$2,1,1)","v":0},{"$f":"OFFSET('Taula Minerals-aa'!$A$1,$C25,$X$2,1,1)","v":0},{"$f":"OFFSET('Taula Minerals-aa'!$A$1,$C25,$Y$2,1,1)","v":0},{"$f":"OFFSET('Taula Minerals-aa'!$A$1,$C25,$Z$2,1,1)","v":0},{"$f":"OFFSET('Taula Minerals-aa'!$A$1,$C25,$AA$2,1,1)","v":0},{"$f":"OFFSET('Taula Minerals-aa'!$A$1,$C25,$AB$2,1,1)","v":0},{"$f":"OFFSET('Taula Minerals-aa'!$A$1,$C25,$AC$2,1,1)","v":0},{"$f":"OFFSET('Taula Minerals-aa'!$A$1,$C25,$AD$2,1,1)","v":0},{"$f":"OFFSET('Taula Minerals-aa'!$A$1,$C25,$AE$2,1,1)","v":0},{"$f":"OFFSET('Taula Minerals-aa'!$A$1,$C25,$AF$2,1,1)","v":0},{"$f":"OFFSET('Taula Minerals-aa'!$A$1,$C25,$AG$2,1,1)","v":0},{"$f":"OFFSET('Taula Minerals-aa'!$A$1,$C25,$AH$2,1,1)","v":0},{"$f":"OFFSET('Taula Minerals-aa'!$A$1,$C25,$AI$2,1,1)","v":0},{"$f":"OFFSET('Taula Minerals-aa'!$A$1,$C25,$AJ$2,1,1)","v":0},{"$f":"OFFSET('Taula Minerals-aa'!$A$1,$C25,$AK$2,1,1)","v":0},{"$f":"OFFSET('Taula Minerals-aa'!$A$1,$C25,$AL$2,1,1)","v":0},{"$f":"OFFSET('Taula Minerals-aa'!$A$1,$C25,$AM$2,1,1)","v":0},{"$f":"OFFSET('Taula Minerals-aa'!$A$1,$C25,$AN$2,1,1)","v":0},{"$f":"OFFSET('Taula Farratges'!$A$1,$C25,$AO$2,1,1)","v":0}]
[null,null,null,null,{"$f":"SUMPRODUCT(E3:E25,'II_Plantejar Ració'!$E$4:$E$26)","v":0.16503442478514319},{"$f":"SUMPRODUCT(F3:F25,'II_Plantejar Ració'!$E$4:$E$26)","v":0.13353758331685714},{"$f":"SUMPRODUCT(G3:G25,'II_Plantejar Ració'!$E$4:$E$26)","v":12.330328945022442},{"$f":"SUMPRODUCT(H3:H25,'II_Plantejar Ració'!$E$4:$E$26)","v":2.8774440390274361},{"$f":"SUMPRODUCT(I3:I25,'II_Plantejar Ració'!$E$4:$E$26)","v":0},{"$f":"SUMPRODUCT(J3:J25,'II_Plantejar Ració'!$E$4:$E$26)","v":0},{"$f":"SUMPRODUCT(K3:K25,'II_Plantejar Ració'!$E$4:$E$26)","v":0},{"$f":"SUMPRODUCT(L3:L25,'II_Plantejar Ració'!$E$4:$E$26)","v":0},{"$f":"SUMPRODUCT(M3:M25,'II_Plantejar Ració'!$E$4:$E$26)","v":0},{"$f":"SUMPRODUCT(N3:N25,'II_Plantejar Ració'!$E$4:$E$26)","v":0},{"$f":"SUMPRODUCT(O3:O25,'II_Plantejar Ració'!$E$4:$E$26)","v":0},{"$f":"SUMPRODUCT(P3:P25,'II_Plantejar Ració'!$E$4:$E$26)","v":0},{"$f":"SUMPRODUCT(Q3:Q25,'II_Plantejar Ració'!$E$4:$E$26)","v":0},{"$f":"SUMPRODUCT(R3:R25,'II_Plantejar Ració'!$E$4:$E$26)","v":0},{"$f":"SUMPRODUCT(S3:S25,'II_Plantejar Ració'!$E$4:$E$26)","v":0},{"$f":"SUMPRODUCT(T3:T25,'II_Plantejar Ració'!$E$4:$E$26)","v":0},{"$f":"SUMPRODUCT(U3:U25,'II_Plantejar Ració'!$E$4:$E$26)","v":0},{"$f":"SUMPRODUCT(V3:V25,'II_Plantejar Ració'!$E$4:$E$26)","v":0},{"$f":"SUMPRODUCT(W3:W25,'II_Plantejar Ració'!$E$4:$E$26)","v":0},{"$f":"SUMPRODUCT(X3:X25,'II_Plantejar Ració'!$E$4:$E$26)","v":0},{"$f":"SUMPRODUCT(Y3:Y25,'II_Plantejar Ració'!$E$4:$E$26)","v":0},{"$f":"SUMPRODUCT(Z3:Z25,'II_Plantejar Ració'!$E$4:$E$26)/SUM('II_Plantejar Ració'!E4:E26)","v":15.567499999999997},{"$f":"SUMPRODUCT(AA3:AA25,'II_Plantejar Ració'!$E$4:$E$26)/SUM('II_Plantejar Ració'!E4:E26)","v":0.74},{"$f":"SUMPRODUCT(AB3:AB25,'II_Plantejar Ració'!$E$4:$E$26)/SUM('II_Plantejar Ració'!E4:E26)","v":0},{"$f":"SUMPRODUCT(AC3:AC25,'II_Plantejar Ració'!$E$4:$E$26)","v":23.285550000000001},{"$f":"SUMPRODUCT(AD3:AD25,'II_Plantejar Ració'!$E$4:$E$26)","v":4.5406822500000006},{"$f":"SUMPRODUCT(AE3:AE25,'II_Plantejar Ració'!$E$4:$E$26)/SUM('II_Plantejar Ració'!E4:E26)","v":2.5097055696390158},{"$f":"SUMPRODUCT(AF3:AF25,'II_Plantejar Ració'!$E$4:$E$26)","v":0.10237019429999999},{"$f":"SUMPRODUCT(AG3:AG25,'II_Plantejar Ració'!$E$4:$E$26)","v":91.97961957855},{"$f":"SUMPRODUCT(AH3:AH25,'II_Plantejar Ració'!$E$4:$E$26)","v":3.5350999999999999},{"$f":"SUMPRODUCT(AI3:AI25,'II_Plantejar Ració'!$E$4:$E$26)","v":43.973570000000002},{"$f":"SUMPRODUCT(AJ3:AJ25,'II_Plantejar Ració'!$E$4:$E$26)","v":62.402200000000001},{"$f":"SUMPRODUCT(AK3:AK25,'II_Plantejar Ració'!$E$4:$E$26)","v":57.099550000000001},{"$f":"SUMPRODUCT(AL3:AL25,'II_Plantejar Ració'!$E$4:$E$26)","v":0},{"$f":"SUMPRODUCT(AM3:AM25,'II_Plantejar Ració'!$E$4:$E$26)","v":15.60055},{"$f":"SUMPRODUCT(AN3:AN25,'II_Plantejar Ració'!$E$4:$E$26)","v":0},{"$f":"SUMPRODUCT(AO3:AO25,'II_Plantejar Ració'!$E$4:$E$26)","v":80.203671223540496}]
[]
[]
[]
[null,null,null,null,null,{"$f":"IF(NR!B6=8,2,1)","v":1},null,{"$f":"H3*0.34+H4*0.37+H8*0.29+H9*0.01","v":3.2373908244782981}]
[null,null,null,null,null,null,null,{"$f":"H30/(0.34+0.37+0.29+0.01)","v":3.2053374499785128}]
[]
[]
[null,null,null,null,null,null,null,{"$f":"SUMPRODUCT(H3:H19,'II_Plantejar Ració'!E4:E20)","v":2.8774440390274361}]
[]
[]
[null,{"$f":"CàlculsOVI!B3","v":"VERD Enclova Inici Floració, 2n any"}]
[null,{"$f":"CàlculsOVI!B4","v":"ENSITJAT Prat natural pla, gramínies en gran part"}]
[null,{"$f":"CàlculsOVI!B5","v":"FENC Bromo Final vegetació"}]
[null,{"$f":"CàlculsOVI!B6","v":""}]
[null,{"$f":"CàlculsOVI!B7","v":""}]
[null,{"$f":"CàlculsOVI!B8","v":"Ordi gra"}]
[null,{"$f":"CàlculsOVI!B9","v":"Blat de moro gra"}]
[null,{"$f":"CàlculsOVI!B10","v":"Soja tortó 44"}]
[null,{"$f":"CàlculsOVI!B11","v":""}]
[null,{"$f":"CàlculsOVI!B12","v":""}]
[null,{"$f":"CàlculsOVI!B13","v":""}]
[null,{"$f":"CàlculsOVI!B14","v":""}]
[null,{"$f":"CàlculsOVI!B15","v":"Grassa vegetal, mantega de porc (tots els tipus)"}]
[null,{"$f":"CàlculsOVI!B16","v":""}]
[null,{"$f":"CàlculsOVI!B17","v":""}]
[null,{"$f":"CàlculsOVI!B18","v":""}]
[null,{"$f":"CàlculsOVI!B19","v":""}]

{"sheet":"I_Necessitats","index":5,"n_rows":62,"n_cols":19,"rows_kept":62,"cut":false,"hidden":false,"merged":[[40,1,40,2],[4,26,4,27],[0,1,1,2],[0,11,0,13],[2,1,2,2],[18,11,18,13],[18,1,18,2]]}
[null,null,null,null,null,null,null,null,null,null,null,"Càlculs auxiliars Gestació"]
[null,null,null,null,null,null,null,null,null,null,null,{"$f":"IF(C10<=3,0.0345*(C5^0.75),IF(C8<=2,-0.0031*C11^2+0.1183*C11-0.0951+0.0345*(C5^0.75),IF(C8<=4,0.0523*C11^0.8927+0.0345*(C5^0.75),0.0309*C11^0.6303+0.0345*(C5^0.75))))","v":0.74375951176358401},"A","UFL"]
[null,"Elegir tipus d'animal",null,null,null,null,null,null,null,null,null,{"$f":"(IF(C10<=3,0.0345*(55^0.75),IF(C8<=2,-0.0031*C11^2+0.1183*C11-0.0951+0.0345*(55^0.75),IF(C8<=4,0.0523*C11^0.8927+0.0345*(55^0.75),0.0309*C11^0.6303+0.0345*(55^0.75)))))","v":0.69677267721230907},"A55",{"$f":"L3+0.04*((C5-55)/5)","v":0.7367726772123091}]
[null,null,null,{"$f":"NR!B6","v":2},{"$f":"IF(NR!$B$6=8,IF(NR!$B$1=1,\"Mascles moderat\",IF(NR!$B$1=2,\"Femelles moderat\",IF(NR!$B$1=3,\"Mascles alt\",\"Femelles alt\"))),\"\")","v":""},null,null,null,null,null,null,{"$f":"IF(C10<=3,0.0345*(70^0.75),IF(C8<=2,-0.0031*C11^2+0.1183*C11-0.0951+0.0345*(70^0.75),IF(C8<=4,0.0523*C11^0.8927+0.0345*(70^0.75),0.0309*C11^0.6303+0.0345*(70^0.75))))","v":0.83491569491028805},"A70",{"$f":"L4+0.04*((C5-70)/5)","v":0.75491569491028809}]
[null,"Pes viu ",60,{"$f":"IF(NR!$B$6=8,E5,IF(NR!$B$6=5,\"Valors normals entre 40 i 90\",IF(NR!$B$6=4,\"Valors normals entre 40 i 110\",\"Valors normals entre 40 i 80\")))","v":"Valors normals entre 40 i 80"},{"$f":"IF(NR!$B$6=8,IF(NR!$B$1=1,\"15 a 35 kg\",IF(NR!$B$1=2,\"15 a 30 kg\",IF(NR!$B$1=3,\"20 a 40 kg\",\"20 a 40 kg\"))),\"\")","v":""},null,null,null,null,null,null,{"$f":"IF(C10<=3,F49,IF(C8<=2,18.144*C11^0.8184+F49,IF(C8<=4,0.5978*C11^2-0.1668*C11+37.222+F49,0.0853*C11^2+4.087*C11+5.7653+F49)))","v":54.969419219563008},"A","PDI"]
[null,{"$f":"IF(NR!B6=8,\"\",\"CC\")","v":"CC"},3,{"$f":"IF(NR!$B$6=8,\"\",\"Valors normals entre 2 i 4,5\")","v":"Valors normals entre 2 i 4,5"},null,"mascles alt","femelles alt","mascles moderat","femelles moderat",null,null,{"$f":"IF(C10<=3,G49,IF(C8<=2,18.144*C11^0.8184+G49,IF(C8<=4,0.5978*C11^2-0.1668*C11+37.222+G49,0.0853*C11^2+4.087*C11+5.7653+G49)))","v":53.204806420987168},"A55",{"$f":"L6+3*((C5-55)/5)","v":56.204806420987168}]
[null,{"$f":"IF(NR!B6=3,\"Variació pes o potencial engreix\",IF(NR!B6=8,\"Variació pes o potencial engreix\",\"\"))","v":""},250,{"$f":"IF(NR!$B$6=3,\"Valors normals entre 50 i 150 g/dia\",IF(NR!$B$6=8,E7,\"\"))","v":""},{"$f":"IF(E4=\"Mascles moderat\",H7,IF(E4=\"Femelles moderat\",I7,IF(E4=\"Mascles alt\",F7,G7)))","v":""},{"$f":"IF(NR!$B$6=8,IF(C5<40,IF(C5>=35,\"150 a 450\",IF(C5>=30,\"150 a 400\",IF(C5>=25,\"150 a 350\",\"150 a 300\"))),\"200 a 450\"),\"\")","v":""},{"$f":"IF(NR!$B$6=8,IF(C5<40,IF(C5>=35,\"150 a 400\",IF(C5>=30,\"150 a 350\",IF(C5>=25,\"150 a 350\",\"150 a 300\"))),\"200 a 400\"),\"\")","v":""},{"$f":"IF(NR!$B$6=8,IF(C5<35,IF(C5>=30,\"150 a 400\",IF(C5>=25,\"150 a 350\",IF(C5>=15,\"150 a 300\",))),\"200 a 400\"),\"\")","v":""},{"$f":"IF(NR!$B$6=8,IF(C5<30,IF(C5>=25,\"150 a 300\",IF(C5>=20,\"150 a 300\",\"150 a 250\")),\"150 a 300\"),\"\")","v":""},null,null,{"$f":"IF(C10<=3,H49,IF(C8<=2,18.144*C11^0.8184+H49,IF(C8<=4,0.5978*C11^2-0.1668*C11+37.222+H49,0.0853*C11^2+4.087*C11+5.7653+H49)))","v":58.479207045914968},"A70",{"$f":"L7+3*((C5-70)/5)","v":52.479207045914968}]
[null,{"$f":"IF(NR!B6=5,\"Setmanes abans part\",\"\")","v":""},null,{"$f":"IF(NR!B6=5,\"De 6 a 1 setmana abans part\",\"\")","v":""},null,null,null,null,null,null,null,{"$f":"IF(C10<=3,0.02*C5,IF(C8<=2,0.395*C11-0.003+0.02*C5,IF(C8<=4,0.2256*C11+0.0547+0.02*C5,0.144*C11+0.0224+0.02*C5)))","v":1.2},"A","Ca"]
[null,{"$f":"IF(NR!B6=6,\"Setmanes postpart/lactació\",IF(NR!B6=7,\"Setmanes postpart/lactació\",\"\"))","v":""},20,{"$f":"IF(NR!B6=6,\"De 1 a 14\",IF(NR!B6=7,\"De 1 a 35\",\"\"))","v":""},null,null,null,null,null,null,null,{"$f":"IF(C10<=3,0.02*55,IF(C8<=2,0.395*C11-0.003+0.02*55,IF(C8<=4,0.2256*C11+0.0547+0.02*55,0.144*C11+0.0224+0.02*55)))","v":1.1000000000000001},"A55",{"$f":"L9+0.3*(C5-55)/5","v":1.4000000000000001},null,null,{"$f":"IF(NR!B6=8,\"ELEGIR SEXE I POTENCIAL ENGREIX XAIS\",\"\")","v":""}]
[null,{"$f":"IF(NR!B6=5,\"Mesos gestació\",\"\")","v":""},null,{"$f":"IF(NR!B6=5,\"Es consideren dos períodes: 3 primers mesos i 2 últims. Valors d'1 a 5\",\"\")","v":""},null,null,null,null,null,null,null,{"$f":"IF(C10<=3,0.02*70,IF(C8<=2,0.395*C11-0.003+0.02*70,IF(C8<=4,0.2256*C11+0.0547+0.02*70,0.144*C11+0.0224+0.02*70)))","v":1.4000000000000001},"A70",{"$f":"L10+0.3*(C5-70)/5","v":0.80000000000000016},null,null,null,null,{"$f":"IF(Q9=\"\",\"\",\"ENGREIX\")","v":""}]
[null,{"$f":"IF(NR!B6=5,\"Pes fetus\",\"\")","v":""},null,{"$f":"IF(NR!B6=5,\"Entre 4 i 11 kg\",\"\")","v":""},null,null,null,null,null,null,null,{"$f":"IF(C10<=3,0.027*C5-0.06,IF(C8<=2,0.395*C11-0.003+0.027*C5-0.06,IF(C8<=4,0.1292*C11+0.1728+0.027*C5-0.06,0.0788*C11+0.203+0.027*C5-0.06)))","v":1.5599999999999998},"A","P"]
[null,{"$f":"IF(NR!B6=5,\"Nombre xais fetus\",\"\")","v":""},null,{"$f":"IF(NR!B6=5,\"1 a 3\",\"\")","v":""},null,null,null,null,null,null,null,{"$f":"IF(C10<=3,0.027*55-0.06,IF(C8<=2,0.395*C11-0.003+0.027*55-0.06,IF(C8<=4,0.1292*C11+0.1728+0.027*55-0.06,0.0788*C11+0.203+0.027*55-0.06)))","v":1.4249999999999998},"A55",{"$f":"L12+0.2*(C5-55)/5","v":1.6249999999999998}]
[null,{"$f":"IF(NR!B6=6,\"Increment pes 10-30 dies, anyells\",\"\")","v":""},null,{"$f":"IF(NR!$B$6=6,\"Valors normals entre 150 i 550 g/dia\",\"\")","v":""},null,null,null,null,null,null,null,{"$f":"IF(C10<=3,0.027*70-0.06,IF(C8<=2,0.395*C11-0.003+0.027*70-0.06,IF(C8<=4,0.1292*C11+0.1728+0.027*70-0.06,0.0788*C11+0.203+0.027*70-0.06)))","v":1.8299999999999998},"A70",{"$f":"L13+0.2*(C5-70)/5","v":1.4299999999999997}]
[null,{"$f":"IF(NR!B6=6,\"Consum llet anyells kg\",\"\")","v":""},null,{"$f":"IF(NR!B6=6,\"De 0 a 3\",\"\")","v":""},null,null,null,null,null,null,null,{"$f":"IF(C10<=3,I22*(C5^0.75),IF(C8<=6,0.16430288+0.01917949*C5+0.0650641*C11-0.19095353*C12,I22*(C5^0.75)))","v":1.7462179841405885},"A","CI"]
[null,{"$f":"IF(NR!B6=7,\"Pl producció llet litres\",\"\")","v":""},2.5,null,null,null,null,{"$f":"-0.0274*C9*7*C13/1000-0.0007*C9*7+3.66*C13/1000+0.0602+E23-J50","v":0.3935805168228787},null,null,null,{"$f":"IF(C10<=3,I22*(55^0.75),IF(C8<=6,0.16430288+0.01917949*55+0.0650641*C11-0.19095353*C12,I22*(55^0.75)))","v":1.6359010682375952},"A55",{"$f":"L15+0.1*(C5-55)/5","v":1.7359010682375953}]
[null,{"$f":"IF(NR!B6=7,\"tg ‰, taxa greix\",\"\")","v":""},55,null,null,null,null,{"$f":"0.059816601-0.007659235*C9+0.000492681*C13+0.524018623*C14","v":-9.336809900000001E-2},null,{"$f":"0.89366351+0.06489911*C9-0.00060124*C13+0.70203193*C14+(0.1*(C5-60)/5)","v":2.19164571},null,{"$f":"IF(C10<=3,I22*(70^0.75),IF(C8<=6,0.16430288+0.01917949*70+0.0650641*C11-0.19095353*C12,I22*(70^0.75)))","v":1.9602368489198065},"A70",{"$f":"L16+0.1*(C5-70)/5","v":1.7602368489198066}]
[null,{"$f":"IF(NR!B6=7,\"tp ‰, taxa proteïna\",\"\")","v":""},46,null,null,null,null,null,null,{"$f":"C18*0.16667","v":8.3335000000000006E-2}]
[null,{"$f":"IF(NR!B6<6,\"\",IF(NR!B6>7,\"\",\"Pèrdua punts cc des del part fins 6a setmana\"))","v":""},0.5,{"$f":"IF(NR!B6<6,\"\",IF(NR!B6>7,\"\",\"0,5 a 1\"))","v":""},null,null,null,null,null,{"$f":"SUM(J16:J17)","v":2.2749807099999999}]
[null,{"$f":"IF(NR!$B$6=1,NR!A7,IF(NR!$B$6=2,NR!A8,IF(NR!$B$6=3,NR!A9,IF(NR!$B$6=4,NR!A10,IF(NR!$B$6=5,NR!A11,IF(NR!$B$6=6,NR!A12,IF(NR!$B$6=7,NR!A13,IF(NR!$B$6=8,NR!A14))))))))","v":"Reconstitució ovelles"}]
[null,"Inota",{"$f":"IF(NR!$B$6=1,E22,IF(NR!$B$6=2,F22,IF(NR!$B$6=3,G22,IF(NR!$B$6=4,H22,IF(NR!$B$6=5,I22,IF(NR!$B$6=6,J22,IF(NR!$B$6=7,K22,IF(NR!$B$6=8,L22))))))))","v":8.1000000000000003E-2},null,"40 a 80","40 a 80","40 a 80","40 a 110","40 a 90","40 a 80","40 a 80","15 a 40"]
[null,{"$f":"IF(NR!B6=8,\"Necessitats o recomanacions UFV\",\"Necessitats o recomanacions UFL\")","v":"Necessitats o recomanacions UFL"},{"$f":"IF(NR!$B$6=1,E23,IF(NR!$B$6=2,F23,IF(NR!$B$6=3,G23,IF(NR!$B$6=4,H23,IF(NR!$B$6=5,I23,IF(NR!$B$6=6,J23,IF(NR!$B$6=7,K23,IF(NR!$B$6=8,L23))))))))","v":2.1437600744394572},null,"Ovelles eixutes i inici gestació","Reconstitució ovelles","Ovelles amb anyells 50-150 g/dia","Mardà/marrà","Ovelles en gestació (6ena setmana abans del part -part)","Ovelles alletants 1-14 setmanes després del part","Ovelles munyides","Creixement i engreix de xais"]
[null,"Necessitats o recomanacions PDI",{"$f":"IF(NR!$B$6=1,E24,IF(NR!$B$6=2,F24,IF(NR!$B$6=3,G24,IF(NR!$B$6=4,H24,IF(NR!$B$6=5,I24,IF(NR!$B$6=6,J24,IF(NR!$B$6=7,K24,IF(NR!$B$6=8,L24))))))))","v":109.96941921956301},null,{"$f":"IF(C6<5,IF(C6<4,IF(C6<3,IF(C6<2,0,0.089),0.081),0.075),0)","v":8.1000000000000003E-2},{"$f":"IF(C6<5,IF(C6<4,IF(C6<3,IF(C6<2,0,0.089),0.081),0.075),0)","v":8.1000000000000003E-2},{"$f":"IF(C6<5,IF(C6<4,IF(C6<3,IF(C6<2,0,0.089),0.081),0.075),0)","v":8.1000000000000003E-2},{"$f":"IF(C6<5,IF(C6<4,IF(C6<3,IF(C6<2,0,0.089),0.081),0.075),0)","v":8.1000000000000003E-2},{"$f":"IF(C6<5,IF(C6<4,IF(C6<3,IF(C6<2,0,0.089),0.081),0.075),0)","v":8.1000000000000003E-2}]
[null,"CI ",{"$f":"IF(NR!$B$6=1,E25,IF(NR!$B$6=2,F25,IF(NR!$B$6=3,G25,IF(NR!$B$6=4,H25,IF(NR!$B$6=5,I25,IF(NR!$B$6=6,J25,IF(NR!$B$6=7,K25,IF(NR!$B$6=8,L25))))))))","v":1.7462179841405885},null,{"$f":"IF(NR!B15=3,1.2*(0.0345*(C5^0.75)),IF(NR!B15=2,1.1*(0.0345*(C5^0.75)),(0.0345*(C5^0.75))))","v":0.74375951176358401},{"$f":"IF(C6<3.5,IF(NR!B15=3,1.2*(0.0345*(C5^0.75)),IF(NR!B15=2,1.1*(0.0345*(C5^0.75)),(0.0345*(C5^0.75))))+0.0056*C7+5*EXP(-16),IF(NR!B15=3,1.2*(0.0345*(C5^0.75)),IF(NR!B15=2,1.1*(0.0345*(C5^0.75)),(0.0345*(C5^0.75)))))","v":2.1437600744394572},{"$f":"IF(C6<3.5,0.0026*C7+IF(NR!B15=3,1.2*(0.0345*(C5^0.75)),IF(NR!B15=2,1.1*(0.0345*(C5^0.75)),(0.0345*(C5^0.75)))),IF(NR!B15=3,1.2*(0.0345*(C5^0.75)),IF(NR!B15=2,1.1*(0.0345*(C5^0.75)),(0.0345*(C5^0.75)))))","v":1.3937595117635841},{"$f":"(IF(NR!B15=3,1.2*(0.0345*(C5^0.75)),IF(NR!B15=2,1.1*(0.0345*(C5^0.75)),(0.0345*(C5^0.75)))))*1.1","v":0.81813546293994244},{"$f":"IF(NR!B15=3,(IF(C5<55,$N$3,IF(C5>70,$N$4,$L$2)))*1.2,IF(NR!B15=2,(IF(C5<55,$N$3,IF(C5>70,$N$4,$L$2)))*1.1,(IF(C5<55,$N$3,IF(C5>70,$N$4,$L$2)))))","v":0.74375951176358401},{"$f":"-0.0274*C9*7*C13/1000-0.0007*C9*7+3.66*C13/1000+0.0602+E23-J50","v":0.3935805168228787},{"$f":"E23+0.686*K49+IF(C9<=6,K50,IF(C9>=27,-K50))","v":2.1341100117635841},{"$f":"(0.01802+0.00205*C7/C5)*C5","v":1.5937000000000003},"UFL o UFV"]
[null,"Nec Ca",{"$f":"(IF(NR!$B$6=1,E26,IF(NR!$B$6=2,F26,IF(NR!$B$6=3,G26,IF(NR!$B$6=4,H26,IF(NR!$B$6=5,I26,IF(NR!$B$6=6,J26,IF(NR!$B$6=7,K26,IF(NR!$B$6=8,L26)))))))))/0.4","v":2.9999999999999996},null,{"$f":"I_Necessitats!F49","v":54.969419219563008},{"$f":"IF(C6<3.5,E24+0.22*C7,E24)","v":109.96941921956301},{"$f":"IF(C6<3.5,0.22*C7+E24,E24)","v":109.96941921956301},{"$f":"E24*1.1","v":60.466361141519315},{"$f":"IF(C5<55,$N$6,IF(C5>70,$N$7,$L$5))","v":54.969419219563008},{"$f":"(-3.22*C9*7*C13/1000-0.018*C9*7+420*C13/1000+4.64)*0.58+E24","v":56.199019219563006},{"$f":"E24+(C15*C17)/0.58","v":253.24528128852853},{"$f":"0.141*C7/0.5+F50","v":164.10000000000002},"PDI"]
[null,"Nec P",{"$f":"IF(NR!$B$6=1,E27,IF(NR!$B$6=2,F27,IF(NR!$B$6=3,G27,IF(NR!$B$6=4,H27,IF(NR!$B$6=5,I27,IF(NR!$B$6=6,J27,IF(NR!$B$6=7,K27,IF(NR!$B$6=8,L27))))))))/0.65","v":2.3999999999999995},null,{"$f":"E22*(C5^0.75)","v":1.7462179841405885},{"$f":"F22*(C5^0.75)","v":1.7462179841405885},{"$f":"G22*(C5^0.75)","v":1.7462179841405885},{"$f":"H22*(C5^0.75)","v":1.7462179841405885},{"$f":"IF(C5<55,$N$15,IF(C5>70,$N$16,$L$14))","v":1.7462179841405885},{"$f":"0.89366351+0.06489911*C9-0.00060124*C13+0.70203193*C14+(0.1*(C5-60)/5)+IF(C9<=6,C18*0.16667,IF(C9>14,0,IF(C9<11,C18*0.19166667,C18*0.24)))","v":2.19164571},{"$f":"0.024*C5+0.9*K49","v":3.2640750000000001},{"$f":"0.089*C5^0.75","v":1.9186839578828687},"UE"]
[null,"Mg (g)",{"$f":"IF(NR!$B$6=1,E28,IF(NR!$B$6=2,F28,IF(NR!$B$6=3,G28,IF(NR!$B$6=4,H28,IF(NR!$B$6=5,I28,IF(NR!$B$6=6,J28,IF(NR!$B$6=7,K28,IF(NR!$B$6=8,L28))))))))/0.16","v":3.75},null,{"$f":"0.02*C5","v":1.2},{"$f":"0.02*C5","v":1.2},{"$f":"IF(C6<3.5,0.005*C7-0.0667+0.02*C5 +0.2,0.02*C5 +0.2)","v":2.5833000000000004},{"$f":"0.02*C5","v":1.2},{"$f":"IF(C5<55,$N$9,IF(C5>70,$N$10,$L$8))","v":1.2},{"$f":"0.00078181+0.00368208*C9-0.00015632*C13+1.92035899*C14+E26","v":1.27442341},{"$f":"8.017329907+0.933584863*C15-0.038410057*C16-0.033059023*C17+0.3*(C5-70)/10","v":6.4180238715000018},{"$f":"0.690355789-0.00119142*C5+0.008207615*C7","v":2.6707743390000003},"Ca"]
[null,"K (g)",{"$f":"IF(NR!$B$6=1,E29,IF(NR!$B$6=2,F29,IF(NR!$B$6=3,G29,IF(NR!$B$6=4,H29,IF(NR!$B$6=5,I29,IF(NR!$B$6=6,J29,IF(NR!$B$6=7,K29,IF(NR!$B$6=8,L29))))))))","v":4.2},null,{"$f":"0.027*C5-0.06","v":1.5599999999999998},{"$f":"0.027*C5-0.06","v":1.5599999999999998},{"$f":"IF(C6<3.5,0.007*C7+0.027*C5-0.21,0.027*C5-0.21)","v":3.16},{"$f":"0.027*C5-0.06","v":1.5599999999999998},{"$f":"IF(C5<55,$N$12,IF(C5>70,$N$13,$L$11))","v":1.5599999999999998},{"$f":"0.02704921-0.00136369*C9+0.000055257870866066*C13+1.4833199*C14+E27","v":1.5597754099999999},{"$f":"7.596806665+0.72496131*C15-0.030674951*C16-0.026445637*C17+0.2*(C5-70)/10","v":6.3055883330000002},{"$f":"0.334483115+0.017912474*C5+0.004998622*C7","v":2.6588870550000001}]
[null,"Na (g)",{"$f":"IF(NR!$B$6=1,E30,IF(NR!$B$6=2,F30,IF(NR!$B$6=3,G30,IF(NR!$B$6=4,H30,IF(NR!$B$6=5,I30,IF(NR!$B$6=6,J30,IF(NR!$B$6=7,K30,IF(NR!$B$6=8,L30))))))))","v":0.89999999999999991},null,{"$f":"0.01*$C$5","v":0.6},{"$f":"0.01*$C$5","v":0.6},{"$f":"0.01*$C$5+0.4*C7/1000","v":0.7},{"$f":"0.01*$C$5","v":0.6},{"$f":"0.01*$C$5+0.03","v":0.63},{"$f":"0.01*$C$5+0.18*C14","v":0.6},{"$f":"0.115*$C$5+0.18*K49","v":7.2648150000000005},{"$f":"0.07*$C$5+1.8*C7/1000","v":4.6500000000000004}]
[null,"S (g)",{"$f":"IF(NR!$B$6=1,E31,IF(NR!$B$6=2,F31,IF(NR!$B$6=3,G31,IF(NR!$B$6=4,H31,IF(NR!$B$6=5,I31,IF(NR!$B$6=6,J31,IF(NR!$B$6=7,K31,IF(NR!$B$6=8,L31))))))))","v":2.8393788360009569},null,{"$f":"0.07*$C$5","v":4.2},{"$f":"0.07*$C$5","v":4.2},{"$f":"0.115*$C$5+1.8*C7/1000","v":7.3500000000000005},{"$f":"0.07*$C$5","v":4.2},{"$f":"0.115*$C$5+0.2","v":7.1000000000000005},{"$f":"0.115*$C$5+1.4*C14","v":6.9},{"$f":"0.115*$C$5+1.4*K49","v":9.7374499999999991},{"$f":"0.07*$C$5+1.8*C7/1000","v":4.6500000000000004}]
[null,"Cl (g)",{"$f":"IF(NR!$B$6=1,E32,IF(NR!$B$6=2,F32,IF(NR!$B$6=3,G32,IF(NR!$B$6=4,H32,IF(NR!$B$6=5,I32,IF(NR!$B$6=6,J32,IF(NR!$B$6=7,K32,IF(NR!$B$6=8,L32))))))))","v":1.38},null,{"$f":"0.015*$C$5","v":0.89999999999999991},{"$f":"0.015*$C$5","v":0.89999999999999991},{"$f":"0.015*$C$5+0.9*C7/1000","v":1.125},0.89999999999999991,{"$f":"0.015*$C$5+0.3","v":1.2},{"$f":"0.023*$C$5+0.45*C14","v":1.38},{"$f":"0.023*$C$5+0.45*K49","v":2.2920374999999997},{"$f":"0.015*$C$5+0.9*C7/1000","v":1.125}]
[null,"Co (mg)",{"$f":"IF(NR!$B$6=1,E33,IF(NR!$B$6=2,F33,IF(NR!$B$6=3,G33,IF(NR!$B$6=4,H33,IF(NR!$B$6=5,I33,IF(NR!$B$6=6,J33,IF(NR!$B$6=7,K33,IF(NR!$B$6=8,L33))))))))","v":0.42590682540014352},null,{"$f":"2*I_Necessitats!F48","v":2.8393788360009569},{"$f":"2*I_Necessitats!F48","v":2.8393788360009569},{"$f":"2*I_Necessitats!$F$48","v":2.8393788360009569},{"$f":"2*I_Necessitats!$F$48","v":2.8393788360009569},{"$f":"2*I_Necessitats!$F$48","v":2.8393788360009569},{"$f":"2*I_Necessitats!$F$48","v":2.8393788360009569},{"$f":"2*I_Necessitats!$F$48","v":2.8393788360009569},{"$f":"2*I_Necessitats!$F$48","v":2.8393788360009569}]
[null,"Cu (mg)",{"$f":"IF(NR!$B$6=1,E34,IF(NR!$B$6=2,F34,IF(NR!$B$6=3,G34,IF(NR!$B$6=4,H34,IF(NR!$B$6=5,I34,IF(NR!$B$6=6,J34,IF(NR!$B$6=7,K34,IF(NR!$B$6=8,L34))))))))","v":14.196894180004785},null,{"$f":"0.023*$C$5","v":1.38},{"$f":"0.023*$C$5","v":1.38},{"$f":"0.023*$C$5+0.7*C7/1000","v":1.5549999999999999},{"$f":"0.023*$C$5","v":1.38},{"$f":"0.023*$C$5+0.4","v":1.7799999999999998},{"$f":"0.035*$C$5+0.15*C14","v":2.1},{"$f":"0.035*$C$5+0.15*K49","v":2.4040124999999999},{"$f":"0.023*$C$5+0.7*C7/1000","v":1.5549999999999999}]
[null,"Mn (mg)",{"$f":"IF(NR!$B$6=1,E35,IF(NR!$B$6=2,F35,IF(NR!$B$6=3,G35,IF(NR!$B$6=4,H35,IF(NR!$B$6=5,I35,IF(NR!$B$6=6,J35,IF(NR!$B$6=7,K35,IF(NR!$B$6=8,L35))))))))","v":70.984470900023922},null,{"$f":"0.3*I_Necessitats!$F$48","v":0.42590682540014352},{"$f":"0.3*I_Necessitats!$F$48","v":0.42590682540014352},{"$f":"0.3*I_Necessitats!$F$48","v":0.42590682540014352},{"$f":"0.3*I_Necessitats!$F$48","v":0.42590682540014352},{"$f":"0.3*I_Necessitats!$F$48","v":0.42590682540014352},{"$f":"0.3*I_Necessitats!$F$48","v":0.42590682540014352},{"$f":"0.3*I_Necessitats!$F$48","v":0.42590682540014352},{"$f":"0.3*I_Necessitats!$F$48","v":0.42590682540014352}]
[null,"Zn (mg)",{"$f":"IF(NR!$B$6=1,E36,IF(NR!$B$6=2,F36,IF(NR!$B$6=3,G36,IF(NR!$B$6=4,H36,IF(NR!$B$6=5,I36,IF(NR!$B$6=6,J36,IF(NR!$B$6=7,K36,IF(NR!$B$6=8,L36))))))))","v":70.984470900023922},null,{"$f":"10*I_Necessitats!$F$48","v":14.196894180004785},{"$f":"10*I_Necessitats!$F$48","v":14.196894180004785},{"$f":"10*I_Necessitats!$F$48","v":14.196894180004785},{"$f":"10*I_Necessitats!$F$48","v":14.196894180004785},{"$f":"10*I_Necessitats!$F$48","v":14.196894180004785},{"$f":"10*I_Necessitats!$F$48","v":14.196894180004785},{"$f":"10*I_Necessitats!$F$48","v":14.196894180004785},{"$f":"10*I_Necessitats!$F$48","v":14.196894180004785}]
[null,"I (mg)",{"$f":"IF(NR!$B$6=1,E37,IF(NR!$B$6=2,F37,IF(NR!$B$6=3,G37,IF(NR!$B$6=4,H37,IF(NR!$B$6=5,I37,IF(NR!$B$6=6,J37,IF(NR!$B$6=7,K37,IF(NR!$B$6=8,L37))))))))","v":0.63886023810021531},null,{"$f":"50*I_Necessitats!$F$48","v":70.984470900023922},{"$f":"50*I_Necessitats!$F$48","v":70.984470900023922},{"$f":"50*I_Necessitats!$F$48","v":70.984470900023922},{"$f":"50*I_Necessitats!$F$48","v":70.984470900023922},{"$f":"50*I_Necessitats!$F$48","v":70.984470900023922},{"$f":"50*I_Necessitats!$F$48","v":70.984470900023922},{"$f":"50*I_Necessitats!$F$48","v":70.984470900023922},{"$f":"50*I_Necessitats!$F$48","v":70.984470900023922}]
[null,"Se (mg)",{"$f":"IF(NR!$B$6=1,E38,IF(NR!$B$6=2,F38,IF(NR!$B$6=3,G38,IF(NR!$B$6=4,H38,IF(NR!$B$6=5,I38,IF(NR!$B$6=6,J38,IF(NR!$B$6=7,K38,IF(NR!$B$6=8,L38))))))))","v":0},null,{"$f":"50*I_Necessitats!$F$48","v":70.984470900023922},{"$f":"50*I_Necessitats!$F$48","v":70.984470900023922},{"$f":"50*I_Necessitats!$F$48","v":70.984470900023922},{"$f":"50*I_Necessitats!$F$48","v":70.984470900023922},{"$f":"50*I_Necessitats!$F$48","v":70.984470900023922},{"$f":"50*I_Necessitats!$F$48","v":70.984470900023922},{"$f":"50*I_Necessitats!$F$48","v":70.984470900023922},{"$f":"50*I_Necessitats!$F$48","v":70.984470900023922}]
[null,"Mo (mg)",{"$f":"IF(NR!$B$6=1,E39,IF(NR!$B$6=2,F39,IF(NR!$B$6=3,G39,IF(NR!$B$6=4,H39,IF(NR!$B$6=5,I39,IF(NR!$B$6=6,J39,IF(NR!$B$6=7,K39,IF(NR!$B$6=8,L39))))))))","v":0.70984470900023922},null,{"$f":"0.45*I_Necessitats!$F$48","v":0.63886023810021531},{"$f":"0.45*I_Necessitats!$F$48","v":0.63886023810021531},{"$f":"0.45*I_Necessitats!$F$48","v":0.63886023810021531},{"$f":"0.45*I_Necessitats!$F$48","v":0.63886023810021531},{"$f":"0.45*I_Necessitats!$F$48","v":0.63886023810021531},{"$f":"0.65*I_Necessitats!$F$48","v":0.92279812170031106},{"$f":"0.65*I_Necessitats!$F$48","v":0.92279812170031106},{"$f":"0.45*I_Necessitats!$F$48","v":0.63886023810021531}]
[null,"Vit A (UI)/kg MST",{"$f":"IF(NR!$B$6=1,E40,IF(NR!$B$6=2,F40,IF(NR!$B$6=3,G40,IF(NR!$B$6=4,H40,IF(NR!$B$6=5,I40,IF(NR!$B$6=6,J40,IF(NR!$B$6=7,K40,IF(NR!$B$6=8,L40))))))))","v":2700},null,null,null,null,null,null,{"$f":"0.15*$C$14","v":0},{"$f":"0.15*K49","v":0.30401249999999996}]
[null,"Vit D (UI)/kg MST",{"$f":"IF(NR!$B$6=1,E41,IF(NR!$B$6=2,F41,IF(NR!$B$6=3,G41,IF(NR!$B$6=4,H41,IF(NR!$B$6=5,I41,IF(NR!$B$6=6,J41,IF(NR!$B$6=7,K41,IF(NR!$B$6=8,L41))))))))","v":500},null,{"$f":"0.5*F48","v":0.70984470900023922},{"$f":"0.5*F48","v":0.70984470900023922},{"$f":"0.5*F48","v":0.70984470900023922},{"$f":"0.5*$F$48","v":0.70984470900023922},{"$f":"0.5*$F$48","v":0.70984470900023922},0.70984470900023922,0.70984470900023922,0.70984470900023922]
[null,"Vit E (UI)/kg MST",{"$f":"IF(NR!$B$6=1,E42,IF(NR!$B$6=2,F42,IF(NR!$B$6=3,G42,IF(NR!$B$6=4,H42,IF(NR!$B$6=5,I42,IF(NR!$B$6=6,J42,IF(NR!$B$6=7,K42,IF(NR!$B$6=8,L42))))))))","v":15},null,2700,2700,2700,2000,3300,2400,2400,1200]
[null,"Dades complementàries per al racionament",null,null,500,500,500,500,500,500,500,500]
[null,"Límit tolerància càlcul (%)",12.5,null,15,15,15,15,15,15,15,15]
[null,"MS farratgera % mínim",50]
[null,"Sistema maneig",null,null,null,null,55,70,null,{"$f":"(3.22*C9*7*C13/1000-0.018*C9*7+420*C13/1000+4.64)+E24","v":57.089419219563005}]
[null,null,null,null,"NecPDI_Puendo",{"$f":"0.312*I_Necessitats!C5","v":18.72},{"$f":"0.312*G44","v":17.16},{"$f":"0.312*H44","v":21.84}]
[null,null,null,null,"NecPDI_Pepidèrmiques",{"$f":"(0.2*I_Necessitats!C5^0.6)/0.58","v":4.0224694309521478},{"$f":"(0.2*G44^0.6)/0.58","v":3.8178566323763046},{"$f":"(0.2*H44^0.6)/0.58","v":4.4122572573041081}]
[null,null,null,null,"Nec_PDI_PEF",{"$f":"22.7*F48","v":32.22694978861086},{"$f":"22.7*F48","v":32.22694978861086},{"$f":"22.7*F48","v":32.22694978861086}]
[null,null,null,null,"MSI",{"$f":"I_Necessitats!C23/1.23","v":1.4196894180004784},null,null,null,null,null,{"$f":"0.686*C15*(0.0071*C16+0.0043*C17+0.2224)","v":1.3903505}]
[null,null,null,null,"NecPDI_no productives",{"$f":"SUM(F45:F47)","v":54.969419219563008},{"$f":"SUM(G45:G48)","v":53.204806420987168},{"$f":"SUM(H45:H48)","v":58.479207045914968},"Ple",null,{"$f":"C15*(0.0071*C16+0.0043*C17+0.2224)","v":2.0267499999999998}]
[null,null,null,null,"NecPDI_no productives xais creixement i engreix",{"$f":"1.56*C5","v":93.600000000000009},null,null,"Mobilització postpart, 6 setmanes",{"$f":"IF(C6>=3,IF(C18=0,0,IF(C18<=1,IF(C18>0.6,0.85*E23,0.42*E23))))","v":0.31237899494070526},{"$f":"IF(C6>=3,IF(C18=0,0,IF(C18<=1,IF(C18>0.6,0.85*E23,0.42*E23))))","v":0.31237899494070526}]
[null,null,null,null,"Guany proteïna",{"$f":"0.22*C7","v":55},"Reconst"]
[null,null,null,null,{"$f":"IF(NR!$B$6=1,0,IF(NR!$B$6=2,F51,IF(NR!$B$6=3,F52,IF(NR!$B$6=4,0,IF(NR!$B$6=5,F53,IF(NR!$B$6=6,F54,IF(NR!$B$6=7,F55,IF(NR!$B$6=8,F56))))))))","v":55},{"$f":"0.22*C7","v":55},"Ovelles anyells"]
[null,null,null,null,null,{"$f":"I24-E24","v":0},"gest"]
[null,null,null,null,null,{"$f":"J24-E24","v":1.2295999999999978},"alletants"]
[null,null,null,null,null,{"$f":"C15*C17","v":115},"munyides"]
[null,null,null,null,null,{"$f":"L24-E24","v":109.13058078043701},"creixement"]
[]
[]
[null,null,null,null,{"$f":"E23/E25","v":0.42592592592592593},1.2276589142417529,0.79815894946788735,0.46851851851851856,0.42592592592592593,0.17958218111032129,0.65381770080760526,0.83062142332108457]
[]
[]
[null,null,null,null,null,null,null,null,null,-0.15018181749999987]

{"sheet":"II_Plantejar Ració","index":6,"n_rows":81,"n_cols":19,"rows_kept":81,"cut":false,"hidden":false,"merged":[[33,4,33,5],[28,4,28,6],[11,14,12,14],[11,15,12,15],[11,16,12,16],[15,7,15,9],[27,4,27,6],[16,7,16,9],[17,7,17,9],[19,11,21,11],[19,12,21,12],[11,11,11,12],[11,13,12,13],[18,7,18,12],[11,17,12,17],[11,18,12,18],[57,14,57,15],[4,7,4,9],[5,7,5,9],[6,7,6,9],[7,7,7,9],[8,7,8,9],[9,7,9,9],[11,7,11,9],[12,7,12,9],[13,7,13,9],[9,12,9,13],[10,12,10,13],[10,7,10,9],[14,7,14,9],[0,0,0,6],[1,0,2,0],[1,1,1,2],[1,3,1,5],[2,7,3,9],[0,7,1,13],[59,14,59,15],[59,16,59,17],[60,14,60,15],[60,16,60,17],[61,14,61,15],[61,16,61,17],[62,14,62,15],[62,16,62,17],[63,14,63,15],[63,16,63,17],[64,14,64,15],[64,16,64,17],[65,14,65,15],[65,16,65,17],[66,14,66,15],[66,16,66,17],[67,14,67,15],[67,16,67,17],[68,14,68,15],[68,16,68,17],[69,14,69,15],[69,16,69,17],[70,14,70,15],[70,16,70,17],[71,14,71,15],[71,16,71,17],[72,14,72,15],[72,16,72,17],[73,14,73,15],[73,16,73,17],[74,14,74,15],[74,16,74,17],[75,14,75,15],[75,16,75,17],[76,14,76,15],[76,16,76,17],[80,14,80,15],[80,16,80,17],[77,14,77,15],[77,16,77,17],[78,14,78,15],[78,16,78,17],[79,14,79,15],[79,16,79,17]]}
["Selecció d'ingredients, límits d'incorporació i preu",null,null,null,null,null,null,"Full no protegit, només s'han d'introduir els límits en kg d'ingredient seleccionat i el preu de cadascun d'ells.  Activar SOLVER                        \n"]
[null,"Límits d'incorporació",null,"Càlculs",null,null,"Preu Ingredient"]
[null,"kg mín","kg màx","kg fresc","kg MS","% fresc ració","€/kg fresc","kg fresc total"]
[null,0,100,1,{"$f":"D4*CàlculsOVI!D3/100","v":0.1537},{"$f":"(D4*100)/$K$4","v":100},0.01,null,null,null,{"$f":"SUM(D4:D26)","v":1},{"$f":"K22","v":15.37},"%MS"]
[0,0,5,0,{"$f":"D5*CàlculsOVI!D4/100","v":0},0,0.01,"kg farratge fresc total",null,null,{"$f":"SUM(D4:D8)","v":1}]
[0,0,2,0,{"$f":"D6*CàlculsOVI!D5/100","v":0},0,0.01,"kg concentrat fresc total",null,null,{"$f":"K4-K5","v":0},{"$f":"SUMPRODUCT($E$4:$E$8,CàlculsOVI!$E$3:$E$7)/SUM(E4:E8)","v":1.0737438177302745},"UE/kg MS"]
[0,0,0,0,{"$f":"D7*CàlculsOVI!D6/100","v":0},0,0.01,"Aportacions totals UE",null,null,{"$f":"SUMPRODUCT($E$4:$E$8,CàlculsOVI!E3:E7)","v":0.16503442478514319}]
[0,0,0,0,{"$f":"D8*CàlculsOVI!D7/100","v":0},0,0.01,"kg MS total",null,null,{"$f":"SUM(E4:E26)","v":0.1537},{"$f":"I_Necessitats!F48","v":1.4196894180004784},"Dife MSIcalc i ració",{"$f":"K8-L8","v":-1.2659894180004785}]
[0,0,10,0,{"$f":"D9*CàlculsOVI!D8/100","v":0},0,0.01,"kg MS total farratge",null,null,{"$f":"SUM(E4:E8)","v":0.1537}]
[0,0,10,0,{"$f":"D10*CàlculsOVI!D9/100","v":0},0,0.01,"kg MS total concentrat",null,null,{"$f":"K8-K9","v":0},null,{"$f":"I_Necessitats!B42","v":"Límit tolerància càlcul (%)"},null,{"$f":"I_Necessitats!C42","v":12.5}]
[0,0,2,0,{"$f":"D11*CàlculsOVI!D10/100","v":0},0,0.22600000000000001,"% MS farratge a la ració",null,null,{"$f":"(K9*100)/K8","v":100},null,{"$f":"I_Necessitats!B43","v":"MS farratgera % mínim"},null,{"$f":"I_Necessitats!C43","v":50}]
[0,0,0,0,{"$f":"D12*CàlculsOVI!D11/100","v":0},0,0.192,"PCO",null,null,{"$f":"(K10)/K8","v":0},"Auxiliar càlcul Sg",null,"Ovelles amb anyells 50-150 g/dia","Mardà/marrà","Ovelles en gestació (6ena setmana abans del part -part)","Ovelles alletants 1-14 setmanes després del part","Ovelles munyides","Engreix"]
[0,0,0,0,{"$f":"D13*CàlculsOVI!D12/100","v":0},0,0.215,{"$f":"IF(NR!B6=8,\"Relació UFV/UEM farratge\",\"Relació UFL/UEM farratge\")","v":"Relació UFL/UEM farratge"},null,null,{"$f":"SUMPRODUCT($E$4:$E$8,CàlculsOVI!$F$3:$F$7)/SUMPRODUCT($E$4:$E$8,CàlculsOVI!$E$3:$E$7)","v":0.80914986973601721},"Ovelles eixutes i inici gestació","Reconstitució ovelles"]
[0,0,0,0,{"$f":"D14*CàlculsOVI!D13/100","v":0},0,0.43,"Taxa de substitució global",null,null,{"$f":"IF(NR!B6<5,L14,IF(NR!B6=5,P15,IF(NR!B6=6,Q14,IF(NR!B6=7,R14,IF(NR!B6=8,S14)))))","v":0.72916651847532155},{"$f":"IF((1.4271-0.65*L6)<0,0,(1.4271-0.65*L6))","v":0.72916651847532155},null,null,null,{"$f":"IF(I_Necessitats!C8<=2,1.731-1.1371*L6,IF(I_Necessitats!C8<=4,1.6421-1.0743*L6,1.546-1.0257*L6))","v":0.510045904858905},{"$f":"IF(I_Necessitats!C9<=6,IF(I_Necessitats!C9>3,2.8975-1.6*L6,2.8975-1.6*L6-0.150182),IF(I_Necessitats!C9<=14,1.59-0.8*L6))","v":false},{"$f":"IF((3.35-(2.3*L6))<0,0,(3.35-(2.3*L6)))","v":0.88038921922036906},{"$f":"IF((1.4271-0.65*L6)<0,0,(1.4271-0.65*L6))","v":0.72916651847532155}]
[0,0,0,0,{"$f":"D15*CàlculsOVI!D14/100","v":0},0,0.312,"Producció de llet",null,null,{"$f":"IF(I_Necessitats!B15=\"\",\"\",I_Necessitats!K49)","v":""},null,null,null,null,{"$f":"IF(P14<0,0,P14)","v":0.510045904858905}]
[0,0,0.01,0,{"$f":"D16*CàlculsOVI!D15/100","v":0},0,0.215,"VALOR FUNCIÓ OBJECTIU €/ració",null,null,{"$f":"SUMPRODUCT(D4:D26,G4:G26)","v":0.01}]
[0,0,0,0,{"$f":"D17*CàlculsOVI!D16/100","v":0},0,0.14599999999999999,"COST PART FARRATGERA",null,null,{"$f":"SUMPRODUCT(D4:D8,G4:G8)","v":0.01}]
[null,0,0,0,{"$f":"D18*CàlculsOVI!D17/100","v":0},0,0.13600000000000001,"COST PART CONCENTRADA",null,null,{"$f":"K16-K17","v":0}]
[0,0,0,0,{"$f":"D19*CàlculsOVI!D18/100","v":0},0,0.438,"Paràmetres nutritius, límits, valors finals"]
[0,0,0,0,{"$f":"D20*CàlculsOVI!D19/100","v":0},0,0.6,"Paràmetres","Mínim","Màxim","Valor","Valor/kg MS o %","En alguns ingredients de la ració no hi consten els nutrients ..."]
[0,0,2,0,{"$f":"D21*CàlculsOVI!D20/100","v":0},0,0.28999999999999998,"MSI (kg/dia)",0,999,{"$f":"K8","v":0.1537}]
[0,0,5,0,{"$f":"D22*CàlculsOVI!D21/100","v":0},0,6.7000000000000004E-2,"%MS ració",0,999,{"$f":"SUMPRODUCT(F4:F26,CàlculsOVI!D3:D25)/100","v":15.37}]
[null,0,0,0,{"$f":"D23*CàlculsOVI!D22/100","v":0},0,0.28499999999999998,"UEM",{"$f":"0.7*I_Necessitats!C23","v":1.2223525888984119},{"$f":"I_Necessitats!C23","v":1.7462179841405885},{"$f":"K7+K7*K14*((K12)/(1-(K12)))","v":0.16503442478514319},{"$f":"K23/$K$8","v":1.0737438177302745},{"$f":"CàlculsOVI!AP21","v":""}]
[null,0,0,0,{"$f":"D24*CàlculsOVI!D23/100","v":0},0,0.01,{"$f":"IF(NR!B6=8,\"UFV\",\"UFL\")","v":"UFL"},{"$f":"I_Necessitats!C21*B47/B48","v":1.9619272667113619},{"$f":"I_Necessitats!C21*B47/B48","v":1.9619272667113619},{"$f":"CàlculsOVI!F26","v":0.13353758331685714},0.86881967024630535,{"$f":"CàlculsOVI!AQ21","v":""}]
[null,0,0,0,{"$f":"D25*CàlculsOVI!D24/100","v":0},0,0.01,"PDI",{"$f":"((100-$O$11)/100)*(G33+(G34+N8*0.5*(5.7+0.074*B57)/B79)*G35/B79)","v":30.998667856182397},{"$f":"((100+$O$11)/100)*(G33+(G34+N8*0.5*(5.7+0.074*B57)/B79)*G35/B79)","v":92.996003568547195},{"$f":"CàlculsOVI!G26","v":12.330328945022442},80.223350325455058,{"$f":"CàlculsOVI!AR21","v":""}]
[null,0,0,0,{"$f":"D26*CàlculsOVI!D25/100","v":0},0,0.01,"BPR",-8,10,{"$f":"CàlculsOVI!H26","v":2.8774440390274361},18.721171366476486,{"$f":"CàlculsOVI!AS21","v":""}]
[null,null,null,null,null,{"$f":"SUM(F4:F26)","v":100},null,"NI",{"$f":"CàlculsOVI!AE26","v":2.5097055696390158},{"$f":"I27","v":2.5097055696390158},{"$f":"K21*100/I_Necessitats!C5","v":0.25616666666666671},{"$f":"K27","v":0.25616666666666671},{"$f":"CàlculsOVI!AT21","v":""}]
["Efecte NI",null,null,null,{"$f":"[1]I_Necessitats!B7","v":"Dades orientatives"},null,null,"Ca",{"$f":"((100-I_Necessitats!$C$42)/100)*I_Necessitats!C24","v":2.6249999999999996},{"$f":"(100+I_Necessitats!$C$42)/100*I_Necessitats!C24","v":3.3749999999999996},{"$f":"CàlculsOVI!I26","v":0},0,{"$f":"CàlculsOVI!AU21","v":"Ca"}]
["NIref",{"$f":"J27","v":2.5097055696390158},null,null,{"$f":"I_Necessitats!B19","v":"Reconstitució ovelles"},null,null,"P",{"$f":"((100-I_Necessitats!$C$42)/100)*I_Necessitats!C25","v":2.0999999999999996},{"$f":"(100+I_Necessitats!$C$42)/100*I_Necessitats!C25","v":2.6999999999999993},{"$f":"CàlculsOVI!J26","v":0},0,{"$f":"CàlculsOVI!AV21","v":"P"}]
["NI % PV",{"$f":"K27","v":0.25616666666666671},null,null,null,"CI",{"$f":"I_Necessitats!C23","v":1.7462179841405885},"Mg",{"$f":"((100-I_Necessitats!$C$42)/100)*I_Necessitats!C26","v":3.28125},{"$f":"(100+I_Necessitats!$C$42)/100*I_Necessitats!C26","v":4.21875},{"$f":"CàlculsOVI!K26","v":0},0,{"$f":"CàlculsOVI!AW21","v":"Mg"}]
["dMOm",{"$f":"76-2.74*B30","v":75.29810333333333},null,null,null,"UFL",{"$f":"I_Necessitats!C21","v":2.1437600744394572},"K",{"$f":"((100-I_Necessitats!$C$42)/100)*I_Necessitats!C27","v":3.6750000000000003},{"$f":"(100+I_Necessitats!$C$42)/100*I_Necessitats!C27","v":4.7250000000000005},{"$f":"CàlculsOVI!L26","v":0},0,{"$f":"CàlculsOVI!AX21","v":"K"}]
["Δ dMO_NI ",{"$f":"-2.74*(B30-B29)/100","v":6.1746965941442369E-2},null,null,null,"PDI",{"$f":"I_Necessitats!C22","v":109.96941921956301},"Na",{"$f":"((100-I_Necessitats!$C$42)/100)*I_Necessitats!C28","v":0.78749999999999987},{"$f":"(100+I_Necessitats!$C$42)/100*I_Necessitats!C28","v":1.0125},{"$f":"CàlculsOVI!M26","v":0},0,{"$f":"CàlculsOVI!AY21","v":"Na"}]
["Efecte %Co (PCO)",null,null,null,null,"NecPDI_PUendo",{"$f":"B68","v":18.72},"S",{"$f":"((100-I_Necessitats!$C$42)/100)*I_Necessitats!C29","v":2.4844564815008372},{"$f":"(100+I_Necessitats!$C$42)/100*I_Necessitats!C29","v":3.1943011905010765},{"$f":"CàlculsOVI!N26","v":0},0,{"$f":"CàlculsOVI!AZ21","v":"S"}]
["PCO",{"$f":"K12","v":0},null,null,"PDI - NecPDI_PUendo",null,{"$f":"G32-G33","v":91.249419219563009},"Cl",{"$f":"((100-I_Necessitats!$C$42)/100)*I_Necessitats!C30","v":1.2075},{"$f":"(100+I_Necessitats!$C$42)/100*I_Necessitats!C30","v":1.5524999999999998},{"$f":"CàlculsOVI!O26","v":0},0,{"$f":"CàlculsOVI!BA21","v":"Cl"}]
["Δ dMO_CO ",{"$f":"IF(B34=0,0,((-6.5/(1+(0.35/B34)^3))/100)*0.6)","v":0},null,null,null,"EfPDI",{"$f":"IF(NR!B6=8,0.5,0.58)","v":0.57999999999999996},"Co",{"$f":"((100-I_Necessitats!$C$42)/100)*I_Necessitats!C31","v":0.37266847222512556},{"$f":"(100+I_Necessitats!$C$42)/100*I_Necessitats!C31","v":0.47914517857516148},{"$f":"CàlculsOVI!Q26","v":0},0,{"$f":"CàlculsOVI!BB21","v":"Fe"}]
["Efecte balanç proteic rumen",null,null,null,null,null,null,"Cu",{"$f":"((100-I_Necessitats!$C$42)/100)*I_Necessitats!C32","v":12.422282407504186},{"$f":"(100+I_Necessitats!$C$42)/100*I_Necessitats!C32","v":15.971505952505384},{"$f":"CàlculsOVI!R26","v":0},0,{"$f":"CàlculsOVI!BC21","v":"Co"}]
["MNT ingerida",{"$f":"L45","v":151.5},null,null,null,null,null,"Mn",{"$f":"((100-I_Necessitats!$C$42)/100)*I_Necessitats!C33","v":62.111412037520935},{"$f":"(100+I_Necessitats!$C$42)/100*I_Necessitats!C33","v":79.857529762526909},{"$f":"CàlculsOVI!S26","v":0},0,{"$f":"CàlculsOVI!BD21","v":"Cu"},null,{"$f":"IF(K37*K21>=1000*K21,\"Toxicitat\",\"\")","v":""}]
["MOrD o MOF",{"$f":"L57","v":521.819591565},null,null,null,null,null,"Zn",{"$f":"((100-I_Necessitats!$C$42)/100)*I_Necessitats!C34","v":62.111412037520935},{"$f":"(100+I_Necessitats!$C$42)/100*I_Necessitats!C34","v":79.857529762526909},{"$f":"CàlculsOVI!T26","v":0},0,{"$f":"CàlculsOVI!BE21","v":"Mn"},null,{"$f":"IF(K38*K21>=900*K21,\"Toxicitat\",\"\")","v":""}]
["MNrD_rumen (MNF) fermentades rumen",{"$f":"B37*L56","v":112.11},null,null,null,null,null,"Iode",{"$f":"((100-I_Necessitats!$C$42)/100)*I_Necessitats!C35","v":0.55900270833768839},{"$f":"(100+I_Necessitats!$C$42)/100*I_Necessitats!C35","v":0.71871776786274222},{"$f":"CàlculsOVI!U26","v":0},0,{"$f":"CàlculsOVI!BF21","v":"Zn"},null,{"$f":"IF(K39*K21>=5,\"Toxicitat\",\"\")","v":""}]
["MN alim_duodè (PIA) no ferm a rumen",{"$f":"B37*(1-L56)","v":39.39},null,null,null,null,null,"Se",{"$f":"((100-I_Necessitats!$C$42)/100)*I_Necessitats!C36","v":0},{"$f":"(100+I_Necessitats!$C$42)/100*I_Necessitats!C36","v":0},{"$f":"CàlculsOVI!V26","v":0},0,{"$f":"CàlculsOVI!BG21","v":"Iode"}]
["MN microbiana intestí ( 41,7 + 71,9 x 10^-3 x MOrD_rumen + 8,40 x PCO)",{"$f":"41.7+(B38*71.9*10^-3)+8.4*B34","v":79.218828633523515},null,null,null,null,null,"Vit A",{"$f":"((100-I_Necessitats!$C$42)/100)*I_Necessitats!C38","v":2362.5},{"$f":"(100+I_Necessitats!$C$42)/100*I_Necessitats!C38","v":3037.5},{"$f":"CàlculsOVI!W26","v":0},0,{"$f":"CàlculsOVI!BH21","v":"Se"}]
["MN endogena",14.2,null,null,null,null,null,"Vit D",{"$f":"((100-I_Necessitats!$C$42)/100)*I_Necessitats!C39","v":437.5},{"$f":"(100+I_Necessitats!$C$42)/100*I_Necessitats!C39","v":562.5},{"$f":"CàlculsOVI!X26","v":0},0,{"$f":"CàlculsOVI!BI21","v":"Vit A"}]
["BPR ració",{"$f":"B37-(B40+B41+B42)","v":18.691171366476482},null,null,null,null,null,"Vit E",{"$f":"((100-I_Necessitats!$C$42)/100)*I_Necessitats!C40","v":13.125},{"$f":"(100+I_Necessitats!$C$42)/100*I_Necessitats!C40","v":16.875},{"$f":"CàlculsOVI!Y26","v":0},0,{"$f":"CàlculsOVI!BJ21","v":"Vit D"}]
["BPR ref",{"$f":"L26","v":18.721171366476486},null,null,null,null,null,"AG",null,null,{"$f":"CàlculsOVI!Z26","v":15.567499999999997},{"$f":"K44","v":15.567499999999997},{"$f":"CàlculsOVI!BK21","v":"Vit E"}]
["Δ dMO_BPR",{"$f":"(0.06*(B43-B44))/100","v":-1.8000000000002813E-5},null,null,null,null,null,"MNT_PB",null,null,{"$f":"CàlculsOVI!AC26","v":23.285550000000001},{"$f":"K45/K21","v":151.5},{"$f":"CàlculsOVI!BL21","v":""}]
[null,null,null,null,null,null,null,"PDIA",null,null,{"$f":"CàlculsOVI!AD26","v":4.5406822500000006},{"$f":"K46","v":4.5406822500000006},{"$f":"CàlculsOVI!BM21","v":""}]
["∑ dMO x PMO, dMO x ingredient a la ració",{"$f":"K47","v":0.66603899999999994},null,null,null,null,null,"dMO",null,{"$f":"B48","v":0.72776796594144233},{"$f":"CàlculsOVI!AF26/K21","v":0.66603899999999994},{"$f":"K47/$K$8","v":4.3333702016916069},{"$f":"CàlculsOVI!BN21","v":"PDIA"}]
["Efecte total interaccions",{"$f":"B47+(B32+B35+B45)","v":0.72776796594144233},null,null,null,null,null,"MOD",null,null,{"$f":"CàlculsOVI!AG26","v":91.97961957855},{"$f":"K48/$K$8","v":598.43604149999999},{"$f":"CàlculsOVI!BO21","v":""}]
[null,null,null,null,null,null,null,"EE",null,null,{"$f":"CàlculsOVI!AH26","v":3.5350999999999999},{"$f":"K49/(K21*10)","v":2.3000000000000003},{"$f":"CàlculsOVI!BP21","v":""}]
["MODc_rumen (MOF corregida)",{"$f":"B38*B48/B47","v":570.18220065439755},null,null,null,null,null,"FB",null,null,{"$f":"CàlculsOVI!AI26","v":43.973570000000002},{"$f":"K50/$K$8","v":286.10000000000002},{"$f":"CàlculsOVI!BQ21","v":""}]
["PANDI",{"$f":"0.193*B40","v":7.6022699999999999},null,null,null,null,null,"NDF",null,null,{"$f":"CàlculsOVI!AJ26","v":62.402200000000001},406,{"$f":"CàlculsOVI!BR21","v":""}]
["dr",{"$f":"(B40-B51)/B40","v":0.80699999999999994},null,null,null,null,null,"ADF",null,null,{"$f":"CàlculsOVI!AK26","v":57.099550000000001},371.5,{"$f":"CàlculsOVI!BS21","v":""}]
["PDIA",{"$f":"B37*(1-L56)*B52","v":31.78773},null,null,null,null,null,"Lignina",null,null,{"$f":"CàlculsOVI!AL26","v":0},0,{"$f":"CàlculsOVI!BT21","v":""}]
["MN microbianes_duodè (corregida)",{"$f":"40.7+75.6*10^-3*B50+8.07*B34-0.114*B43","v":81.674980833694136},null,null,null,null,null,"cendres",null,null,{"$f":"CàlculsOVI!AM26","v":15.60055},101.5,{"$f":"CàlculsOVI!BU21","v":""}]
["PDI = PDIA + MN microbianes_duodè x 0,8 x 0,8",{"$f":"B53+B54*0.8*0.8","v":84.059717733564256},null,null,null,null,null,"Mo",{"$f":"((100-I_Necessitats!$C$42)/100)*I_Necessitats!C37","v":0.6211141203752093},{"$f":"(100+I_Necessitats!$C$42)/100*I_Necessitats!C37","v":0.79857529762526913},{"$f":"CàlculsOVI!AN26","v":0},0,{"$f":"CàlculsOVI!BV21","v":""}]
["flux de N duodenal endogen (Actualització)",null,null,null,null,null,null,"DT_N",null,null,{"$f":"CàlculsOVI!AA26","v":0.74},{"$f":"K56","v":0.74},{"$f":"CàlculsOVI!BW21","v":""}]
["MOND = MO - MODc_rumen",{"$f":"L58-B50","v":328.31779934560257},null,null,null,null,null,"MOF",null,null,{"$f":"CàlculsOVI!AO26","v":80.203671223540496},{"$f":"K57/$K$8","v":521.819591565}]
["N duodenal endo, g MNT/kg MSI = 14,2 x MSI",{"$f":"14.2*K21","v":2.1825399999999999},null,null,null,null,null,"MO",null,null,{"$f":"K48/K47","v":138.09945000000002},{"$f":"K58/$K$8","v":898.50000000000011},{"$f":"CàlculsOVI!BX21","v":""}]
["PÈRDUES FECALS ENDÒGENES (PEF)  i (NEC_PDI Actualització)",null,null,null,null,null,null,"PDI/UFL",null,null,{"$f":"K25/K24","v":92.336019858657437}]
["MNND = 0,163 x MN alim_duodè + 0,20 x MN mic_duodè + 5,7 + 0,074 x MOND",{"$f":"0.163*B40+0.2*B54+5.7+0.074*B57","v":52.75108331831342}]
["PEF (proteïnes endogenes fecals) = 5,7 + 0,074 x MOND",{"$f":"5.7+0.074*B57","v":29.995517151574589}]
["Nec PDI_PEF = MSI x [0,5 x (5,7 + 0,074 x MOND)]/EfPDI",{"$f":"K21*(0.5*(5.7+0.074*B57))/B79","v":2.4086521687279223}]
["PÈRDUES ENDÒGENES URINÀRIES i (NEC_PDI Actualització)"]
["log10 NU (N urinari g/dia) log10 NU = - 1,17 + 1,00 x log10 Pv",{"$f":"-1.17+LOG10(I_Necessitats!C5)","v":0.6081512503836437}]
["NU",{"$f":"10^B64","v":4.0564978523518915}]
["NUNP microbià/NU =  0,3325/(1 + (NU/0,203))",{"$f":"0.3325/(1+(B65/0.203))","v":1.5846351457304082E-2}]
["NU endo",{"$f":"0.05*I_Necessitats!C5","v":3}]
["Nec PDI_NU endo",{"$f":"0.312*I_Necessitats!C5","v":18.72}]
["PÈRDUES NITROGENADES PER L’EPIDERMIS i (Nec_PDI Actualització)"]
["P epidèrmiques (0,2 g PDI/kg Pv0,60)",{"$f":"0.2*I_Necessitats!C5^0.6","v":2.3330322699522457}]
["Nec PDI_P epidèrmiques = 0,2 x Pv0,60/EffPDI",{"$f":"B70/B79","v":2.437780554742198}]
["Nec_PDI no productives",{"$f":"B62+B68+B71","v":23.566432723470118}]
["Eficàcia de la síntesi proteica en lactació"]
["PDI disponible = PDI ingerida - Nec PDI_NU endògenes",{"$f":"K25-B68","v":-6.3896710549775566}]
["EfPDI = ∑ despeses prot/PDI disponible = 0,67xEXP(-0,007x(PDI-100)",{"$f":"0.67*EXP(-0.007*(L25-100))","v":0.76947945987820499}]
["Bal EN",{"$f":"K24-G31","v":-2.0102224911226001}]
["bal Proteïna ",{"$f":"K25-G32","v":-97.639090274540564}]
["Guany Proteïna",{"$f":"I_Necessitats!E52","v":55}]
["EfPDI = (PEF + P epid + MP + bal Prote)/(PDI disponible)",{"$f":"IF(B76>0,(B61+B70+B78+B77)/B74,(B61+B70+B78)/(B74+ABS(B77)))","v":0.95703129037345624}]
[]
["NUcal=0,79xBPR/6,25 + (PDI/6,25) x (1-E·fPDI)+Nuendo + NUNPmic + 0,47X bal N",{"$f":"(0.79*B43/6.25+(K25/6.25)*(1-B79)+B67/6.25+(B41/6.25)+0.47*ABS(B77)/6.25)/[2]I_Necessitats!D164","v":3.5299703327043061E-2}]

{"sheet":"III_Resultat Ració","index":7,"n_rows":66,"n_cols":10,"rows_kept":66,"cut":false,"hidden":false,"merged":[[0,0,0,1],[9,6,9,8],[9,2,9,3],[14,9,17,9],[2,2,2,6],[3,2,3,6],[4,2,4,6],[5,2,5,6],[8,2,8,6],[6,2,6,6],[7,2,7,6],[9,0,9,1],[1,0,1,4],[1,5,1,7]]}
["Explotació:",null,"Data",{"$f":"TODAY()","v":"2023-03-02"}]
[{"$f":"I_Necessitats!B19","v":"Reconstitució ovelles"},null,null,null,null,{"$f":"IF(NR!B6=8,IF(NR!B1=1,NR!A2,IF(NR!B1=2,NR!A3,IF(NR!B1=3,NR!A4,IF(NR!B1=4,NR!A5)))),\"\")","v":""}]
[{"$f":"I_Necessitats!B5","v":"Pes viu "},{"$f":"IF(I_Necessitats!C5=\"\",\"\",I_Necessitats!C5)","v":60},{"$f":"I_Necessitats!B12","v":""},null,null,null,null,{"$f":"IF(C3=\"\",\"\",I_Necessitats!C12)","v":""}]
[{"$f":"I_Necessitats!B6","v":"CC"},{"$f":"IF(I_Necessitats!C6=\"\",\"\",I_Necessitats!C6)","v":3},{"$f":"I_Necessitats!B13","v":""},null,null,null,null,{"$f":"IF(C4=\"\",\"\",I_Necessitats!C13)","v":""}]
[{"$f":"I_Necessitats!B7","v":""},{"$f":"IF(A5=\"\",\"\",I_Necessitats!C7)","v":""},{"$f":"I_Necessitats!B14","v":""},null,null,null,null,{"$f":"IF(C5=\"\",\"\",I_Necessitats!C14)","v":""}]
[{"$f":"I_Necessitats!B8","v":""},{"$f":"IF(A6=\"\",\"\",I_Necessitats!C8)","v":""},{"$f":"I_Necessitats!B15","v":""},null,null,null,null,{"$f":"IF(C6=\"\",\"\",I_Necessitats!C15)","v":""}]
[{"$f":"I_Necessitats!B9","v":""},{"$f":"IF(A7=\"\",\"\",I_Necessitats!C9)","v":""},{"$f":"I_Necessitats!B16","v":""},null,null,null,null,{"$f":"IF(C7=\"\",\"\",I_Necessitats!C16)","v":""}]
[{"$f":"I_Necessitats!B10","v":""},{"$f":"IF(A8=\"\",\"\",I_Necessitats!C10)","v":""},{"$f":"I_Necessitats!B17","v":""},null,null,null,null,{"$f":"IF(C8=\"\",\"\",I_Necessitats!C17)","v":""}]
[{"$f":"I_Necessitats!B11","v":""},{"$f":"IF(A9=\"\",\"\",I_Necessitats!C11)","v":""},{"$f":"I_Necessitats!B18","v":""},null,null,null,null,{"$f":"IF(C9=\"\",\"\",I_Necessitats!C18)","v":""}]
[null,{"$f":"IF(I_Necessitats!C12=\"\",\"\",I_Necessitats!C12)","v":""},null,null,null,null,"Aportacions de nutrients"]
["INGREDIENTS","kg/dia","% MF","kg/tona ","COST",null,"NUTRIENTS","ANÀLISI"]
[{"$f":"IF(B12=\"\",\"\",CàlculsOVI!B3)","v":"VERD Enclova Inici Floració, 2n any"},{"$f":"IF('II_Plantejar Ració'!D4<=0,\"\",'II_Plantejar Ració'!D4)","v":1},{"$f":"IF('II_Plantejar Ració'!D4<=0,\"\",'II_Plantejar Ració'!F4)","v":100},{"$f":"IF('II_Plantejar Ració'!D4<=0,\"\",('II_Plantejar Ració'!D4*1000)/('II_Plantejar Ració'!$K$4))","v":1000},{"$f":"IF('II_Plantejar Ració'!D4<=0,\"\",'II_Plantejar Ració'!G4*B12)","v":0.01},null,{"$f":"'II_Plantejar Ració'!$H$21","v":"MSI (kg/dia)"},{"$f":"'II_Plantejar Ració'!K21","v":0.1537},"Kg"]
[{"$f":"IF(B13=\"\",\"\",CàlculsOVI!B4)","v":""},{"$f":"IF('II_Plantejar Ració'!D5<=0,\"\",'II_Plantejar Ració'!D5)","v":""},{"$f":"IF('II_Plantejar Ració'!D5<=0,\"\",'II_Plantejar Ració'!F5)","v":""},{"$f":"IF('II_Plantejar Ració'!D5<=0,\"\",('II_Plantejar Ració'!D5*1000)/('II_Plantejar Ració'!$K$4))","v":""},{"$f":"IF('II_Plantejar Ració'!D5<=0,\"\",'II_Plantejar Ració'!G5*B13)","v":""},null,{"$f":"'II_Plantejar Ració'!$H$22","v":"%MS ració"},{"$f":"'II_Plantejar Ració'!K22","v":15.37},{"$f":"IF('II_Plantejar Ració'!L23=1,\"g\",\"%\")","v":"%"}]
[{"$f":"IF(B14=\"\",\"\",CàlculsOVI!B5)","v":""},{"$f":"IF('II_Plantejar Ració'!D6<=0,\"\",'II_Plantejar Ració'!D6)","v":""},{"$f":"IF('II_Plantejar Ració'!D6<=0,\"\",'II_Plantejar Ració'!F6)","v":""},{"$f":"IF('II_Plantejar Ració'!D6<=0,\"\",('II_Plantejar Ració'!D6*1000)/('II_Plantejar Ració'!$K$4))","v":""},{"$f":"IF('II_Plantejar Ració'!D6<=0,\"\",'II_Plantejar Ració'!G6*B14)","v":""},null,"MS farratges",{"$f":"'II_Plantejar Ració'!K9","v":0.1537},"Kg"]
[{"$f":"IF(B15=\"\",\"\",CàlculsOVI!B6)","v":""},{"$f":"IF('II_Plantejar Ració'!D7<=0,\"\",'II_Plantejar Ració'!D7)","v":""},{"$f":"IF('II_Plantejar Ració'!D7<=0,\"\",'II_Plantejar Ració'!F7)","v":""},{"$f":"IF('II_Plantejar Ració'!D7<=0,\"\",('II_Plantejar Ració'!D7*1000)/('II_Plantejar Ració'!$K$4))","v":""},{"$f":"IF('II_Plantejar Ració'!D7<=0,\"\",'II_Plantejar Ració'!G7*B15)","v":""},null,{"$f":"CàlculsOVI!E1","v":"UEM"},{"$f":"'II_Plantejar Ració'!K23","v":0.16503442478514319},"UE",{"$f":"'II_Plantejar Ració'!M20","v":"En alguns ingredients de la ració no hi consten els nutrients ..."}]
[{"$f":"IF(B16=\"\",\"\",CàlculsOVI!B7)","v":""},{"$f":"IF('II_Plantejar Ració'!D8<=0,\"\",'II_Plantejar Ració'!D8)","v":""},{"$f":"IF('II_Plantejar Ració'!D8<=0,\"\",'II_Plantejar Ració'!F8)","v":""},{"$f":"IF('II_Plantejar Ració'!D8<=0,\"\",('II_Plantejar Ració'!D8*1000)/('II_Plantejar Ració'!$K$4))","v":""},{"$f":"IF('II_Plantejar Ració'!D8<=0,\"\",'II_Plantejar Ració'!G8*B16)","v":""},null,{"$f":"CàlculsOVI!F1","v":"UFL"},{"$f":"'II_Plantejar Ració'!K24","v":0.13353758331685714},"UFL"]
[{"$f":"IF(B17=\"\",\"\",CàlculsOVI!B8)","v":""},{"$f":"IF('II_Plantejar Ració'!D9<=0,\"\",'II_Plantejar Ració'!D9)","v":""},{"$f":"IF('II_Plantejar Ració'!D9<=0,\"\",'II_Plantejar Ració'!F9)","v":""},{"$f":"IF('II_Plantejar Ració'!D9<=0,\"\",('II_Plantejar Ració'!D9*1000)/('II_Plantejar Ració'!$K$4))","v":""},{"$f":"IF('II_Plantejar Ració'!D9<=0,\"\",'II_Plantejar Ració'!G9*B17)","v":""},null,{"$f":"CàlculsOVI!G1","v":"PDI"},{"$f":"'II_Plantejar Ració'!K25","v":12.330328945022442},"g "]
[{"$f":"IF(B18=\"\",\"\",CàlculsOVI!B9)","v":""},{"$f":"IF('II_Plantejar Ració'!D10<=0,\"\",'II_Plantejar Ració'!D10)","v":""},{"$f":"IF('II_Plantejar Ració'!D10<=0,\"\",'II_Plantejar Ració'!F10)","v":""},{"$f":"IF('II_Plantejar Ració'!D10<=0,\"\",('II_Plantejar Ració'!D10*1000)/('II_Plantejar Ració'!$K$4))","v":""},{"$f":"IF('II_Plantejar Ració'!D10<=0,\"\",'II_Plantejar Ració'!G10*B18)","v":""},null,{"$f":"CàlculsOVI!H1","v":"BPR"},{"$f":"'II_Plantejar Ració'!K26","v":2.8774440390274361},"g "]
[{"$f":"IF(B19=\"\",\"\",CàlculsOVI!B10)","v":""},{"$f":"IF('II_Plantejar Ració'!D11<=0,\"\",'II_Plantejar Ració'!D11)","v":""},{"$f":"IF('II_Plantejar Ració'!D11<=0,\"\",'II_Plantejar Ració'!F11)","v":""},{"$f":"IF('II_Plantejar Ració'!D11<=0,\"\",('II_Plantejar Ració'!D11*1000)/('II_Plantejar Ració'!$K$4))","v":""},{"$f":"IF('II_Plantejar Ració'!D11<=0,\"\",'II_Plantejar Ració'!G11*B19)","v":""},null,{"$f":"CàlculsOVI!I1","v":"Ca"},{"$f":"'II_Plantejar Ració'!K27","v":0.25616666666666671},"g",{"$f":"'II_Plantejar Ració'!M27","v":""}]
[{"$f":"IF(B20=\"\",\"\",CàlculsOVI!B11)","v":""},{"$f":"IF('II_Plantejar Ració'!D12<=0,\"\",'II_Plantejar Ració'!D12)","v":""},{"$f":"IF('II_Plantejar Ració'!D12<=0,\"\",'II_Plantejar Ració'!F12)","v":""},{"$f":"IF('II_Plantejar Ració'!D12<=0,\"\",('II_Plantejar Ració'!D12*1000)/('II_Plantejar Ració'!$K$4))","v":""},{"$f":"IF('II_Plantejar Ració'!D12<=0,\"\",'II_Plantejar Ració'!G12*B20)","v":""},null,{"$f":"CàlculsOVI!J1","v":"P"},{"$f":"'II_Plantejar Ració'!K28","v":0},"g",{"$f":"'II_Plantejar Ració'!M28","v":"Ca"}]
[{"$f":"IF(B21=\"\",\"\",CàlculsOVI!B12)","v":""},{"$f":"IF('II_Plantejar Ració'!D13<=0,\"\",'II_Plantejar Ració'!D13)","v":""},{"$f":"IF('II_Plantejar Ració'!D13<=0,\"\",'II_Plantejar Ració'!F13)","v":""},{"$f":"IF('II_Plantejar Ració'!D13<=0,\"\",('II_Plantejar Ració'!D13*1000)/('II_Plantejar Ració'!$K$4))","v":""},{"$f":"IF('II_Plantejar Ració'!D13<=0,\"\",'II_Plantejar Ració'!G13*B21)","v":""},null,{"$f":"CàlculsOVI!K1","v":"Mg"},{"$f":"'II_Plantejar Ració'!K29","v":0},"g",{"$f":"'II_Plantejar Ració'!M29","v":"P"}]
[{"$f":"IF(B22=\"\",\"\",CàlculsOVI!B13)","v":""},{"$f":"IF('II_Plantejar Ració'!D14<=0,\"\",'II_Plantejar Ració'!D14)","v":""},{"$f":"IF('II_Plantejar Ració'!D14<=0,\"\",'II_Plantejar Ració'!F14)","v":""},{"$f":"IF('II_Plantejar Ració'!D14<=0,\"\",('II_Plantejar Ració'!D14*1000)/('II_Plantejar Ració'!$K$4))","v":""},{"$f":"IF('II_Plantejar Ració'!D14<=0,\"\",'II_Plantejar Ració'!G14*B22)","v":""},null,{"$f":"CàlculsOVI!L1","v":"K"},{"$f":"'II_Plantejar Ració'!K30","v":0},"g",{"$f":"'II_Plantejar Ració'!M30","v":"Mg"}]
[{"$f":"IF(B23=\"\",\"\",CàlculsOVI!B14)","v":""},{"$f":"IF('II_Plantejar Ració'!D15<=0,\"\",'II_Plantejar Ració'!D15)","v":""},{"$f":"IF('II_Plantejar Ració'!D15<=0,\"\",'II_Plantejar Ració'!F15)","v":""},{"$f":"IF('II_Plantejar Ració'!D15<=0,\"\",('II_Plantejar Ració'!D15*1000)/('II_Plantejar Ració'!$K$4))","v":""},{"$f":"IF('II_Plantejar Ració'!D15<=0,\"\",'II_Plantejar Ració'!G15*B23)","v":""},null,{"$f":"CàlculsOVI!M1","v":"Na"},{"$f":"'II_Plantejar Ració'!K31","v":0},"g",{"$f":"'II_Plantejar Ració'!M31","v":"K"}]
[{"$f":"IF(B24=\"\",\"\",CàlculsOVI!B15)","v":""},{"$f":"IF('II_Plantejar Ració'!D16<=0,\"\",'II_Plantejar Ració'!D16)","v":""},{"$f":"IF('II_Plantejar Ració'!D16<=0,\"\",'II_Plantejar Ració'!F16)","v":""},{"$f":"IF('II_Plantejar Ració'!D16<=0,\"\",('II_Plantejar Ració'!D16*1000)/('II_Plantejar Ració'!$K$4))","v":""},{"$f":"IF('II_Plantejar Ració'!D16<=0,\"\",'II_Plantejar Ració'!G16*B24)","v":""},null,{"$f":"CàlculsOVI!N1","v":"S"},{"$f":"'II_Plantejar Ració'!K32","v":0},"g",{"$f":"'II_Plantejar Ració'!M32","v":"Na"}]
[{"$f":"IF(B25=\"\",\"\",CàlculsOVI!B16)","v":""},{"$f":"IF('II_Plantejar Ració'!D17<=0,\"\",'II_Plantejar Ració'!D17)","v":""},{"$f":"IF('II_Plantejar Ració'!D17<=0,\"\",'II_Plantejar Ració'!F17)","v":""},{"$f":"IF('II_Plantejar Ració'!D17<=0,\"\",('II_Plantejar Ració'!D17*1000)/('II_Plantejar Ració'!$K$4))","v":""},{"$f":"IF('II_Plantejar Ració'!D17<=0,\"\",'II_Plantejar Ració'!G17*B25)","v":""},null,{"$f":"CàlculsOVI!O1","v":"Cl"},{"$f":"'II_Plantejar Ració'!K33","v":0},"g",{"$f":"'II_Plantejar Ració'!M33","v":"S"}]
[{"$f":"IF(B26=\"\",\"\",CàlculsOVI!B17)","v":""},{"$f":"IF('II_Plantejar Ració'!D18<=0,\"\",'II_Plantejar Ració'!D18)","v":""},{"$f":"IF('II_Plantejar Ració'!D18<=0,\"\",'II_Plantejar Ració'!F18)","v":""},{"$f":"IF('II_Plantejar Ració'!D18<=0,\"\",('II_Plantejar Ració'!D18*1000)/('II_Plantejar Ració'!$K$4))","v":""},{"$f":"IF('II_Plantejar Ració'!D18<=0,\"\",'II_Plantejar Ració'!G18*B26)","v":""},null,{"$f":"CàlculsOVI!P1","v":"Fe"},{"$f":"'II_Plantejar Ració'!K34","v":0},"mg",{"$f":"'II_Plantejar Ració'!M34","v":"Cl"}]
[{"$f":"IF(B27=\"\",\"\",CàlculsOVI!B18)","v":""},{"$f":"IF('II_Plantejar Ració'!D19<=0,\"\",'II_Plantejar Ració'!D19)","v":""},{"$f":"IF('II_Plantejar Ració'!D19<=0,\"\",'II_Plantejar Ració'!F19)","v":""},{"$f":"IF('II_Plantejar Ració'!D19<=0,\"\",('II_Plantejar Ració'!D19*1000)/('II_Plantejar Ració'!$K$4))","v":""},{"$f":"IF('II_Plantejar Ració'!D19<=0,\"\",'II_Plantejar Ració'!G19*B27)","v":""},null,{"$f":"CàlculsOVI!Q1","v":"Co"},{"$f":"'II_Plantejar Ració'!K35","v":0},"mg",{"$f":"'II_Plantejar Ració'!M35","v":"Fe"}]
[{"$f":"IF(B28=\"\",\"\",CàlculsOVI!B19)","v":""},{"$f":"IF('II_Plantejar Ració'!D20<=0,\"\",'II_Plantejar Ració'!D20)","v":""},{"$f":"IF('II_Plantejar Ració'!D20<=0,\"\",'II_Plantejar Ració'!F20)","v":""},{"$f":"IF('II_Plantejar Ració'!D20<=0,\"\",('II_Plantejar Ració'!D20*1000)/('II_Plantejar Ració'!$K$4))","v":""},{"$f":"IF('II_Plantejar Ració'!D20<=0,\"\",'II_Plantejar Ració'!G20*B28)","v":""},null,{"$f":"CàlculsOVI!R1","v":"Cu"},{"$f":"'II_Plantejar Ració'!K36","v":0},"mg",{"$f":"'II_Plantejar Ració'!M36","v":"Co"}]
[{"$f":"IF(B29=\"\",\"\",CàlculsOVI!B20)","v":""},{"$f":"IF('II_Plantejar Ració'!D21<=0,\"\",'II_Plantejar Ració'!D21)","v":""},{"$f":"IF('II_Plantejar Ració'!D21<=0,\"\",'II_Plantejar Ració'!F21)","v":""},{"$f":"IF('II_Plantejar Ració'!D21<=0,\"\",('II_Plantejar Ració'!D21*1000)/('II_Plantejar Ració'!$K$4))","v":""},{"$f":"IF('II_Plantejar Ració'!D21<=0,\"\",'II_Plantejar Ració'!G21*B29)","v":""},null,{"$f":"CàlculsOVI!S1","v":"Mn"},{"$f":"'II_Plantejar Ració'!K37","v":0},"mg",{"$f":"'II_Plantejar Ració'!M37","v":"Cu"}]
[{"$f":"IF(B30=\"\",\"\",CàlculsOVI!B21)","v":""},{"$f":"IF('II_Plantejar Ració'!D22<=0,\"\",'II_Plantejar Ració'!D22)","v":""},{"$f":"IF('II_Plantejar Ració'!D22<=0,\"\",'II_Plantejar Ració'!F22)","v":""},{"$f":"IF('II_Plantejar Ració'!D22<=0,\"\",('II_Plantejar Ració'!D22*1000)/('II_Plantejar Ració'!$K$4))","v":""},{"$f":"IF('II_Plantejar Ració'!D22<=0,\"\",'II_Plantejar Ració'!G22*B30)","v":""},null,{"$f":"CàlculsOVI!T1","v":"Zn"},{"$f":"'II_Plantejar Ració'!K38","v":0},"mg",{"$f":"'II_Plantejar Ració'!M38","v":"Mn"}]
[{"$f":"IF(B31=\"\",\"\",CàlculsOVI!B22)","v":""},{"$f":"IF('II_Plantejar Ració'!D23<=0,\"\",'II_Plantejar Ració'!D23)","v":""},{"$f":"IF('II_Plantejar Ració'!D23<=0,\"\",'II_Plantejar Ració'!F23)","v":""},{"$f":"IF('II_Plantejar Ració'!D23<=0,\"\",('II_Plantejar Ració'!D23*1000)/('II_Plantejar Ració'!$K$4))","v":""},{"$f":"IF('II_Plantejar Ració'!D23<=0,\"\",'II_Plantejar Ració'!G23*B31)","v":""},null,{"$f":"CàlculsOVI!U1","v":"Iode"},{"$f":"'II_Plantejar Ració'!K39","v":0},"mg",{"$f":"'II_Plantejar Ració'!M39","v":"Zn"}]
[{"$f":"IF(B32=\"\",\"\",CàlculsOVI!B23)","v":""},{"$f":"IF('II_Plantejar Ració'!D24<=0,\"\",'II_Plantejar Ració'!D24)","v":""},{"$f":"IF('II_Plantejar Ració'!D24<=0,\"\",'II_Plantejar Ració'!F24)","v":""},{"$f":"IF('II_Plantejar Ració'!D24<=0,\"\",('II_Plantejar Ració'!D24*1000)/('II_Plantejar Ració'!$K$4))","v":""},{"$f":"IF('II_Plantejar Ració'!D24<=0,\"\",'II_Plantejar Ració'!G24*B32)","v":""},null,{"$f":"CàlculsOVI!V1","v":"Se"},{"$f":"'II_Plantejar Ració'!K40","v":0},"mg",{"$f":"'II_Plantejar Ració'!M40","v":"Iode"}]
[{"$f":"IF(B33=\"\",\"\",CàlculsOVI!B24)","v":""},{"$f":"IF('II_Plantejar Ració'!D25<=0,\"\",'II_Plantejar Ració'!D25)","v":""},{"$f":"IF('II_Plantejar Ració'!D25<=0,\"\",'II_Plantejar Ració'!F25)","v":""},{"$f":"IF('II_Plantejar Ració'!D25<=0,\"\",('II_Plantejar Ració'!D25*1000)/('II_Plantejar Ració'!$K$4))","v":""},{"$f":"IF('II_Plantejar Ració'!D25<=0,\"\",'II_Plantejar Ració'!G25*B33)","v":""},null,{"$f":"CàlculsOVI!W1","v":"Vit A"},{"$f":"'II_Plantejar Ració'!K41","v":0},"UI",{"$f":"'II_Plantejar Ració'!M41","v":"Se"}]
[{"$f":"IF(B34=\"\",\"\",CàlculsOVI!B25)","v":""},{"$f":"IF('II_Plantejar Ració'!D26<=0,\"\",'II_Plantejar Ració'!D26)","v":""},{"$f":"IF('II_Plantejar Ració'!D26<=0,\"\",'II_Plantejar Ració'!F26)","v":""},{"$f":"IF('II_Plantejar Ració'!D26<=0,\"\",('II_Plantejar Ració'!D26*1000)/('II_Plantejar Ració'!$K$4))","v":""},{"$f":"IF('II_Plantejar Ració'!D26<=0,\"\",'II_Plantejar Ració'!G26*B34)","v":""},null,{"$f":"CàlculsOVI!X1","v":"Vit D"},{"$f":"'II_Plantejar Ració'!K42","v":0},"UI",{"$f":"'II_Plantejar Ració'!M42","v":"Vit A"}]
["TOTAL",{"$f":"SUM(B12:B34)","v":1},{"$f":"SUM(C12:C34)","v":100},{"$f":"SUM(D12:D34)","v":1000},{"$f":"'II_Plantejar Ració'!K16","v":0.01},null,{"$f":"CàlculsOVI!Y1","v":"Vit E"},{"$f":"'II_Plantejar Ració'!K43","v":0},"UI",{"$f":"'II_Plantejar Ració'!M43","v":"Vit D"}]
[null,null,null,null,null,null,{"$f":"CàlculsOVI!Z1","v":"AG"},{"$f":"'II_Plantejar Ració'!K44","v":15.567499999999997},"%",{"$f":"'II_Plantejar Ració'!M44","v":"Vit E"}]
[null,"Fa %",{"$f":"'II_Plantejar Ració'!K11","v":100},"% greix s/MS",{"$f":"'II_Plantejar Ració'!L49","v":2.3000000000000003},null,{"$f":"CàlculsOVI!AA$1","v":"DT_N"},{"$f":"'II_Plantejar Ració'!K45","v":23.285550000000001},"%",{"$f":"'II_Plantejar Ració'!M45","v":""}]
[null,"Co %",{"$f":"'II_Plantejar Ració'!K12","v":0},null,null,null,{"$f":"CàlculsOVI!AB1","v":"PF"},{"$f":"'II_Plantejar Ració'!K46","v":4.5406822500000006},"%",{"$f":"'II_Plantejar Ració'!M46","v":""}]
[null,null,null,null,null,null,{"$f":"CàlculsOVI!AC1","v":"MNT_PB"},{"$f":"'II_Plantejar Ració'!L47/10","v":0.4333370201691607},"%",{"$f":"'II_Plantejar Ració'!M47","v":"PDIA"}]
[null,null,null,null,null,null,{"$f":"CàlculsOVI!AD1","v":"PDIA"},{"$f":"'II_Plantejar Ració'!K48","v":91.97961957855},"g",{"$f":"'II_Plantejar Ració'!M48","v":""}]
[null,null,null,null,null,null,{"$f":"CàlculsOVI!AE1","v":"NI ref"},{"$f":"'II_Plantejar Ració'!K49","v":3.5350999999999999},"%",{"$f":"'II_Plantejar Ració'!M49","v":""}]
[null,null,null,null,null,null,{"$f":"CàlculsOVI!AF1","v":"dMO"},{"$f":"'II_Plantejar Ració'!K50","v":43.973570000000002},"g",{"$f":"'II_Plantejar Ració'!M50","v":""}]
[null,null,null,null,null,null,{"$f":"CàlculsOVI!AG$1","v":"MOD"},{"$f":"'II_Plantejar Ració'!K51","v":62.402200000000001},"g",{"$f":"'II_Plantejar Ració'!M51","v":""}]
[null,null,null,null,null,null,{"$f":"CàlculsOVI!AH$1","v":"EE"},{"$f":"'II_Plantejar Ració'!K52","v":57.099550000000001},"g",{"$f":"'II_Plantejar Ració'!M52","v":""}]
[null,null,null,null,null,null,{"$f":"CàlculsOVI!AI$1","v":"FB"},{"$f":"'II_Plantejar Ració'!K53","v":0},"g",{"$f":"'II_Plantejar Ració'!M53","v":""}]
[null,null,null,null,null,null,{"$f":"CàlculsOVI!AJ$1","v":"NDF"},{"$f":"'II_Plantejar Ració'!K54","v":15.60055},"g",{"$f":"'II_Plantejar Ració'!M54","v":""}]
[null,null,null,null,null,null,{"$f":"CàlculsOVI!AK$1","v":"ADF"},{"$f":"'II_Plantejar Ració'!K55","v":0},"g",{"$f":"'II_Plantejar Ració'!M55","v":""}]
[null,null,null,null,null,null,{"$f":"CàlculsOVI!AL$1","v":"Lignina"},{"$f":"'II_Plantejar Ració'!K56","v":0.74},"g",{"$f":"'II_Plantejar Ració'!M56","v":""}]
[null,null,null,null,null,null,{"$f":"CàlculsOVI!AM$1","v":"cendres"},{"$f":"'II_Plantejar Ració'!K57","v":80.203671223540496},"g"]
[null,null,null,null,null,null,{"$f":"CàlculsOVI!AN$1","v":"Mo"},{"$f":"'II_Plantejar Ració'!K58","v":138.09945000000002},"g",{"$f":"'II_Plantejar Ració'!M58","v":""}]
[]
[]
[]
[]
[]
[]
[]
[]
[]
[]
[]
[]
[]
[]
[]
[{"$f":"IF(B66=\"\",\"\",CàlculsOVI!B26)","v":""},{"$f":"IF('II_Plantejar Ració'!D27=0,\"\",'II_Plantejar Ració'!D27)","v":""}]

{"sheet":"NR","index":8,"n_rows":18,"n_cols":15,"rows_kept":18,"cut":false,"hidden":true,"merged":[[0,4,0,14]]}
["Potencial creixement xais",3,null,null,"Co distribuït a 5èna setmana"]
["Mascles moderat",null,null,"MSTI(4-6)",0.2,0.3,0.4,0.5,0.6,0.7,0.8,0.9,1,1.1000000000000001,1.2]
["Femelles moderat",null,null,1.6,-1.51,-0.94,-0.66,-0.48,-0.37,-0.28999999999999998,-0.23,-0.18,-0.14000000000000001,-0.11,-0.09]
["Mascles alt",null,null,1.7,-1.34,-0.82,-0.56999999999999995,-0.41,-0.31,-0.24,-0.18,0.14000000000000001,-0.11,-0.08,-0.06]
["Femelles alt",null,null,1.8,-1.1599999999999999,-0.71,-0.48,-0.34,-0.25,-0.19,-0.14000000000000001,-0.1,-7.0000000000000007E-2,-0.05,-0.03]
["Tipus animal",2,null,1.9,-0.99,-0.59,-0.39,-0.27,-0.2,-0.14000000000000001,-0.1,-0.06,-0.04,-0.02,0]
["Ovelles eixutes i inici gestació",null,null,2,-0.81,-0.47,-0.31,-0.2,-0.14000000000000001,-0.09,-0.05,-0.02,0,0.02,0.03]
["Reconstitució ovelles",null,null,2.1,-0.63,-0.36,-0.22,-0.13,-0.08,-0.04,-0.01,0.01,0.03,0.05,0.06]
["Ovelles amb anyells 50-150 g/dia",null,null,2.2000000000000002,-0.46,-0.24,-0.13,-0.06,-0.02,0.01,0.04,0.05,7.0000000000000007E-2,0.08,0.09]
["Mardà/marrà",null,null,2.2999999999999998,-0.28999999999999998,-0.12,-0.04,0.01,0.04,0.06,0.08,0.09,0.1,0.11,0.12]
["Ovelles en gestació (6ena setmana abans del part -part)",null,null,2.4,-0.11,-0.01,0.05,0.08,0.1,0.11,0.12,0.13,0.14000000000000001,0.14000000000000001,0.15]
["Ovelles alletants 1-14 setmanes després del part",null,null,2.5,7.0000000000000007E-2,0.11,0.13,0.15,0.16,0.16,0.17,0.17,0.17,0.18,0.18]
["Ovelles munyides"]
["Creixement i engreix de xais"]
[null,1]
["Estabulació "]
["Pastura prop explotació"]
["Pastura lluny explotació"]