{"text_format":"1","workbook":"xlsx","n_sheets":10,"sheets":["Paràmetres","Tabla Forrajes","Tabla Concentrados","Tabla Minerales-aa","CálculosEV","Apuntes Cria","NR","I_Necesidades","II_Plantear Ración","III_Resultado Ración"],"not_rendered":{"charts":0,"images":7,"macros":1,"external_links":0,"defined_names":283,"comments":0,"pivot_tables":0},"unopened":[],"bounds":{"document_bytes":16777216,"sheet_cells":100000,"rows_first":2000,"rows_last":500,"rows_between":2000,"halvings":0,"cell_chars":16384,"cell_head_chars":4096},"cells_cut":0,"cells_raw":0,"read":"whole","date_system":"1900"}

{"sheet":"Paràmetres","index":0,"n_rows":42,"n_cols":3,"rows_kept":42,"cut":false,"hidden":true,"merged":[]}
["COMPONENTS","POSICIÓ","PARÀMETRES DE CÀLCUL"]
[{"$f":"'Tabla Forrajes'!B$1","v":"MS %"},1,2]
[{"$f":"'Tabla Forrajes'!C$1","v":"UFL"},{"$f":"1+B2","v":2},1]
[{"$f":"'Tabla Forrajes'!D$1","v":"UFV"},3,1]
[{"$f":"'Tabla Forrajes'!E1","v":"MNT_PB"},4,1]
[{"$f":"'Tabla Forrajes'!F1","v":"PDIA"},5,1]
[{"$f":"'Tabla Forrajes'!G1","v":"PDI"},6,1]
[{"$f":"'Tabla Forrajes'!H1","v":"BPR"},7,1]
[{"$f":"'Tabla Forrajes'!I1","v":"UEL"},8,1]
[{"$f":"'Tabla Forrajes'!J1","v":"UEB"},9,1]
[{"$f":"'Tabla Forrajes'!K1","v":"UEM"},10,1]
[{"$f":"'Tabla Forrajes'!L1","v":"NI ref"},11,1]
[{"$f":"'Tabla Forrajes'!M1","v":"dMO"},12,1]
[{"$f":"'Tabla Forrajes'!N1","v":"MOD"},13,1]
[{"$f":"'Tabla Forrajes'!O1","v":"EE"},14,1]
[{"$f":"'Tabla Forrajes'!P1","v":"FB"},15,1]
[{"$f":"'Tabla Forrajes'!Q1","v":"NDF"},16,1]
[{"$f":"'Tabla Forrajes'!R1","v":"ADF"},17,1]
[{"$f":"'Tabla Forrajes'!S1","v":"Lignina"},18,1]
[{"$f":"'Tabla Forrajes'!T1","v":"Cenizas"},19,1]
[{"$f":"'Tabla Forrajes'!U1","v":"Ca"},20,1]
[{"$f":"'Tabla Forrajes'!V1","v":"P"},21,1]
[{"$f":"'Tabla Forrajes'!W1","v":"Mg"},22,1]
[{"$f":"'Tabla Forrajes'!X1","v":"Cl"},23,1]
[{"$f":"'Tabla Forrajes'!Y1","v":"K"},24,1]
[{"$f":"'Tabla Forrajes'!Z1","v":"Na"},25,1]
[{"$f":"'Tabla Forrajes'!AA1","v":"S"},26,1]
[{"$f":"'Tabla Forrajes'!AB1","v":"Co"},27,1]
[{"$f":"'Tabla Forrajes'!AC1","v":"Cu"},28,1]
[{"$f":"'Tabla Forrajes'!AD1","v":"Mo"},29,1]
[{"$f":"'Tabla Forrajes'!AE1","v":"Yodo"},30,1]
[{"$f":"'Tabla Forrajes'!AF1","v":"Fe"},31,1]
[{"$f":"'Tabla Forrajes'!AG1","v":"Mn"},32,1]
[{"$f":"'Tabla Forrajes'!AH1","v":"Se"},33,1]
[{"$f":"'Tabla Forrajes'!AI1","v":"Zn"},34,1]
[{"$f":"'Tabla Forrajes'!AJ1","v":"Vit A"},35,1]
[{"$f":"'Tabla Forrajes'!AK1","v":"Vit D"},36,1]
[{"$f":"'Tabla Forrajes'!AL1","v":"Vit E"},37,1]
[{"$f":"'Tabla Forrajes'!AM1","v":"AG"},38,1]
[{"$f":"'Tabla Forrajes'!AN1","v":"DT_N"},39,1]
[{"$f":"'Tabla Forrajes'!AO1","v":"PF"},40,1]
[{"$f":"'Tabla Forrajes'!AP1","v":"MOF"},41,1]

{"sheet":"Tabla Forrajes","index":1,"n_rows":399,"n_cols":47,"rows_kept":399,"cut":false,"hidden":false,"merged":[]}
["Nombre","MS %","UFL","UFV","MNT_PB","PDIA","PDI","BPR","UEL","UEB","UEM","NI ref","dMO","MOD","EE","FB","NDF","ADF","Lignina","Cenizas","Ca","P","Mg","Cl","K","Na","S","Co","Cu","Mo","Yodo","Fe","Mn","Se","Zn","Vit A","Vit D","Vit E","AG","DT_N","PF","MOF"]
[]
["VERDE raigrás italiano Hoja otoño / invierno",16.600000000000001,0.98752542301286184,0.96862343900373249,190,37.049999999999997,83.729305252851219,43.996299718419976,0.99084854862359462,0.98292252314240713,0.97878066167451971,2.7532019636685905,0.75792000000000004,649.53744000000006,41,238,531.31999999999994,265,null,143,2.2800000000000002,2.5799999999999996,null,null,null,null,null,null,null,null,null,null,null,null,null,null,null,null,27.18,0.74,null,566.53268820000017]
["VERDE raigrás italiano Hoja primavera",15.1,1.1000000000000001,1.0989935399169917,191,34.379999999999995,86.075046066243218,44.124884807494979,0.97089801460888281,0.94946304619472999,0.93585147423185366,2.8794962811112788,0.81287000000000009,704.7582900000001,43,178,462.91999999999996,203,null,133,2,2.4,1.7,null,30,3,null,null,8.1,null,null,null,85.1,null,null,null,null,null,27.285,0.76,null,628.16571895000016]
["VERDE raigrás italiano Espiga a 10 cm",15.8,1.0735144194744679,1.0694268732466976,168,26.459999999999994,77.846214502419187,31.104514855970013,0.99103463889108023,0.98323915467272305,0.97919111815687709,2.7520478788609646,0.79571999999999987,705.0079199999999,39,188,474.32,213,null,114,1.8,2.1,1.7,null,30,3,1,null,8.1,null,null,null,85.1,null,null,null,null,null,24.87,0.79,null,636.23762369999986]
["VERDE raigrás italiano 1 semana antes inicio espigado",16.399999999999999,0.95689870666779997,0.92793230273629967,112,22.68,69.968842313824013,-17.036897495350015,1.0571012443135424,1.1012950217887776,1.1379992516516921,2.3679987801502724,0.73790000000000011,663.37210000000005,33,230,522.20000000000005,257,null,101,1.8,1.7999999999999998,1.7,null,30,3,1,null,6,null,null,null,80,null,23,80000,30,20,18.989999999999998,0.73,null,597.03612650000002]
["VERDE raigrás italiano Inicio espigado",16.5,0.93684956106994044,0.90410248855808739,105,21.262500000000003,67.8124260345312,-21.595384802955007,1.0672228531944756,1.1204338752740313,1.1648766033788691,2.3133616315295407,0.72816999999999998,654.62482999999997,32,238,531.31999999999994,265,null,101,1.8,1.7999999999999998,1.7,null,30,3,1,null,5,null,null,null,80,null,23,80000,30,20,18.254999999999999,0.73,null,589.36557444999994]
["VERDE raigrás italiano Espigado",17.8,0.88184075870700551,0.83779666868101732,88,19.14,63.382896942944008,-34.052214303349999,1.0914348948575481,1.1674392075396804,1.2323083649584736,2.1867747686788919,0.69764999999999999,629.97794999999996,30,265,562.09999999999991,293,null,97,1.8,1.5,null,null,null,null,null,null,5,null,null,null,79.599999999999994,null,23.8,80000,30,20,16.47,0.71,null,565.53844649999996]
["VERDE raigrás italiano Final espigado",20.399999999999999,0.85440088506958656,0.80318318028193669,80,17.400000000000002,60.325511947001601,-38.918934249190016,1.0967717953522336,1.178039486138192,1.2478010418173731,2.1596238097367575,0.67756000000000005,617.93472000000008,29,284,583.76,313,null,88,1.8,1.5,2.2999999999999998,null,26,1.5,null,null,null,null,null,null,null,null,null,80000,30,20,15.629999999999999,0.71,null,554.22718010000017]
["VERDE raigrás italiano Inicio floración",24,0.83423945067046223,0.77936346043230376,70,15.225000000000003,57.342206399603207,-45.480477313380007,1.0940999515278929,1.1727215793467025,1.2400153550274735,2.1731834438964874,0.66587000000000007,608.60518000000002,28,293,594.02,322,null,86,1.8,1.2,null,null,null,null,null,null,null,null,null,null,null,null,null,80000,30,20,14.579999999999998,0.71,null,546.73821020000003]
["VERDE raigrás italiano Floración",27.5,0.80685367113340589,0.74696978180239471,60,13.500000000000004,54.399338757356801,-52.284078594370001,1.094509341268644,1.1735349707846756,1.2412044528855173,2.1711014921501279,0.64962999999999993,595.06107999999995,27,307,609.98,337,null,84,1.8,1.2,null,null,null,null,null,null,null,null,null,null,null,null,null,80000,30,20,13.530000000000001,0.7,null,534.27091229999985]
["VERDE Maíz Pastoso",30.7,1.3365193726351559,1.2976569692461448,77.400000000000006,13.932,58.791469320032924,-42.365192088735554,1.0287076803514683,1.0491399436253608,1.0663920128792077,1.4,0.72046413502109707,687.46687763713089,23.8,208,454.4,243.9,29.5,45.8,0.84000000000000008,1.6099999999999999,null,null,null,null,1.1000000000000001,null,null,null,null,160,null,null,null,80000,30,20,15.356999999999999,0.76,null,630.30865213818572]
["VERDE Avena Inicio alargamiento tallos",14.9,1.064086631371385,1.0648547254219185,120,26.1,78.540947235026891,-13.57775696030404,1.020791556789022,1.0349885040559215,1.047364373208719,2.5729162731279134,0.81001137656427757,712,34,230,522.20000000000005,257,null,121,2,2.64,null,null,null,null,null,null,null,null,null,null,null,null,null,80000,30,20,19.829999999999998,0.74,null,646.83945702787264]
["VERDE Avena Inicio espigado",20.6,0.91333093057134518,0.87419395222156171,102,19.89,65.217582265828071,-21.950791599748623,1.0602585729914722,1.1072336004065757,1.1463038738332441,2.3508433507354152,0.7104972375690608,643,32,302,604.28,331,null,95,1.8,2.31,null,null,null,null,null,null,null,null,null,null,null,null,null,80000,30,20,17.939999999999998,0.74,null,578.03604450276248]
["VERDE Avena Floración",17.7,0.82294203192554172,0.76625553664384183,101,18.9375,59.893045182320009,-17.979191347374989,1.1028559437781433,1.1902323151561571,1.2657544233897913,2.1289918406971013,0.66,594,32,333,639.61999999999989,364,null,100,1.6,1.98,null,null,null,null,null,null,null,null,null,null,null,null,null,80000,30,20,17.835000000000001,0.75,null,526.55342624999992]
["VERDE Avena Lechoso-pastoso",31.8,0.73565844803415192,0.65655065623404674,67,12.5625,48.699708160190347,-40.323714689952581,1.1023148702224652,1.189143269883159,1.2641450199268489,2.1317022946299837,0.58943965517241381,547,25,270,567.79999999999995,298,null,72,1.4000000000000001,1.6500000000000001,null,null,null,null,null,null,null,null,null,null,null,null,null,80000,30,20,14.265000000000001,0.75,null,482.66640737068963]
["VERDE Avena Pastoso",38.299999999999997,0.70725373323244844,0.62325068836847375,63,12.285,46.824005315001301,-42.668014084259411,1.0852102252608484,1.1551863027804197,1.2145329392128961,2.2187795429159296,0.56989247311827962,530,25,263,559.81999999999994,291,null,70,1.2000000000000002,1.6500000000000001,null,null,null,null,null,null,null,null,null,null,null,null,null,80000,30,20,13.844999999999999,0.74,null,464.78461869623663]
["VERDE Triticale Lechoso-pastoso",40.51,0.78663088364503642,0.71307400675309951,71.900000000000006,13.481250000000001,51.742682232248974,-38.677291137998182,1.0463959657475401,1.0813694287603073,1.1103630076712525,2.4269367955393735,0.61026200873362446,574.92783842794756,14.8,299,618.40000000000009,350.09999999999997,43.5,57.9,1.1599999999999999,0.99,2.7,null,25,1.7,3,null,8.6,0.44,null,null,43.9,null,24.1,80000,30,20,14.779499999999999,0.75,null,510.88026617521825]
["VERDE Alfalfa Inicio botones florales",19.829999999999998,0.89545070680381955,0.84539321239714582,196.70000000000002,33.930750000000003,74.375738644794566,59.446436105308493,0.97832950718065281,0.96181498260220788,0.95159725192721134,2.8318501700856706,0.67482600000000004,585.20910720000006,22.6,277.39999999999998,442.1,334.4,74.3,132.79999999999998,5.4300000000000006,1.75,null,null,null,null,null,null,8.8000000000000007,1.3,null,null,26.7,null,32.299999999999997,120000,20,100,20.313500000000001,0.77,null,502.67821828500007]
["VERDE Alfalfa Vegetativo 30 cm",14.4,1.0579703950352333,1.0379178369075921,246,40.589999999999989,87.137906090886389,95.114082554989992,0.93430199369735301,0.89049322326002445,0.86227914358067548,3.1251838337790021,0.75198999999999994,654.9832899999999,33,201,489.14,259,null,129,4.95,3.15,null,null,null,null,null,null,8.8000000000000007,1.3,null,null,26.7,null,32.299999999999997,120000,20,100,25.49,0.78,null,568.78883789999986]
["VERDE Zulla hoja, 1º año",11,1.096854529391851,1.0923154153996353,233.5,47.283749999999998,101.47599610799841,71.579615456252483,0.94406749113829702,0.90593437062390314,0.88129249746648941,3.0577598782129622,0.78986500000000004,687.81444199999999,27,163.5,249.60000000000002,234.1,null,129.19999999999999,3.3,2.0999999999999996,null,null,null,null,null,null,null,null,null,null,null,null,null,null,null,null,24.177499999999998,0.73,null,598.12774052500004,17.003770031249999,2.8672075000000001,3.7227700000000006,18.761599999999998,52.119874424999999]
["VERDE Zulla tallo hoja, 1º año",11.5,1.0185842087953727,0.99799522826140863,186,37.665000000000006,91.197186063974414,37.935959275039991,0.9882329889956053,0.97848114339409076,0.97303159891575208,2.7694689902423741,0.75451499999999994,664.04865150000001,27,198.5,280.5,269.89999999999998,null,119.9,3.3,2.0999999999999996,null,null,null,null,null,null,null,null,null,null,null,null,null,null,null,null,19.189999999999998,0.73,null,583.78359840000007,18.141730500000001,3.0018699999999998,3.9821200000000001,19.5596,49.194256799999998]
["VERDE Zulla yemas florales, 1º año",11.91,0.97166206695584478,0.94000581377256476,170.3,34.48575000000001,87.26725566060513,27.647897405304509,1.0028017402943088,1.00343500554711,1.0055373170303181,2.6799411559202033,0.72744699999999995,645.68195719999994,27,225.3,323.89999999999998,304.20000000000005,null,112.4,3.5999999999999996,2.0999999999999996,null,null,null,null,null,null,null,null,null,null,null,null,null,null,null,null,17.541499999999999,0.73,null,567.47013344499987,18.572553611250001,3.0463795,4.0678420000000006,19.823360000000001,48.095989832999997]
["VERDE Zulla Botones florales, 1º año",13.77,0.96614085568473185,0.93053932906038217,168.9,34.202249999999999,86.945352644738875,26.685902117595493,1.0007309591481519,0.99985588272857107,1.0008442882212805,2.6925075872814803,0.71795299999999995,645.15256579999993,27,234.7,348.5,330.4,null,101.4,3.5999999999999996,2.0999999999999996,null,null,null,null,null,null,null,null,null,null,null,null,null,null,null,null,17.394500000000001,0.73,null,566.63557555499983,18.612290651249999,3.0503485000000001,4.0754860000000006,19.846879999999999,47.994887937000001]
["VERDE Zulla Inicio Floración, 1º año",14.5,0.91962154275921515,0.87567449613502713,167,32.564999999999998,84.172959866843513,28.742562708057012,1.0100190345863349,1.0159941012896332,1.0220874989156672,2.636546129937039,0.69512699999999994,620.33133479999992,23,257.3,366,334.09999999999997,null,107.6,3.5999999999999996,2.0999999999999996,null,null,null,null,null,null,null,null,null,null,null,null,null,null,null,null,17.195,0.74,null,541.96713896999984,18.666565124999998,3.0557349999999999,4.0858600000000003,19.878799999999998,47.856848699999993]
["VERDE Zulla Floración, 1º año",14.92,0.88969990351872497,0.84135662913691533,162.39999999999998,31.667999999999999,82.562520454548491,26.453311789767998,1.0178496754832842,1.0297714065984536,1.0403919149130092,2.5901593438934505,0.68209799999999998,604.61166719999994,23,270.2,390.09999999999997,346.3,null,113.6,2.6999999999999997,3.5,null,null,null,null,null,null,null,null,null,null,null,null,null,null,null,null,16.711999999999996,0.74,null,526.4629792799999,18.799614720000001,3.0687760000000002,4.1109760000000009,19.95608,47.518692671999986]
["VERDE Zulla Fructificación, 1º año",18.93,0.77401946656011245,0.70503347951194739,130.80000000000001,25.506,74.013164041958419,6.7995561844399965,1.0561333578065242,1.0994802235470891,1.1354676663546046,2.3732783588410475,0.61816499999999996,549.4868684999999,21,333.5,519.6,450.7,null,111.1,2.6999999999999997,3.5,null,null,null,null,null,null,null,null,null,null,null,null,null,null,null,null,13.393999999999998,0.74,null,474.58197239999993,19.776666179999999,3.1583619999999999,4.2835120000000009,20.48696,45.044367167999994]
["VERDE Zulla hoja, 2º año",11,1.0997475678808939,1.0955739358757886,240.5,48.701250000000002,102.77599704931104,76.873207735451487,0.93857706228682003,0.89722712927592585,0.87054930247213902,3.0954948008925363,0.790269,686.98084170000004,27,163.1,272.8,253.29999999999998,null,130.69999999999999,3.3,2.0999999999999996,null,null,null,null,null,null,null,null,null,null,null,null,null,null,null,null,24.912499999999998,0.73,null,595.57430131500007,16.857100781250001,2.8473625,3.6845500000000007,18.643999999999998,52.500545624999994]
["VERDE Zulla tallo hoja, 2º año",10.029999999999999,1.027185590826025,1.0072223154339977,206.5,41.816250000000004,95.042085967479366,53.379631300813486,0.97340769944599659,0.95361978058004249,0.9411371114222743,2.8633243838941782,0.75512100000000004,662.46765330000005,27,197.89999999999998,311.2,290.39999999999998,null,122.69999999999999,3.3,2.0999999999999996,null,null,null,null,null,null,null,null,null,null,null,null,null,null,null,null,21.342499999999998,0.73,null,577.12612933500009,17.62009903125,2.9437525,3.8701900000000009,19.215199999999999,50.530119825]
["VERDE Zulla yemas florales, 2º año",12.06,0.94147987825051005,0.90301862075432326,177.39999999999998,35.923499999999997,87.760272637741451,34.307042753528975,1.0059539503059134,1.0089040219475649,1.012728492916573,2.6609114472156188,0.70946900000000002,628.16385259999993,27,243.1,360.20000000000005,330.5,null,114.60000000000001,3.5999999999999996,2.0999999999999996,null,null,null,null,null,null,null,null,null,null,null,null,null,null,null,null,18.286999999999995,0.73,null,546.93960009,18.374356845000001,3.0262510000000002,4.0290760000000008,19.704080000000001,48.600736571999995]
["VERDE Zulla Botones Florales, 2º año",12.51,0.89511695047393725,0.84831034371938674,168.9,34.202249999999999,85.027463789994556,29.682603453133499,1.0212578557591314,1.0358175124197606,1.0484744022230137,2.5701923041798236,0.68644100000000008,605.6468943000001,27,265.89999999999998,382.29999999999995,352.40000000000003,null,117.69999999999999,3.5999999999999996,2.0999999999999996,null,null,null,null,null,null,null,null,null,null,null,null,null,null,null,null,17.394500000000001,0.73,null,524.95683653499998,18.612290651249999,3.0503485000000001,4.0754860000000006,19.846879999999999,47.994887937000001]
["VERDE Zulla Inicio Floración, 2º año",15.37,0.86881967024630535,0.81422239885418368,151.5,29.5425,80.223350325455058,18.721171366476486,1.0317230795400663,1.0545743042255284,1.0737438177302745,2.5097055696390158,0.66603899999999994,598.43604149999999,23,286.10000000000002,406,371.5,null,101.5,3.5999999999999996,2.0999999999999996,null,null,null,null,null,null,null,null,null,null,null,null,null,null,null,null,15.567499999999999,0.74,null,521.819591565,19.12419778125,3.0996774999999999,4.1704900000000009,20.139199999999999,46.695057824999992]
["VERDE Zulla Floración, 2º año",17.12,0.83214342113550244,0.77228576567026164,141.1,27.514499999999998,77.408014276619213,12.25538394278249,1.0404074604954003,1.0703623520467973,1.0952454344255966,2.4604355836793905,0.64896999999999994,579.98448899999994,23,303,452.59999999999997,406.5,null,106.30000000000001,2.6999999999999997,3.5,null,null,null,null,null,null,null,null,null,null,null,null,null,null,null,null,14.475499999999997,0.74,null,504.70954182499997,19.446103001250002,3.1291614999999999,4.2272740000000004,20.31392,45.879897296999992]
["VERDE Zulla Fructificación, 2º año",20.03,0.77143119127727278,0.69909135051730531,135.39999999999998,26.402999999999995,74.793560372722553,10.385749417620975,1.0522008612083678,1.0921340283508449,1.1252497728173221,2.3948290458003165,0.60968100000000003,548.65193190000002,21,341.9,491.1,452.9,null,100.1,2.6999999999999997,3.5,null,null,null,null,null,null,null,null,null,null,null,null,null,null,null,null,13.876999999999995,0.74,null,472.04799141000001,19.627590644999998,3.145321,4.2583960000000012,20.409680000000002,45.420985451999996]
["VERDE Zulla Botones",11,0.98714581306540561,0.96685370267084725,199,40.297499999999999,86.213032515440005,49.554763844624986,0.98284221180709641,0.96937985564538043,0.96129936913126734,2.8032691232892639,0.753,637.79100000000005,27,200,488,230,null,153,3.3,2.0999999999999996,null,null,null,null,null,null,null,null,null,null,null,null,null,120000,20,100,20.555,0.73,null,554.17574625000009]
["VERDE Zulla Floración",13.5,0.85663511928844371,0.80590339975096426,155,30.225000000000001,70.915031325385598,22.204400792085,1.0336253408704008,1.0580151174918615,1.0784116566464967,2.4988424625369929,0.67320999999999998,586.36590999999999,23,279,578.05999999999995,305.05,null,129,3.5999999999999996,2.0999999999999996,null,null,null,null,null,null,null,null,null,null,null,null,null,120000,20,100,15.934999999999999,0.74,null,509.39637284999998]
["VERDE Zulla Final floración",15.3,0.8276145296713725,0.76722137641537558,152,29.64,68.692100739392004,20.916130304700008,1.0414164228237595,1.0722099432557681,1.0977756576883742,2.4547646150194544,0.64694999999999991,574.49159999999995,21,305,607.70000000000005,329.75,null,112,2.6999999999999997,3.5,null,null,null,null,null,null,null,null,null,null,null,null,null,120000,20,100,15.619999999999997,0.74,null,496.43768699999998]
["ENSILADO prehenificado raigrás italiano 1 semana antes inicio espigado",33.5,0.91540389584190662,0.87232923811261709,123,17,67,5,1.05,1.07,1.35,2,0.73,649.70000000000005,36,246,510,275,null,110,1.8399999999999999,1.56,null,null,null,null,null,null,null,null,null,null,null,null,null,8000,200,5,19,0.79,80,588.49475000000007]
["ENSILADO prehenificado raigrás italiano Inicio espigado",33.5,0.88,0.82,117,16,65,1,1.06,1.08,1.39,1.9,0.70604299999999998,631.9,35,254,520,283,null,110,1.8399999999999999,1.56,null,null,null,null,null,null,null,null,null,null,null,null,null,8000,200,5,19,0.79,80,570.04267528000003]
["ENSILADO prehenificado raigrás italiano Final espigado",33.5,0.78,0.71,95,12,59,-14,1.1100000000000001,1.18,1.62,1.7,0.66,594.66,33,297,571,327,null,99,1.8399999999999999,1.38,null,null,null,null,null,null,null,null,null,null,null,null,null,8000,200,5,17,0.79,80,534.52604999999994]
["ENSILADO Prat natural plano, gramíneas en gran parte",48,0.9301076693133391,0.86569319205113415,114.3,15.087599999999998,51.530586601789764,-5.2529299494965009,1.1317898668132078,1.2295663735641016,1.6383431146859011,1.6448208043647601,0.66871099999999994,599.16505599999994,22.200000000000003,311.3,584.20000000000005,385,null,104,3.48,1.8199999999999998,null,null,null,null,null,null,null,null,null,null,null,null,null,8000,200,5,18.256900000000002,0.78,115,535.97955423500002]
["ENSILADO Maíz Lechoso",28.5,0.9421569564891038,0.88957697028723326,78.099999999999994,13.667499999999999,49.998667512565987,-39.596976739999988,1.0806638363566192,1.1912972600163021,1.3455328310010872,1.4,0.69,651.22199999999987,33.299999999999997,232.60000000000002,488.2,278.39999999999998,30.4,56.2,1.4400000000000002,1.6099999999999999,null,null,null,null,null,null,null,null,null,null,null,null,null,null,null,null,24,0.75,100,588.34459999999979]
["ENSILADO Maíz Lechoso-pastoso",28.5,0.97874640109961941,0.93392943082914304,78.099999999999994,13.667499999999999,51.607525824622435,-41.05332562000001,1.0422094841063054,1.1525629360024265,1.2846865364851052,1.4,0.71,670.09799999999996,33.299999999999997,232.60000000000002,488.2,278.39999999999998,30.4,56.2,1.4400000000000002,1.6099999999999999,null,null,null,null,null,null,null,null,null,null,null,null,null,null,null,null,24,0.75,125,608.59979999999996]
["ENSILADO Maíz Pastoso",30,0.99626128521090906,0.95403421579894565,77,13.475,54.028817866378347,-42.654494748000005,1.0132958896376021,1.1164911620910118,1.2785238674835691,1.4,0.71699999999999997,680.21789999999999,34.4,216.5,450.90000000000003,287.5,29.3,51.3,1.2000000000000002,1.54,null,null,null,null,null,null,null,null,null,null,null,null,null,null,null,null,24,0.75,80,619.39491999999996]
["ENSILADO Maíz Pastoso-vidrioso",32,0.98314239284985649,0.9382032061594856,75.900000000000006,13.282500000000001,52.116471121566136,-42.990022427770683,1.0041912879324348,1.0985757184935629,1.2844202105596523,1.4,0.71019108280254772,673.68726114649678,32.1,203.70000000000002,432.70000000000005,244.4,22.9,51.4,1.2000000000000002,1.6099999999999999,null,null,null,null,null,null,null,null,null,null,null,null,null,null,null,null,24,0.75,100,612.58723821656042]
["ENSILADO Maíz vidrioso",32,0.96401164680448415,0.91546345893534753,76,13.299999999999999,51.899042023992166,-42.136330275541724,1.0206141424357025,1.114790276307644,1.3042568239789341,1.4,0.70080464625132,663.52183907074982,32,202,432.40000000000003,244.4,26.5,53.2,1.2400000000000002,1.6099999999999999,null,null,null,null,null,null,null,null,null,null,null,null,null,null,null,null,24,0.75,80,601.75702747624086]
["ENSILADO Avena Lechoso-pastoso",31,0.66424114835938342,0.56952073627037447,96.6,18.933599999999998,47.975074691200007,-17.511236205000014,1.1549554187208375,1.2826605891057561,1.7912244332565892,1.5044350611183899,0.56000000000000005,508.70400000000012,45,333.40000000000003,600.1,385.3,49.3,91.6,2.16,1.8479999999999999,null,null,null,null,null,null,5,0.13,null,null,30,null,null,5000,200,5,19,0.72,80,433.84195000000011]
["ENSILADO Cebada Lechoso-pastoso",30.5,0.72142021600330664,0.63401319082140295,98.800000000000011,19.364800000000002,51.132219780851621,-18.30719856887097,1.1474959575885495,1.2652874217455174,1.7453927636691655,1.5439395050877607,0.5903225806451613,540.14516129032256,40.700000000000003,278.39999999999998,533.29999999999995,328.5,42.9,85,2.12,1.7820000000000003,null,null,null,null,null,null,null,null,null,null,null,null,null,5000,200,5,19,0.72,80,466.94295645161293]
["ENSILADO Sorgo Pastoso",24,0.89466117374478127,0.84489885255540476,102.30000000000001,26.495700000000003,67.487942194560006,-32.548440628999984,1.1262973537643675,1.2160280172855182,1.6084066051897921,1.6754350740838606,0.70099999999999996,644.7097,25,293.39999999999998,586.4,346.8,42.400000000000006,80.3,2.2399999999999998,1.5840000000000001,null,null,null,null,null,null,null,null,null,null,null,null,null,5000,200,5,19,0.63,80,572.0089099999999]
["ENSILADO Triticale lechoso",28.1,0.71854288407494793,0.63150931772761865,99.800000000000011,19.560800000000004,51.202394224206458,-17.39059613661291,1.1462933363591252,1.2627982133356292,1.7422302525507003,1.5467420771610727,0.5903225806451613,537.6067741935484,46.6,329.3,589.70000000000005,373.5,46.2,89.3,1.9600000000000002,1.9139999999999999,null,null,null,null,null,null,null,null,null,null,null,null,null,5000,200,5,19,0.72,80,464.20856935483874]
["ENSILADO prehenificado Alfalfa Inicio botones florales",45,0.98073229696217212,0.93754372825724863,213.6,22.321199999999997,62.683776417288968,81.82328754478597,0.97973765917405842,0.95479769802657022,1.0999907166650131,2.4498214383965466,0.70985600000000004,621.97582720000003,20.8,247.2,407.2,320.09999999999997,64.3,123.80000000000001,3.84,1.8199999999999998,null,null,null,null,null,null,null,null,null,null,null,null,null,3000,200,5,26.498799999999999,0.83,80,550.69141106000006]
["ENSILADO prehenificado Alfalfa antes floración",43,0.94785679034806092,0.90465843911301136,198.2,21.801999999999992,61.325852381925756,64.24775046004099,0.99374219105851747,0.9777668498437726,1.1210232216881295,2.4038581784818929,0.7073060000000001,605.02955239999994,18.700000000000003,249.7,424.6,336.1,65.900000000000006,144.60000000000002,3.84,1.8199999999999998,null,null,null,null,null,null,null,null,null,null,null,null,null,3000,200,5,25.220600000000001,0.8,80,534.66271960999995]
["ENSILADO prehenificado Alfalfa rebrotes floración",47,1.0032072973934074,0.9674763745363909,219.7,27.792049999999996,68.858592379226565,78.009818425258473,0.9725684349724405,0.94271832300516278,1.084479733485664,2.484860487951897,0.72617600000000015,627.77915200000018,17.8,231.20000000000002,391.4,298.89999999999998,61.900000000000006,135.5,5.22,2.4499999999999997,null,null,null,null,null,null,null,null,null,null,null,null,null,3000,200,5,27.005099999999999,0.79,80,551.92185778500016]
["ENSILADO Zulla Botones Florales Floracion, Bolas",27.16,0.75460390300459157,0.67286444594327566,140.9,16.273949999999999,57.035050896491214,33.421779849232493,1.0754416064743921,1.1260486535516214,1.2670212051033991,2.1268632512770091,0.60143000000000013,526.25125000000014,27,353.5,537.20000000000005,351.67649999999998,null,125,3.5999999999999996,2.0999999999999996,null,null,null,null,null,null,null,null,null,null,null,null,null,null,null,null,20.464700000000001,0.79,150,306.24784632500013,18.990099999999998,2.96,4.2345999999999995,20.182000000000002,48.061300000000003]
["ENSILADO Zulla Inicio Floración en Fructificación",19.66,0.76699251537638691,0.68587181205808523,135.6,15.661799999999999,56.909349422917131,28.474704026691985,1.0804926889835968,1.1353212919101585,1.2731603311922557,2.1166076052649183,0.60561200000000004,535.72437520000017,27,349.4,589.29999999999995,349.30259999999998,null,115.39999999999999,3.5999999999999996,2.0999999999999996,null,null,null,null,null,null,null,null,null,null,null,null,null,null,null,null,20.024799999999999,0.79,150,316.81913732000021,19.048400000000001,2.96,4.2664,20.288000000000004,47.7592]
["HENO Bromo Final vegetación",85,0.76419285183337515,0.69355439469847935,100,20.3,58.493150019206396,-20.427847183009998,1.0835094894031958,1.1490542116640832,1.4703700439119152,1.832722892363662,0.62748999999999999,564.74099999999999,34,320,640,333,null,100,1.2400000000000002,2.0299999999999998,null,null,null,null,null,null,null,null,null,null,null,null,null,50000,50,5,15.93,0.71,null,494.54585790000004]
["HENO Dáctilo Floración",85,0.6267609342137026,0.53155509065566853,88,17.247999999999998,48.36165599462273,-22.605088265998003,1.134465219318965,1.2492965014143194,1.6338101491345389,1.6493843187047212,0.53715200000000007,491.49408000000005,27,372,684.07999999999993,404,null,85,0.91999999999999993,1.26,null,null,null,null,null,null,null,null,null,null,null,null,null,50000,50,5,14.933999999999999,0.72,null,418.56868242000002]
["HENO Festuca Floración",88.2,0.73943220877777716,0.65928850942806472,116,23.547999999999998,59.757651814873611,-7.6431164502399973,1.0793541165782508,1.140751809057504,1.4579976536735357,1.8482751552675172,0.60047250000000008,550.63328250000006,27,331,637.33999999999992,354.45,null,83,0.91999999999999993,1.26,null,null,null,null,null,null,null,null,null,null,null,null,null,50000,50,5,17.257999999999999,0.71,null,474.73040960000003]
["HENO raigrás italiano Espigado",85,0.75513884519311159,0.68241655802433343,79,13.824999999999999,52.185630943845752,-32.772604824959004,1.1062655311186032,1.1934031028108834,1.5408190326700311,1.7489275395653956,0.622116,566.12555999999995,26,307,609.98,337,null,90,1.6,1.6099999999999999,2,null,20,2,null,null,4.9000000000000004,null,null,null,110,null,26.5,50000,50,5,14.186999999999999,0.75,null,502.81786960999989]
["HENO raigrás italiano Floración",85,0.6767027482560638,0.59071631898229005,52,10.92,45.712396424961298,-52.983002819602021,1.1556101088638542,1.2944117226547334,1.7072960015291541,1.5783911151373442,0.57474800000000004,528.76816000000008,24,344,652.16,374,null,80,1.6,1.26,null,null,null,null,null,null,null,null,null,null,null,null,null,50000,50,5,11.946,0.7,null,466.10574158000014]
["HENO raigrás italiano rebrotes de espigado con hojas",85,0.88455752307932112,0.83555018199236453,107,23.219000000000005,65.956156128094094,-22.330970182515014,1.0503135369712728,1.0876843119708051,1.3736638097389902,1.9617469868665793,0.69441000000000019,629.13546000000019,29,256,567,291,null,94,1.6,1.89,2,null,20,2,null,null,null,null,null,null,null,null,null,50000,50,5,16.510999999999999,0.69,null,560.37510685000018]
["HENO Avena Floración",90,0.67480317863899208,0.58227461861367924,140,33.319999999999993,65.228139936057602,6.3406156979099997,1.0749145907417021,1.1317419865579073,1.4449610854640151,1.8649504591037236,0.55566000000000004,509.54022000000003,33,320,620,390,60,83,2.52,0.66,null,null,null,null,null,null,null,null,null,null,null,null,null,50000,50,5,19.25,0.66,null,419.88017109999998]
["HENO Avena Inicio espigado",90,0.78652389805863199,0.70575228911118604,175,41.649999999999991,77.978984355311994,25.711887654824995,1.0237566758532983,1.0390632549443961,1.3016259564347528,2.0703189164299771,0.60694999999999999,567.49824999999998,26,290,580,350,40,65,2.52,0.66,null,null,null,null,null,null,null,null,null,null,null,null,null,50000,50,5,22.155000000000001,0.66,null,471.74008824999999]
["HENO Cebada Espigado",78.5,0.59193017134449111,0.49259343790919707,112,26.655999999999999,55.098112213262077,-9.2667890748219968,1.1196754302777518,1.2187032952808325,1.5845540343235869,1.7006556932427213,0.51462799999999997,464.70908399999996,12.5,285,584.9,422,null,97,1.1800000000000002,1.6500000000000001,1.6,null,14.15,1.75,1.7,7.0000000000000007E-2,24,null,null,101,27,0.16,48,null,null,null,16.925999999999998,0.66,null,379.92752537999996]
["HENO Cebada Inicio espigado",83.7,0.78734030434506597,0.72632602372427391,108,25.703999999999997,65.002965002686736,-20.294505461098009,1.0656566417672084,1.1155627702170452,1.4175098191472175,1.9010667886197266,0.65300200000000008,570.72374800000011,12.5,285,584.9,313,null,126,1.1800000000000002,1.6500000000000001,1.6,null,14.15,1.75,1.7,7.0000000000000007E-2,24,null,null,101,27,0.16,48,50000,50,5,16.594000000000001,0.66,null,496.58561142000019]
["HENO Cebada Lechoso",90,0.70632061718517436,0.62140149005677348,135,32.129999999999995,65.961349921366406,1.6054977698649999,1.0693830299255613,1.1216408789031524,1.4286049531676628,1.8863023215395973,0.58099000000000001,526.37693999999999,12.5,285,610,370,null,94,1.4400000000000002,1.5840000000000001,1.6,null,14.15,1.75,1.7,7.0000000000000007E-2,24,null,null,101,27,0.16,48,50000,50,5,18.834999999999997,0.66,null,439.84008664999999]
["HENO Cebada vidrioso",76.3,0.74034682336508006,0.66220836375956105,99,23.561999999999998,60.204756763352961,-25.004326111939005,1.0934509872849412,1.1679797385858239,1.5007721412635913,1.7955962571734776,0.60588600000000004,554.38569000000007,12.5,285,584.9,350,null,85,1.4400000000000002,1.5840000000000001,1.8,null,11.8,1.4,1.7,7.0000000000000007E-2,24,null,null,101,27,0.16,48,50000,50,5,15.847,0.66,null,479.47602381000007]
["PAJA trigo",88,0.54489449959297132,0.44220463365346863,35,7.8399999999999981,35.751928353225608,-59.963289563915012,1.2158557736596241,1.4281298035897589,1.9403574479922112,1.3888063987960364,0.49196000000000006,452.60320000000007,15,420,738.8,439,null,80,0.8,0.66,1.4,null,16.5,2.1,null,null,null,null,null,null,null,null,null,null,null,null,10.535,0.68,null,387.94561285000009]
["PAJA Trigo tratada amoniaco",88,0.56531695204398313,0.46053859806899722,100,22.399999999999995,49.607914377043201,-16.606867928130011,1.1419257322988237,1.2641142850862204,1.6595863549606495,1.6237665678969901,0.49287000000000009,453.44040000000007,15,420,738.8,439,null,80,0.8,0.7,null,null,null,null,null,null,null,null,null,null,null,null,null,null,null,null,15.93,0.66,null,371.86186270000007]
["PAJA Maíz rastrojo",85,0.65295030331947668,0.56115553193506373,59,14.041999999999998,47.160476103231375,-49.080817388499,1.1574722224070044,1.2980624106603422,1.7140693223387169,1.572153940685612,0.55452600000000007,514.60012800000004,13,344,670,390,110,72,2.2800000000000002,0.66,1.4,null,16.5,2.1,null,null,null,null,null,null,null,null,null,50000,50,5,12.527000000000001,0.66,null,447.16018621000006]
["PAJA Avena",88,0.53812725183444132,0.4366356893312896,32,7.3919999999999986,35.099752735092487,-62.006868228182014,1.2194997260559368,1.436733452984293,1.9556277145677179,1.3779620832990693,0.49191800000000008,447.64538000000005,15,420,738.8,439,null,90,1.4000000000000001,0.66,null,null,null,null,null,null,null,null,null,null,null,null,null,50000,50,5,10.286,0.67,null,383.54475978000005]
["PAJA Cebada",88,0.54583884995246301,0.44305246126076597,38,8.5119999999999987,36.391435400478727,-57.869916257648001,1.2122335331673182,1.4196285839782588,1.9253238055783992,1.3996507142930033,0.49200200000000005,452.64184000000006,12.5,420,738.8,439,null,80,1.4000000000000001,0.66,1.4,null,16.5,2.1,null,null,3.1,null,null,null,17.600000000000001,null,7.3,50000,50,5,10.783999999999999,0.68,null,387.20328592000004]
["PAJA Cebada tratada amoniaco",88,0.56531695204398313,0.46053859806899722,100,22.399999999999995,49.607914377043201,-16.606867928130011,1.1419257322988237,1.2641142850862204,1.6595863549606495,1.6237665678969901,0.49287000000000009,453.44040000000007,12.5,420,738.8,439,null,80,1.4000000000000001,0.66,null,null,null,null,null,null,null,null,null,null,null,null,null,null,null,null,15.93,0.66,null,371.86186270000007]
["HENO Alfalfa Botones florales",85,0.57123558052070356,0.46444274804760227,171,35.910000000000004,61.686763221321605,42.444994754684984,1.0731847945413775,1.1276103050952651,1.4400957053043448,1.8712512160111086,0.48796,443.06768,26,372,684.07999999999993,436,null,92,4.2,1.75,null,null,null,null,null,null,7.1,null,null,null,29,null,24.6,45000,400,10,21.823,0.72,null,344.99311884999997]
["HENO Alfalfa Inicio vegetación",85,0.76317000378293631,0.68735630001277959,168.5,35.385000000000005,71.398796663299521,32.372187837194488,1.0272530664094703,1.0452860176409202,1.3108982501333131,2.0556750605541518,0.61256199999999994,548.91680819999999,21.200000000000003,283.39999999999998,483.1,326.70000000000005,69.3,103.9,3.75,1.68,null,null,null,null,null,0.1,4.5999999999999996,0.6,null,null,42.9,0.03,21.3,45000,400,10,21.615500000000001,0.72,null,460.05302034499999]
["HENO Alfalfa Floración",85,0.53042608012322923,0.41881028536100962,160,33.6,57.356247581535996,35.986337833849987,1.0949864792633808,1.1689784137676618,1.5060870012241476,1.7892597423208703,0.46059999999999995,421.90959999999995,24,395,710.3,460,null,84,4.2,1.54,null,null,null,null,null,null,null,null,null,null,null,null,null,45000,400,10,20.91,0.72,null,324.66845849999993]
["HENO Alfalfa floración (Cataluña)",89,0.7804774847881284,0.70842363842025324,174.5,36.645000000000003,73.402532623920322,36.236647318724494,1.0179631656165384,1.0291021887835796,1.2863355843314199,2.0949283161778949,0.62396199999999991,555.95014199999991,19.8,271.5,446.59999999999997,316.70000000000005,69.099999999999994,109,5.669999999999999,2.0999999999999996,null,null,null,null,null,0.1,4.5999999999999996,0.6,null,null,42.9,0.03,21.3,45000,400,10,22.113499999999998,0.72,null,466.38877164499996]
["HENO Alfalfa rebrotes (Cataluña)",89,0.82205470435761685,0.75613867516714384,179.3,37.653000000000006,76.258578893598411,38.09099041675249,1.006503008750228,1.0094903891680025,1.2566714172197362,2.144379829760966,0.64471000000000001,577.98251500000003,19.8,259.60000000000002,442.1,298.5,65.8,103.5,3.3,1.54,null,null,null,null,null,0.1,4.5999999999999996,0.6,null,null,42.9,0.03,21.3,45000,400,10,22.511900000000001,0.72,null,488.66494552500001]
["HENO Alfalfa rebrotes de floración",85,0.55599142142101565,0.44631833609527294,174,36.540000000000006,61.352732546995213,45.334091071320003,1.0754412677633514,1.1317071487843955,1.4468110586675325,1.8625658295734471,0.47542000000000001,434.53388000000001,24,382,695.48,447,null,86,3.6599999999999997,1.54,null,null,null,null,null,0.1,4.5999999999999996,0.6,null,null,42.9,0.03,21.3,45000,400,10,22.071999999999999,0.72,null,334.85269719999997]
["HENO Alfalfa Sin especificar (primavera) IAMZ",90,0.8022678479128047,0.73596215149667599,171,35.910000000000004,73.93543875043521,32.774167968444971,1.0148357975382867,1.0238365530945255,1.2781381256264579,2.1083643353509456,0.64072000000000007,567.0372000000001,25,300,394,302,null,115,4.38,3.15,null,null,null,null,null,null,null,null,null,null,null,null,null,45000,400,10,21.823,0.72,null,479.49696845000017]
["HENO Alfalfa Sin especificar (verano) IAMZ",90,0.80275298588032373,0.73261232695119138,187,39.270000000000003,76.69014371951809,44.688834856652974,1.0047311728786472,1.0063219773648062,1.2521919703921178,2.1520508863183911,0.63182800000000006,566.11788799999999,25,284,583.76,309.8,null,104,5.8199999999999994,2.0299999999999998,null,null,null,null,null,null,null,null,null,null,null,null,null,45000,400,10,23.151,0.72,null,474.00786013000004]
["HENO Zulla Final floración",87.6,0.79742769224428822,0.72717662515667236,143,30.030000000000005,68.40600963093442,11.571818123664986,1.0419028468164517,1.0716763542824852,1.3505150540292457,1.9953726777671104,0.63273999999999997,575.16066000000001,13.5,287,414,309,null,91,0.36,0.21,null,null,null,null,null,null,null,null,null,null,null,null,null,45000,400,10,19.498999999999999,0.72,null,493.99418465000002]
["HENO Trébol blanco Vegetativo",90,0.79818726684692809,0.7236613653982934,220,56.099999999999994,91.797130433951992,57.220365256950018,0.98223680859474038,0.96830897985285391,1.1963126772137844,2.2525723341821324,0.62019999999999997,557.5598,27,212,360,320,70,101,4.05,2.17,4.3,3.2,16.2,1.9,1.7,0.16,11,null,null,184,73,null,17,45000,400,10,25.89,0.66,null,446.58740949999998]
["HENO Trébol violeta Final floración",89,0.71129301654850108,0.62330572153739683,160,40.799999999999997,73.887318682976002,18.872008437850003,1.0490595705479822,1.0839781862511857,1.3705459085367102,1.9662098313804495,0.5746,525.75900000000001,28,288,460,360,80,85,4.59,1.75,null,null,null,null,null,null,null,null,null,null,null,null,null,45000,400,10,20.91,0.66,null,429.17929850000002]
["HENO Veza Inicio botones",91.4,0.97212142615502195,0.93222753604964459,196,49.980000000000004,94.638496257844494,33.46866560751802,0.96804899794938748,0.94589141470041038,1.1621093304524754,2.3188703240803497,0.718468,653.80588,25,204,492.55999999999995,233.79999999999998,null,90,5.28,1.54,null,null,null,null,null,null,null,null,null,null,null,null,null,45000,400,10,23.898,0.66,null,556.62495677999993]
["HENO Veza Botones",92,0.7602900997960611,0.68406922475749654,217,55.334999999999994,89.496195466959989,56.933716722874991,0.98849058053204519,0.97861550011578569,1.2116285321394968,2.2240982019172817,0.60880000000000001,533.91759999999999,25,244,470,330,null,123,5.28,1.54,null,null,null,null,null,null,null,null,null,null,null,null,null,45000,400,10,25.641000000000002,0.66,null,423.03592875000004]
["HENO Veza Inicio floración",90,0.75185723717774389,0.67347333051166314,225,57.375,90.8595417645856,62.847059980834999,0.98448565926461906,0.97187134256680685,1.2018330935222286,2.2422255255307535,0.60195999999999994,527.91891999999996,25,244,538.16,336,null,123,5.28,1.54,null,null,null,null,null,null,null,null,null,null,null,null,null,45000,400,10,26.305,0.66,null,414.22726034999994]
["HENO Veza Final floración",85,0.91395057593913331,0.86255647770957011,197,50.234999999999992,92.184528135347847,36.482013491719002,0.97734056562373328,0.96084554796604882,1.1843136089723143,2.2753946415101325,0.68814400000000009,623.45846400000005,25,232,524.48,260.39999999999998,null,94,4.4099999999999993,2.17,null,null,null,null,null,null,null,null,null,null,null,null,null,45000,400,10,23.980999999999998,0.66,null,523.89410999000006]
["HENO Veza Fructificación",91,0.83209635677761806,0.76577420261610507,186,47.429999999999993,85.844816081036811,32.088384657380004,1.0008060205745131,0.99975635411462671,1.2422134746837556,2.1693379557077908,0.64527999999999996,583.33312000000001,20,236,453,298,null,96,4.5299999999999994,1.19,null,null,null,null,null,null,null,null,null,null,null,null,null,45000,400,10,23.068000000000001,0.66,null,484.02802980000001]
["HENO Veza Pastoso",90.2,0.94923426925277721,0.90897107697315827,188,47.94,91.999449584953595,28.969235711509999,0.97502789206574958,0.95729300272020357,1.1786990783138984,2.2862330931639918,0.71596000000000004,640.78420000000006,20,278,576.91999999999996,236,null,105,4.8,2.0999999999999996,null,null,null,null,null,null,null,null,null,null,null,null,null,45000,400,10,23.234000000000002,0.66,null,545.7686271]
["HENO Veza (> 50%) - Avena corte precoz INRA",84,0.73,0.65,158,42,93,-18.581551750000013,1.0204081632653061,1.0245017686135793,0.86,3.13,0.68,881,null,333,674,378,null,119,null,null,null,null,null,null,null,null,null,null,null,null,null,null,null,null,null,null,null,0.6,null,799.88250000000005]
["HENO Veza (20-50%) - Avena corte precoz INRA",79,0.72,0.65,104,24,75,-50.306151750000026,1.0650923587231063,1.1087768440709616,1.21,2.23,0.68,897,null,280,595,323,null,103,null,null,null,null,null,null,null,null,null,null,null,null,null,null,null,null,null,null,null,0.63,null,833.88250000000005]
["HENO Veza (<20%) - Avena corte precoz INRA",75,0.66,129,29,81,-31.064516230000006,1.0318700433385417,1.0534720220009313,1.21,2.23,0.7,870,null,270,575,308,null,130,null,null,null,null,null,null,null,null,null,null,null,null,null,null,null,null,null,null,null,0.64,null,803.26170000000002]
["HENO Veza (> 50%) - Avena corte tardío INRA",65,0.55000000000000004,123,31,81,-43.476576070000021,1.0788068396353634,1.1283330364035868,0.89,3.02,0.61,929,null,268,584,309,null,71,null,null,null,null,null,null,null,null,null,null,null,null,null,null,null,null,null,null,null,0.6,null,854.05529999999999]
["HENO Veza (20-50%) - Avena corte tardío INRA",64,0.55000000000000004,99,23,72,-53.567740550000011,1.0901813594561551,1.1553663727576771,1.39,1.94,0.63,901,null,333,675,385,null,99,null,null,null,null,null,null,null,null,null,null,null,null,null,null,null,null,null,null,null,0.63,null,835.43449999999996]
["HENO Veza (<20%) - Avena corte tardío INRA",86,0.61,0.52,74,17,66,-72.158893830000011,1.1245341215782034,1.228533002276019,1.25,2.16,0.6,916,null,324,664,377,null,84,null,null,null,null,null,null,null,null,null,null,null,null,null,null,null,null,null,null,null,0.61,null,854.36570000000006]
[]
[]
[]
[]
[]
[]
[]
[]
[]
[]
[]
[]
[]
[]
[]
[]
[]
[]
[]
[]
[]
[]
[]
[]
[]
[]
[]
[]
[]
[]
[]
[]
[]
[]
[]
[]
[]
[]
[]
[]
[]
[]
[]
[]
[]
[]
[]
[]
[]
[]
[]
[]
[]
[]
[]
[]
[]
[]
[]
[]
[]
[]
[]
[]
[]
[]
[]
[]
[]
[]
[]
[]
[]
[]
[]
[]
[]
[]
[]
[]
[]
[]
[]
[]
[]
[]
[]
[]
[]
[]
[]
[]
[]
[]
[]
[]
[]
[]
[]
[]
[]
[]
[]
[]
[]
[]
[]
[]
[]
[]
[]
[]
[]
[]
[null,null,null,null,null,null,null,null,null,null,null,null,null,null,null,null,null,null,null,null,null,null,null,null,null,null,"","","","","","","","","","","","",""]
["","","","","","","","",null,null,null,null,null,"",null,"","","","","","","","","","",""]
[null,null,null,null,null,null,null,null,null,null,null,null,null,null,null,null,null,null,null,null,null,null,null,null,null,null,"","","","","","","","","","","","",""]
["","","","","","","","",null,null,null,null,null,"",null,"","","","","","","","","","",""]
[null,null,null,null,null,null,null,null,null,null,null,null,null,null,null,null,null,null,null,null,null,null,null,null,null,null,"","","","","","","","","","","","",""]
["","","","","","","","",null,null,null,null,null,"",null,"","","","","","","","","","",""]
[]
[]
[]
[]
[null,null,null,null,null,null,null,null,null,null,null,null,null,null,null,null,null,null,null,null,null,null,null,null,null,null,"","","","","","","","","","","","",""]
["","","","","","","","",null,null,null,null,null,"",null,"","","","","","","","","","",""]
[null,null,null,null,null,null,null,null,null,null,null,null,null,null,null,null,null,null,null,null,null,null,null,null,null,null,"","","","","","","","","","","","",""]
["","","","","","","","",null,null,null,null,null,"",null,"","","","","","","","","","","","","","","","","","","","","","","",""]
["","","","","","","","",null,null,null,null,null,"",null,"","","","","","","","","","",""]
[]
[]
[null,null,null,null,null,null,null,null,null,null,null,null,null,null,null,null,null,null,null,null,null,null,null,null,null,null,"","","","","","","","","","","","",""]
["","","","","","","","",null,null,null,null,null,"",null,"","","","","","","","","","",""]
[null,null,null,null,null,null,null,null,null,null,null,null,null,null,null,null,null,null,null,null,null,null,null,null,null,null,"","","","","","","","","","","","",""]
["","","","","","","","",null,null,null,null,null,"",null,"","","","","","","","","","",""]
[null,null,null,null,null,null,null,null,null,null,null,null,null,null,null,null,null,null,null,null,null,null,null,null,null,null,"","","","","","","","","","","","",""]
["","","","","","","","",null,null,null,null,null,"",null,"","","","","","","","","","",""]
[null,null,null,null,null,null,null,null,null,null,null,null,null,null,null,null,null,null,null,null,null,null,null,null,null,null,"","","","","","","","","","","","",""]
["","","","","","","","",null,null,null,null,null,"",null,"","","","","","","","","","",""]
[null,null,null,null,null,null,null,null,null,null,null,null,null,null,null,null,null,null,null,null,null,null,null,null,null,null,"","","","","","","","","","","","",""]
["","","","","","","","",null,null,null,null,null,"",null,"","","","","","","","","","",""]
[]
[]
[]
[null,null,null,null,null,null,null,null,null,null,null,null,null,null,null,null,null,null,null,null,null,null,null,null,null,null,"","","","","","","","","","","","",""]
["","","","","","","","",null,null,null,null,"","","","","","","","","","","","","","","","","","","","","","","","","","",""]
["","","","","","","","",null,null,null,null,null,"",null,"","","","","","","","","","",""]
[null,null,null,null,null,null,null,null,null,null,null,null,null,null,null,null,null,null,null,null,null,null,null,null,null,null,"","","","","","","","","","","","",""]
["","","","","","","","",null,null,null,null,null,"",null,"","","","","","","","","","",""]
[null,null,null,null,null,null,null,null,null,null,null,null,null,null,null,null,null,null,null,null,null,null,null,null,null,null,"","","","","","","","","","","","",""]
["","","","","","","","",null,null,null,null,null,"",null,"","","","","","","","","","","","","","","","","","","","","","","",""]
["","","","","","","","",null,null,null,null,null,"",null,"","","","","","","","","","",""]
[null,null,null,null,null,null,null,null,null,null,null,null,null,null,null,null,null,null,null,null,null,null,null,null,null,null,"","","","","","","","","","","","",""]
["","","","","","","","",null,null,null,null,null,"",null,"","","","","","","","","","",""]
[null,null,null,null,null,null,null,null,null,null,null,null,null,null,null,null,null,null,null,null,null,null,null,null,null,null,"","","","","","","","","","","","",""]
["","","","","","","","",null,null,null,null,null,"",null,"","","","","","","","","","",""]
[null,null,null,null,null,null,null,null,null,null,null,null,null,null,null,null,null,null,null,null,null,null,null,null,null,null,"","","","","","","","","","","","",""]
["","","","","","","","",null,null,null,null,null,"",null,"","","","","","","","","","",""]
[null,null,null,null,null,null,null,null,null,null,null,null,null,null,null,null,null,null,null,null,null,null,null,null,null,null,"","","","","","","","","","","","",""]
["","","","","","","","",null,null,null,null,null,"",null,"","","","","","","","","","",""]
[null,null,null,null,null,null,null,null,null,null,null,null,null,null,null,null,null,null,null,null,null,null,null,null,null,null,"","","","","","","","","","","","",""]
["","","","","","","","",null,null,null,null,null,"",null,"","","","","","","","","","",""]
[null,null,null,null,null,null,null,null,null,null,null,null,null,null,null,null,null,null,null,null,null,null,null,null,null,null,"","","","","","","","","","","","",""]
["","","","","","","","",null,null,null,null,null,"",null,"","","","","","","","","","",""]
[null,null,null,null,null,null,null,null,null,null,null,null,null,null,null,null,null,null,null,null,null,null,null,null,null,null,"","","","","","","","","","","","",""]
["","","","","","","","",null,null,null,null,null,"",null,"","","","","","","","","","",""]
[null,null,null,null,null,null,null,null,null,null,null,null,null,null,null,null,null,null,null,null,null,null,null,null,null,null,"","","","","","","","","","","","",""]
["","","","","","","","",null,null,null,null,null,"",null,"","","","","","","","","","",""]
[null,null,null,null,null,null,null,null,null,null,null,null,null,null,null,null,null,null,null,null,null,null,null,null,null,null,"","","","","","","","","","","","",""]
["","","","","","","","",null,null,null,null,null,"",null,"","","","","","","","","","",""]
[null,null,null,null,null,null,null,null,null,null,null,null,null,null,null,null,null,null,null,null,null,null,null,null,null,null,"","","","","","","","","","","","",""]
["","","","","","","","",null,null,null,null,null,"",null,"","","","","","","","","","",""]
[null,null,null,null,null,null,null,null,null,null,null,null,null,null,null,null,null,null,null,null,null,null,null,null,null,null,"","","","","","","","","","","","",""]
["","","","","","","","",null,null,null,null,null,"",null,"","","","","","","","","","",""]
[null,null,null,null,null,null,null,null,null,null,null,null,null,null,null,null,null,null,null,null,null,null,null,null,null,null,"","","","","","","","","","","","",""]
["","","","","","","","",null,null,null,null,null,"",null,"","","","","","","","","","",""]
[null,null,null,null,null,null,null,null,null,null,null,null,null,null,null,null,null,null,null,null,null,null,null,null,null,null,"","","","","","","","","","","","",""]
["","","","","","","","",null,null,null,null,null,"",null,"","","","","","","","","","",""]
[null,null,null,null,null,null,null,null,null,null,null,null,null,null,null,null,null,null,null,null,null,null,null,null,null,null,"","","","","","","","","","","","",""]
["","","","","","","","",null,null,null,null,null,"",null,"","","","","","","","","","",""]
[null,null,null,null,null,null,null,null,null,null,null,null,null,null,null,null,null,null,null,null,null,null,null,null,null,null,"","","","","","","","","","","","",""]
["","","","","","","","",null,null,null,null,null,"",null,"","","","","","","","","","",""]
[null,null,null,null,null,null,null,null,null,null,null,null,null,null,null,null,null,null,null,null,null,null,null,null,null,null,"","","","","","","","","","","","",""]
["","","","","","","","",null,null,null,null,null,"",null,"","","","","","","","","","",""]
[null,null,null,null,null,null,null,null,null,null,null,null,null,null,null,null,null,null,null,null,null,null,null,null,null,null,"","","","","","","","","","","","",""]
["","","","","","","","",null,null,null,null,null,"",null,"","","","","","","","","","",""]
[null,null,null,null,null,null,null,null,null,null,null,null,null,null,null,null,null,null,null,null,null,null,null,null,null,null,"","","","","","","","","","","","",""]
["","","","","","","","",null,null,null,null,null,"",null,"","","","","","","","","","",""]
[null,null,null,null,null,null,null,null,null,null,null,null,null,null,null,null,null,null,null,null,null,null,null,null,null,null,"","","","","","","","","","","","",""]
["","","","","","","","",null,null,null,null,null,"",null,"","","","","","","","","","",""]
[null,null,null,null,null,null,null,null,null,null,null,null,null,null,null,null,null,null,null,null,null,null,null,null,null,null,"","","","","","","","","","","","",""]
["","","","","","","","",null,null,null,null,null,"",null,"","","","","","","","","","",""]
[null,null,null,null,null,null,null,null,null,null,null,null,null,null,null,null,null,null,null,null,null,null,null,null,null,null,"","","","","","","","","","","","",""]
["","","","","","","","",null,null,null,null,null,"",null,"","","","","","","","","","",""]
[null,null,null,null,null,null,null,null,null,null,null,null,null,null,null,null,null,null,null,null,null,null,null,null,null,null,"","","","","","","","","","","","",""]
["","","","","","","","",null,null,null,null,null,"",null,"","","","","","","","","","",""]
[null,null,null,null,null,null,null,null,null,null,null,null,null,null,null,null,null,null,null,null,null,null,null,null,null,null,"","","","","","","","","","","","",""]
["","","","","","","","",null,null,null,null,null,"",null,"","","","","","","","","","",""]
[null,null,null,null,null,null,null,null,null,null,null,null,null,null,null,null,null,null,null,null,null,null,null,null,null,null,"","","","","","","","","","","","",""]
["","","","","","","","",null,null,null,null,null,"",null,"","","","","","","","","","",""]
[null,null,null,null,null,null,null,null,null,null,null,null,null,null,null,null,null,null,null,null,null,null,null,null,null,null,"","","","","","","","","","","","",""]
["","","","","","","","",null,null,null,null,null,"",null,"","","","","","","","","","",""]
[null,null,null,null,null,null,null,null,null,null,null,null,null,null,null,null,null,null,null,null,null,null,null,null,null,null,"","","","","","","","","","","","",""]
["","","","","","","","",null,null,null,null,null,"",null,"","","","","","","","","","",""]
[null,null,null,null,null,null,null,null,null,null,null,null,null,null,null,null,null,null,null,null,null,null,null,null,null,null,"","","","","","","","","","","","",""]
["","","","","","","","",null,null,null,null,null,"",null,"","","","","","","","","","",""]
[null,null,null,null,null,null,null,null,null,null,null,null,null,null,null,null,null,null,null,null,null,null,null,null,null,null,"","","","","","","","","","","","",""]
["","","","","","","","",null,null,null,null,null,"",null,"","","","","","","","","","",""]
[null,null,null,null,null,null,null,null,null,null,null,null,null,null,null,null,null,null,null,null,null,null,null,null,null,null,"","","","","","","","","","","","",""]
["","","","","","","","",null,null,null,null,null,"",null,"","","","","","","","","","","","","","","","","","","","","","","",""]
["","","","","","","","",null,null,null,null,null,"",null,"","","","","","","","","","",""]
[null,null,null,null,null,null,null,null,null,null,null,null,null,null,null,null,null,null,null,null,null,null,null,null,null,null,"","","","","","","","","","","","",""]
["","","","","","","","",null,null,null,null,null,"",null,"","","","","","","","","","",""]
[null,null,null,null,null,null,null,null,null,null,null,null,null,null,null,null,null,null,null,null,null,null,null,null,null,null,"","","","","","","","","","","","",""]
["","","","","","","","",null,null,null,null,null,"",null,"","","","","","","","","","",""]
[null,null,null,null,null,null,null,null,null,null,null,null,null,null,null,null,null,null,null,null,null,null,null,null,null,null,"","","","","","","","","","","","",""]
["","","","","","","","",null,null,null,null,null,"",null,"","","","","","","","","","",""]
[null,null,null,null,null,null,null,null,null,null,null,null,null,null,null,null,null,null,null,null,null,null,null,null,null,null,"","","","","","","","","","","","",""]
["","","","","","","","",null,null,null,null,null,"",null,"","","","","","","","","","",""]
[null,null,null,null,null,null,null,null,null,null,null,null,null,null,null,null,null,null,null,null,null,null,null,null,null,null,"","","","","","","","","","","","",""]
["","","","","","","","",null,null,null,null,null,"",null,"","","","","","","","","","",""]
[null,null,null,null,null,null,null,null,null,null,null,null,null,null,null,null,null,null,null,null,null,null,null,null,null,null,"","","","","","","","","","","","",""]
["","","","","","","","",null,null,null,null,null,"",null,"","","","","","","","","","",""]
[null,null,null,null,null,null,null,null,null,null,null,null,null,null,null,null,null,null,null,null,null,null,null,null,null,null,"","","","","","","","","","","","",""]
["","","","","","","","",null,null,null,null,null,"",null,"","","","","","","","","","",""]
[null,null,null,null,null,null,null,null,null,null,null,null,null,null,null,null,null,null,null,null,null,null,null,null,null,null,"","","","","","","","","","","","",""]
["","","","","","","","",null,null,null,null,null,"",null,"","","","","","","","","","",""]
[null,null,null,null,null,null,null,null,null,null,null,null,null,null,null,null,null,null,null,null,null,null,null,null,null,null,"","","","","","","","","","","","",""]
["","","","","","","","",null,null,null,null,null,"",null,"","","","","","","","","","",""]
[null,null,null,null,null,null,null,null,null,null,null,null,null,null,null,null,null,null,null,null,null,null,null,null,null,null,"","","","","","","","","","","","",""]
["","","","","","","","",null,null,null,null,null,"",null,"","","","","","","","","","","","","","","","","","","","","","","",""]
["","","","","","","","",null,null,null,null,null,"",null,"","","","","","","","","","",""]
[null,null,null,null,null,null,null,null,null,null,null,null,null,null,null,null,null,null,null,null,null,null,null,null,null,null,"","","","","","","","","","","","",""]
["","","","","","","","",null,null,null,null,null,"",null,"","","","","","","","","","",""]
[null,null,null,null,null,null,null,null,null,null,null,null,null,null,null,null,null,null,null,null,null,null,null,null,null,null,"","","","","","","","","","","","",""]
["","","","","","","","",null,null,null,null,null,"",null,"","","","","","","","","","",""]
[null,null,null,null,null,null,null,null,null,null,null,null,null,null,null,null,null,null,null,null,null,null,null,null,null,null,"","","","","","","","","","","","",""]
["","","","","","","","",null,null,null,null,null,"",null,"","","","","","","","","","",""]
[null,null,null,null,null,null,null,null,null,null,null,null,null,null,null,null,null,null,null,null,null,null,null,null,null,null,"","","","","","","","","","","","",""]
["","","","","","","","",null,null,null,null,null,"",null,"","","","","","","","","","",""]
[null,null,null,null,null,null,null,null,null,null,null,null,null,null,null,null,null,null,null,null,null,null,null,null,null,null,"","","","","","","","","","","","",""]
["","","","","","","","",null,null,null,null,null,"",null,"","","","","","","","","","",""]
[null,null,null,null,null,null,null,null,null,null,null,null,null,null,null,null,null,null,null,null,null,null,null,null,null,null,"","","","","","","","","","","","",""]
["","","","","","","","",null,null,null,null,null,"",null,"","","","","","","","","","",""]
[null,null,null,null,null,null,null,null,null,null,null,null,null,null,null,null,null,null,null,null,null,null,null,null,null,null,"","","","","","","","","","","","",""]
["","","","","","","","",null,null,null,null,null,"",null,"","","","","","","","","","",""]
[null,null,null,null,null,null,null,null,null,null,null,null,null,null,null,null,null,null,null,null,null,null,null,null,null,null,"","","","","","","","","","","","",""]
["","","","","","","","",null,null,null,null,null,"",null,"","","","","","","","","","",""]
[null,null,null,null,null,null,null,null,null,null,null,null,null,null,null,null,null,null,null,null,null,null,null,null,null,null,"","","","","","","","","","","","",""]
["","","","","","","","",null,null,null,null,null,"",null,"","","","","","","","","","",""]
[null,null,null,null,null,null,null,null,null,null,null,null,null,null,null,null,null,null,null,null,null,null,null,null,null,null,"","","","","","","","","","","","",""]
["","","","","","","","",null,null,null,null,null,"",null,"","","","","","","","","","",""]
[null,null,null,null,null,null,null,null,null,null,null,null,null,null,null,null,null,null,null,null,null,null,null,null,null,null,"","","","","","","","","","","","",""]
["","","","","","","","",null,null,null,null,null,"",null,"","","","","","","","","","",""]
[null,null,null,null,null,null,null,null,null,null,null,null,null,null,null,null,null,null,null,null,null,null,null,null,null,null,"","","","","","","","","","","","",""]
["","","","","","","","",null,null,null,null,null,"",null,"","","","","","","","","","",""]
[null,null,null,null,null,null,null,null,null,null,null,null,null,null,null,null,null,null,null,null,null,null,null,null,null,null,"","","","","","","","","","","","",""]
["","","","","","","","",null,null,null,null,null,"",null,"","","","","","","","","","",""]
[null,null,null,null,null,null,null,null,null,null,null,null,null,null,null,null,null,null,null,null,null,null,null,null,null,null,"","","","","","","","","","","","",""]
["","","","","","","","",null,null,null,null,null,"",null,"","","","","","","","","","",""]
[null,null,null,null,null,null,null,null,null,null,null,null,null,null,null,null,null,null,null,null,null,null,null,null,null,null,"","","","","","","","","","","","",""]
["","","","","","","","",null,null,null,null,null,"",null,"","","","","","","","","","",""]
[null,null,null,null,null,null,null,null,null,null,null,null,null,null,null,null,null,null,null,null,null,null,null,null,null,null,"","","","","","","","","","","","",""]
["","","","","","","","",null,null,null,null,null,"",null,"","","","","","","","","","","","","","","","","","","","","","","",""]
["","","","","","","","",null,null,null,null,null,"",null,"","","","","","","","","","",""]
[]
[null,null,null,null,null,null,null,null,null,null,null,null,null,null,null,null,null,null,null,null,null,null,null,null,null,null,"","","","","","","","","","","","",""]
["","","","","","","","",null,null,null,null,null,"",null,"","","","","","","","","","",""]
[null,null,null,null,null,null,null,null,null,null,null,null,null,null,null,null,null,null,null,null,null,null,null,null,null,null,"","","","","","","","","","","","",""]
["","","","","","","","",null,null,null,null,null,"",null,"","","","","","","","","","","","","","","","","","","","","","","",""]
["","","","","","","","",null,null,null,null,null,"",null,"","","","","","","","","","",""]
[null,null,null,null,null,null,null,null,null,null,null,null,null,null,null,null,null,null,null,null,null,null,null,null,null,null,"","","","","","","","","","","","",""]
["","","","","","","","",null,null,null,null,null,"",null,"","","","","","","","","","",""]
[null,null,null,null,null,null,null,null,null,null,null,null,null,null,null,null,null,null,null,null,null,null,null,null,null,null,"","","","","","","","","","","","",""]
["","","","","","","","",null,null,null,null,null,"",null,"","","","","","","","","","",""]
[null,null,null,null,null,null,null,null,null,null,null,null,null,null,null,null,null,null,null,null,null,null,null,null,null,null,"","","","","","","","","","","","",""]
["","","","","","","","",null,null,null,null,null,"",null,"","","","","","","","","","",""]
[null,null,null,null,null,null,null,null,null,null,null,null,null,null,null,null,null,null,null,null,null,null,null,null,null,null,"","","","","","","","","","","","",""]
["","","","","","","","",null,null,null,null,null,"",null,"","","","","","","","","","","","","","","","","","","","","","","",""]
["","","","","","","","",null,null,null,null,null,"",null,"","","","","","","","","","",""]
[]
[null,null,null,null,null,null,null,null,null,null,null,null,null,null,null,null,null,null,null,null,null,null,null,null,null,null,"","","","","","","","","","","","",""]
["","","","","","","","",null,null,null,null,null,"",null,"","","","","","","","","","",""]
[null,null,null,null,null,null,null,null,null,null,null,null,null,null,null,null,null,null,null,null,null,null,null,null,null,null,"","","","","","","","","","","","",""]
["","","","","","","","",null,null,null,null,null,"",null,"","","","","","","","","","",""]
[null,null,null,null,null,null,null,null,null,null,null,null,null,null,null,null,null,null,null,null,null,null,null,null,null,null,"","","","","","","","","","","","",""]
["","","","","","","","",null,null,null,null,null,"",null,"","","","","","","","","","",""]
[null,null,null,null,null,null,null,null,null,null,null,null,null,null,null,null,null,null,null,null,null,null,null,null,null,null,"","","","","","","","","","","","",""]
["","","","","","","","",null,null,null,null,null,"",null,"","","","","","","","","","",""]
[null,null,null,null,null,null,null,null,null,null,null,null,null,null,null,null,null,null,null,null,null,null,null,null,null,null,"","","","","","","","","","","","",""]
["","","","","","","","",null,null,null,null,null,"",null,"","","","","","","","","","",""]
[]
[]
[]
[]
[]
[]
[]
[]
[]
[]
[null,null,null,null,null,null,null,null,null,null,null,null,null,null,null,null,null,null,null,null,null,null,null,null,null,null,"","","","","","","","","","","","",""]
["","","","","","","","",null,null,null,null,null,"",null,"","","","","","","","","","",""]

{"sheet":"Tabla Concentrados","index":2,"n_rows":198,"n_cols":42,"rows_kept":198,"cut":false,"hidden":false,"merged":[]}
["Concentrados","MS","UFL","UFV","MNT_PB","PDIA","PDI","BPR","UEL","UEB","UEM","NI ref","dMO","MOD_TDN","EE","FB","NDF","ADF","Lignina","Cenizas","Ca","P","Mg","Cl","K","Na","S","Co","Cu","Mo","Yodo","Fe","Mn","Se","Zn","Vit A","Vit D","Vit E","AG","DT_N","dr","MOF"]
[]
["Cebada grano",88.8,1.0789699893040996,1.0677525561217629,112,27.595082457151996,89.462201893951999,-31.347374120000008,0.2046,null,null,2,0.83732799999999996,816.39479999999992,19,54,215,65,12,25,0.44000000000000006,2.964,1.3,null,5.55,0.35,null,0.01,4.0999999999999996,0.3,null,90,17.600000000000001,0.02,24.4,1000,null,25,14.25,0.73492599485689536,0.92949387723999977,596.08337706731925]
["Maíz grano",86,1.2447554097468898,1.26,89,43,94,-53,0.3291,null,null,2,0.88284600000000013,870.48615600000005,43,26,125,31,60,14,0.27500000000000002,2.1749999999999998,1.4,null,3.6,0.33,null,0.02,2.2999999999999998,0.3,null,80,10.8,0.02,21.4,null,null,null,36.549999999999997,0.44657089748905021,0.87300444668280008,780.90364228385977]
["Trigo grano",87,1.1915137972087206,1.2050625767281833,157,33.001449423599993,96.505827343600004,5.8944094999999983,0.1714,null,null,2,0.87875000000000003,861.17500000000007,23,29,146,38,12,20,0.27500000000000002,2.8079999999999998,null,null,null,null,null,0.02,4.4000000000000004,0.3,null,null,33.700000000000003,0.04,32.5,null,null,12,17.25,0.77712043387736873,0.94311164749999987,740.17749341536637]
["Avena",87.4,1.002754803542979,0.95481461893995845,111,20.397543993710997,75.333047872111024,-14.566724810000022,0.32080000000000003,null,null,2,0.72867000000000004,706.80990000000008,67,135,336,162,27,30,0.55000000000000004,3,1.75,null,4.3,0.5,null,0.02,3.5,0.7,null,null,38.4,0.04,25.2,null,null,15,60.300000000000004,0.79800315384488929,0.90972537986999991,747.51705647171229]
["Alforfón grano",88,1.0007757853016814,0.96615921016994921,125,34.099887237024994,90.969890410784984,-20.559379958999994,0.21290000000000009,null,null,2,0.74392999999999987,726.8196099999999,28,118,301,158.9,33.4,23,0.60500000000000009,2.7750000000000004,1.2,0.5,5.0999999999999996,0.6,1.6,0.06,11,null,null,50,38,null,10,null,null,null,21,0.69938671959743504,0.90747520379299995,668.26674668380406]
["Mijo grano",88,1.009546490666007,0.97767630563404173,131,35.907645941378647,91.778122786690659,-15.037620070799999,0.21290000000000009,null,null,2,0.75275400000000003,721.13833199999999,42,106,284.5,143.85999999999999,29.700000000000003,42,0.22000000000000003,2.4000000000000004,1.7,0.34,4.66,0.45,null,null,null,null,null,null,null,null,null,null,null,null,37.800000000000004,0.69974811478529253,0.91291405979160001,460.62199712073908]
["Centeno grano",86.5,1.19,1.21,97,20,81,-34.72904868000002,0.21290000000000009,null,null,2,0.88214000000000015,864.49720000000013,16.200000000000003,26,132,42,14,20,0.38500000000000001,3,1.35,null,5.25,0.3,null,0.03,4.5,0.2,null,null,55,0.03,30,null,null,17,12.150000000000002,0.77696513771484987,0.92445443235999991,415.48628942197058]
["Sorgo grano",86,1.21,1.23,105,47,97.130963149263465,-48,0.21290000000000009,null,null,2,0.88468600000000008,869.64633800000001,37,25,107,49,4,17,0.16500000000000001,2.4000000000000004,1.75,null,3.6,0.4,null,null,10,null,null,160,14,null,14,14000,null,12,33.300000000000004,0.52263422916095392,0.93768568037939981,581.76287563553399]
["Triticale grano",87.1,1.1917933324586927,1.2103621408310392,130,38.225488002259986,101.29653785185999,-26.948515390000008,0.21290000000000009,null,null,2,0.87145000000000006,852.27809999999999,17,33,148,40,13,22,0.27500000000000002,3.4499999999999997,null,null,null,null,null,null,null,null,null,null,null,null,null,null,null,null,12.75,0.68538622981633202,0.93461330452999991,618.06043466382971]
["Trigo salvado trigo duro",87.7,1.0176943686522057,0.977907847095282,167,34.631141078796077,88.47767852596408,25.244785238800009,0.30577720000000003,null,null,2,0.73153799999999991,692.03494799999987,58,118,481,148,38,54,0.93500000000000005,7.8000000000000007,null,null,null,null,null,null,10,null,null,200,90,null,80,1000,null,21,46.400000000000006,0.77274508423544552,0.91250876387239999,677.34170324293109]
["Maíz copos",89,1.2854594416716449,1.3156335468620108,100,41.498506498559998,103.94646933760002,-59.774941936000019,0.231567,null,null,2,0.88266,868.53744000000006,43,26,90,30,10,16,0.16500000000000001,2.1749999999999998,1.4,0.5,3.7,0.3,1.2,0.05,4,null,null,30,5,0.08,14,1000,null,25,36.549999999999997,0.55366202283859689,0.92975522187199999,841.62366180892877]
["Maíz bagazo",88.1,1.2034638734603806,1.2055011502513313,151,56.283786721918673,116.77481847795069,-22.647237118800017,0.28759999999999997,null,null,2,0.85009200000000007,833.94025199999999,34,68,272,78,11,19,0.5,3.7,1.8,null,3.5,9.5,null,null,null,null,null,null,null,null,null,null,null,null,25.5,0.60422014182361838,0.94178695988759986,567.57273372494842]
["Maíz hominyfeed (mezcla salvado, germen y almidón)",90,1.1533551355658935,1.1579668052179757,114,46.524159785375986,107.37452349097599,-49.998693289999991,0.25357849999999998,null,null,2,0.83747599999999989,816.53909999999985,19,54,215,65,12,25,0.27500000000000002,4.2750000000000004,2.6,0.6,6.5,0.9,0.3,0.06,15,null,null,75,16,0.11,3,null,null,null,16.149999999999999,0.56121014448870521,0.93007315382999989,380.32730660831726]
["Maíz gluten feed",87.7,1.0563074392437739,1.0298938534891089,216,53.864651595352321,111.00304612616833,49.881258545599977,0.3125,null,null,2,0.82507200000000003,769.79217599999993,45,88,343,100,13,67,1.6500000000000001,5.3040000000000003,3.5,null,10.25,7,null,null,null,null,null,null,null,null,null,3000,null,14,40.5,0.73830819761020405,0.9529277751088,400.00631345146428]
["Maíz gluten meal",89.3,1.6477477819813739,1.7039593019383183,661,427.85021155354741,474.69275818906743,117.51852088199998,0.48679999999999995,null,null,2,0.94365200000000005,929.49722000000008,35,21,107,28,6,15,0.11000000000000001,2.72,null,null,null,null,null,null,null,null,null,null,null,null,null,14000,null,26,28,0.34360783225527836,0.98611349298600004,749.4135604827793]
["Maíz carozo",90,0.52319139706798212,0.41152989548810526,44,14.398539143577599,59.977382422937616,-62.536942624000005,0.46929120000000002,null,null,2,0.45527600000000007,437.0649600000001,5,302,822,408,38,40,0.66,0.52499999999999991,null,null,null,null,null,null,null,null,null,null,null,null,null,null,null,null,2,0.62321203231751077,0.86849781324800002,521.78626923253478]
["Maíz salvado",88.3,1.1129736772157073,1.1007866196572278,101,43.238359333239842,96.344289691511847,-50.718016184800007,0.37059999999999998,null,null,2,0.70725199999999999,669.06039199999998,40,150,557,164,19,54,0.16500000000000001,1.875,null,null,null,null,null,null,null,null,null,null,null,null,null,null,null,null,34,0.53170775876766296,0.91417822026959994,556.40507382107603]
["Maíz torta de gérmenes a presión",88.1,1.1789597500931865,1.171602179305957,146,59.101547199313913,113.88478174088193,-23.878803971200011,0.2642698,null,null,2,0.80152400000000001,763.05084800000009,82,72,285,82,11,48,0.33,3.5250000000000004,4.5,null,1.8,8.5,null,null,null,null,null,null,null,null,null,null,null,null,65.600000000000009,0.56855881276595621,0.9382625715424,625.96116811755815]
["Maíz torta de gérmenes con disolvente",87.9,1.0419900226719216,1.0235383932445659,135,54.171907268543997,111.696577773504,-33.882297663999992,0.26867210000000002,null,null,2,0.79027999999999987,752.34655999999984,17,79,310,89,12,48,0.49500000000000005,3.75,4.5,null,1.8,8.5,null,null,null,null,null,null,null,null,null,1000,null,94,12.75,0.57033439439208355,0.93392019732799991,543.53611917872161]
["Maíz extrusionado",90.3,1.2659242795142109,1.3059451410330718,96.35,55.422778448670854,120.6512296608667,-82.396955019056023,0.21464959,null,null,2,0.91813040000000012,904.90932224000017,4.32,2.5499999999999998,12.18,3.1,0.55000000000000004,14.399999999999999,0.16500000000000001,2.1749999999999998,1.4,0.5,3.7,0.3,1.2,0.05,4,null,null,30,5,0.08,14,1000,null,25,3.6720000000000002,0.3880056000926686,0.93991618246111197,296.37371505240276]
["Alforfón segundas",89,1.1855213154544,1.1685861892728744,335,98.398382182629987,150.65027895702997,125.25641129000003,0.21290000000000009,null,null,2,0.79561999999999999,751.8608999999999,82,83,251.39,114.99000000000001,22.61,55,0.27500000000000002,2.9249999999999998,null,null,null,null,null,null,null,null,null,null,null,null,null,null,null,null,65.600000000000009,0.69466219022372699,0.96197229616999991,273.37371505240276]
["Cebada bagazo cervecería fresco",20.5,0.86409217991914111,0.77037029419231517,300,129.948715875,172.97965507500001,53.564157499999993,0.49509999999999998,null,null,2,0.63849999999999996,606.57500000000005,86,150,525,206,47,50,1.8149999999999999,4.4460000000000006,1.6,null,0.7,1.6,null,0.08,22.2,0.5,null,null,38.5,0.06,85,null,null,29,38.700000000000003,0.5325076886943908,0.9265657974999999,565.20525205850993]
["Cebada bagazo cervecería seco",91.9,0.87119356499561229,0.78054262949459352,262.39999999999998,107.61563282559231,151.63839868082431,35.094428351199994,0.49509999999999998,null,null,2,0.62731999999999999,601.34895199999994,79.900000000000006,161.6,643.29999999999995,236.4,78.899999999999991,41.4,1.2649999999999999,4.9139999999999997,null,null,null,null,null,0.08,22.2,0.5,null,null,38.5,0.06,85,null,null,29,35.955000000000005,0.53718506650710496,0.88614373099759991,529.6572153518573]
["Cebada malta, grano germinado y secado",89.6,0.82318564868563615,0.75819659606944634,255,66.3550213595625,127.25276543956251,71.697274874999977,0.29589999999999994,null,null,2,0.89924999999999988,840.79874999999993,23,10,94,10,6,65,1.4850000000000003,5.625,null,null,null,null,null,null,null,null,null,null,null,null,null,null,null,16,10.35,0.73182278620697816,0.97031275087500002,363.39002791261066]
["Cebada salvado",89,0.76049500367747369,0.68300071501306703,118,25.132764616152489,75.567175445336488,-8.0437669206000031,0.36300710000000003,null,null,2,0.62060199999999999,581.50407399999995,32,187,539,239,28,63,0.44000000000000006,2.9249999999999998,null,null,null,null,null,0.03,11.7,0.6,null,null,123,0.05,59,null,null,null,25.6,0.76510334942826175,0.90673719751619997,563.51936347377296]
["Cacao torta",86.6,0.92152562915630509,0.87946946177744068,232,88.670879085753597,140.27091297407361,25.814947049499995,0.34659280999999997,null,null,2,0.74546499999999993,673.15489500000001,20,161,363.86,212.89999999999998,47.29,97,1.4300000000000002,0.88400000000000012,null,null,null,null,null,null,null,null,null,null,null,null,null,null,null,null,15,0.58297490871153479,0.91649656821350012,268.23245904637008]
["Cacahuete, torta 48",88.6,1.1944335830241395,1.1865160385387328,524,143.30222231441923,198.10149398417923,261.73613801599998,0.28759999999999997,null,null,2,0.84376000000000007,789.75936000000002,16,77,150,101,26,64,0.9900000000000001,4.29,3,null,null,null,null,0.3,14.5,1.7,null,450,47.5,0.11,61.5,null,null,null,12,0.71794238190373694,0.96958034796799997,807.19479236353993]
["Coco torta",90,0.97095956734287703,0.93399951412527582,239,87.269035447756792,138.20984342983681,30.484987527999994,0.28759999999999997,null,null,2,0.7160399999999999,660.18887999999993,18,178,580,316,78,78,1.1000000000000001,4.4880000000000004,4,null,null,0.6,null,null,20,null,null,500,60,null,70,null,null,null,16.2,0.58722694217038374,0.88460814194399984,201.61933674532895]
["Colza, grano",89.9,1.9687535898800934,2.0261645054875959,217,41.884822356221591,81.980608908541598,90.240333511999992,0.29589999999999994,null,null,2,0.84608000000000005,798.69952000000012,457,68,199,116,41,56,1.8149999999999999,3.7629999999999999,null,null,null,null,null,null,null,null,null,null,null,null,null,null,null,null,388.45,0.79112532282213199,0.92408336497600008,581.94544679049329]
["Colza, grano semidescascarillado",90,2.0068243854673327,2.0660563857148828,217,41.884822356221591,80.92224090854161,91.894033511999979,0.29589999999999994,null,null,2,0.84608000000000005,798.69952000000012,480,68,115,84,41,56,1.8149999999999999,3.7629999999999999,null,null,null,null,null,null,null,null,null,null,null,null,null,null,null,null,379.20000000000005,0.79112532282213199,0.92408336497600008,817.11138658398465]
["Colza, turtó",90,0.95800502495921236,0.90985936028426784,418,103.91199090373202,155.86270835653204,193.04700397999994,0.3125,null,null,2,0.78420000000000001,704.99580000000014,26,120,287,182,74,101,4.620000000000001,8.8040000000000003,5.15,null,12.4,0.75,null,0.1,5.5,0.5,null,300,63.5,7.0000000000000007E-2,64.5,null,null,20,20.8,0.72777380875241571,0.91318648854000006,325.12141598538869]
["Colza, turtó tanne, curtido",89,1.2403090812927602,1.2532844857689245,391,143.42495357934857,193.47316113966858,118.739675687,0.33739999999999998,null,null,2,0.77349000000000001,713.93126999999993,26,129,302,193,79,77,4.620000000000001,8.8040000000000003,null,null,12.4,0.75,null,0.1,5.5,0.5,null,300,63.5,7.0000000000000007E-2,64.5,null,null,null,17.939999999999998,0.59520702136024917,0.90618107875099996,550.04680574196072]
["Algodón, grano",92,1.1057454642423121,1.0271553531490456,220,48.764449067224007,91.654792821464014,70.583837883999976,0.50340000000000007,null,null,2,0.64651999999999998,618.71964000000003,198,276,456,354,105,43,1.1550000000000002,4.7359999999999998,null,null,null,null,null,null,null,null,null,null,null,null,null,null,null,null,188.1,0.73941085414823005,0.85059792473200002,581.85751744287006]
["Algodón torta sin aceite",89,1.1501920277402691,1.1259438132783857,466,160.92210943249918,212.64457169579521,184.58365271359997,0.29948819999999998,null,null,2,0.80219600000000002,750.855456,20,127,232,138,32,64,2.5850000000000004,5.9220000000000006,5.2,null,15.2,0.4,null,null,null,null,null,null,null,null,null,null,null,null,15,0.64090967269049992,0.96167005577279996,814.20652128989173]
["Algodón cáscara",91,0.36620814217767916,0.23807886329057015,81,16.103086591867196,54.653602301563204,-25.8351807964,0.65129486000000003,null,null,2,0.32318199999999997,309.60835599999996,19,547,900,697.4,184.60000000000002,42,0.77,0.69300000000000006,null,null,null,null,null,null,null,null,null,null,null,null,null,null,null,null,14.25,0.72375435859716208,0.71966217154279999,816.25711636308222]
["Habón grano",86.9,1.2866071181997207,1.3209577887210684,302,51.430279740777983,115.06988487997799,130.98311697000003,0.1714,null,null,2,0.91429999999999989,876.81370000000004,16,90,171,108,24.700000000000003,41,0.71500000000000008,3.2640000000000002,1.6,0.8,12,0.25,null,0.4,13.8,1,null,100,12.7,0.02,43.7,null,null,null,12.8,0.82245394822364193,0.95918178880999994,509.23085716585433]
["Girasol, grano",93,1.7084711843203275,1.695156001331616,174,24.647498694691201,60.4191065078112,72.586862791999977,0.26269999999999993,null,null,2,0.74312,714.13832000000002,485,164,294,200,56,39,0.9900000000000001,3.12,null,null,null,null,null,null,null,null,null,null,null,null,null,null,null,null,460.75,0.84184492382372955,0.89565440941600005,566.2107452482353]
["Girasol torta descascarillado",91,0.99107641893319698,0.94397086945962927,417,80.253815077377354,133.12343795232135,220.11121425790003,0.32080000000000003,null,null,2,0.74591699999999994,691.46505899999988,22,176,299,220,70,73,2.09,6.4350000000000005,5.5,1.2,12,0.33,null,null,null,null,null,null,null,null,null,null,null,null,16.5,0.79012083402996014,0.91698092634670014,601.94944148864533]
["Lenteja grano",88,1.2927425717054508,1.3306553425464995,281,49.081812964852382,113.1999670179724,113.22538429199999,0.1714,null,null,2,0.91962999999999995,886.52332000000001,19.3,49,160,72,3,36,0.60500000000000009,3.06,null,null,null,null,null,null,null,null,null,null,null,null,null,null,null,null,14.475000000000001,0.82166571738072802,0.97944360991599988,617.48009359721186]
["Lino, grano",90.3,1.6575837469429318,1.6606714982698805,253,51.011948668166198,92.319144300857403,111.00750682392,0.32080000000000003,null,null,2,0.78051800000000005,743.36534319999998,362,101.89999999999999,244.7,148.4,62,47.599999999999994,2.3145071982281284,4.5260243632336659,3.9867109634551494,0.66445182724252494,7.9734219269102988,0.77519379844961245,2.9900332225913622,null,13.289036544850498,0.22148394241417499,null,163.89811738648947,32.115171650055373,null,49.833887043189371,null,null,null,343.9,0.77769198729402633,0.90697700524215985,614.34637074519037]
["Linaza torta sin aceite",89,1.1518710540767036,1.1341411667893986,377,129.46711168154192,180.63225981184593,120.74445604639997,0.30640610000000001,null,null,2,0.80390399999999995,752.45414399999981,58,118,236,149,88,64,2.5850000000000004,6.2980000000000009,6.1,null,14,1.3,null,0.6,21,0.6,null,250,59,0.5,73,null,null,9,43.5,0.61695666244551961,0.89654108470719995,595.35825663975595]
["Palmito torta (palmiste)",90,0.83194750357129577,0.76329964928928062,206,83.768055090368009,136.52083694508801,-3.9262216479999914,0.42869999999999997,null,null,2,0.73055999999999999,699.14591999999993,19,167,632,241,103,43,1.7050000000000003,4.556,null,null,null,null,null,null,null,null,null,null,null,null,null,null,null,null,17.100000000000001,0.52287183224694234,0.85226794729599997,614.34637074519037]
["Judía grano",88,1.2694175668129566,1.3060081028573072,257,44.572029681858787,108.56384220537879,93.98279293200001,0.1714,null,null,2,0.91937000000000002,878.91772000000003,19,51,162,74,3,44,0.71500000000000008,3.468,1.6,null,14,0.4,null,null,null,null,null,null,null,null,null,null,null,null,15.200000000000001,0.82213541357934528,0.97507899463600001,689.67844245679078]
["Guisante grano",85.7,1.2625786176584095,1.2977899538253017,259,44.911731932978391,108.99577708625841,95.458679448000012,0.1714,null,null,2,0.91768000000000005,877.30208000000005,15,64,162,74,3,44,0.49500000000000005,3.1280000000000001,1.45,null,11,0.3,null,7.0000000000000007E-2,7.2,1.1000000000000001,null,null,8,0.2,37,null,null,null,12,0.82222021761807795,0.97538858510400006,696.39586966079742]
["Soja, grano extrusionado",88,1.4854856019534888,1.4973907223657086,402,188.43235510953002,238.04062854249003,109.28707276099998,0.32080000000000003,null,null,2,0.97179000000000004,912.51081000000011,213,74,146,92,7,61,1.54,4.4799999999999995,null,null,null,null,null,null,null,null,null,null,null,null,null,null,null,null,202.35,0.52666678399466216,0.99029010835300013,704.00180849999981]
["Soja, grano tostado",88.6,1.4901857276896577,1.5024458709028436,397.29999999999995,133.30789500662681,185.68918291519,158.22623764286999,0.29589999999999994,null,null,2,0.97577899999999995,918.50077269999986,216.70000000000002,63.2,132,77.78,13.5,58.7,1.9864559819413097,4.187358916478555,2.5959367945823928,0.56433408577878108,20.767494356659142,0.90293453724604977,3.1602708803611739,null,38.37471783295711,4.5146726862302486,null,161.39954853273139,31.602708803611741,0.31602708803611745,45.146726862302486,null,null,null,205.86500000000001,0.65872130014657793,0.98316887688550991,771.75107974145862]
["Soja torta 44",87.2,1.1656258626018918,1.1597938319839582,488,153.41999795655397,207.06952650471396,219.17261164349998,0.27810560000000001,null,null,2,0.84965499999999994,779.13363500000003,22,84,163,104,8,83,1.87,4.8999999999999995,2.7,null,20,1.95,null,0.3,17.100000000000001,2.2999999999999998,null,200,43.7,0.2,54.6,null,null,7,16.5,0.68199960346033861,0.9886316027755,737.90755524119731]
["Soja torta 46",87.2,1.2042399719188401,1.2053336060239686,505,160.06920989040626,214.45587978640626,229.07082828750001,0.26867210000000002,null,null,2,0.86389499999999997,799.10287499999993,20,72,143,89,7,75,1.87,5.18,2.7,null,20,1.95,null,0.3,17.100000000000001,2.2999999999999998,null,200,43.7,0.2,54.6,null,null,null,15,0.6799548883113109,0.99038766998750005,751.54208570371975]
["Soja torta 48",88.3,1.2238106736886152,1.2268716598377332,520,165.08161824536202,219.31515756907405,239.06009480669999,0.26741429999999999,null,null,2,0.86734100000000003,804.02510700000005,23,70,140,87,7,73,1.87,5.46,2.7,null,19.7,1.95,null,0.3,17.100000000000001,2.2999999999999998,null,200,43.7,0.2,54.6,null,null,null,17.25,0.67946396874075055,0.99041798584910001,186.25282507445968]
["Soja torta 50",87.8,1.225744301238733,1.2255650042406774,544,172.40454338212001,225.71545583172002,256.10169929750003,0.2498051,null,null,2,0.86202699999999988,797.37497499999995,28,77,102,59,6,75,1.6500000000000001,5.46,2.7,null,19.7,1.95,null,0.3,17.100000000000001,2.2999999999999998,null,200,43.7,0.2,54.6,null,null,null,21,0.68011632654366916,0.99073551671750015,299.4175208535824]
["Soja torta 48 curtido \"Tanne\"",88.8,1.2238106736886152,1.2268716598377332,520,165.08161824536202,219.31515756907405,239.06009480669999,0.26741429999999999,null,null,2,0.86734100000000003,804.02510700000005,23,70,140,87,7,73,1.87,5.46,null,null,null,null,null,0.3,17.100000000000001,2.2999999999999998,null,200,43.7,0.2,54.6,null,null,null,15.180000000000001,0.67946396874075055,0.99041798584910001,152.52751727330252]
["Altramuz grano",86.7,1.4985748501920342,1.5443460916061895,399,69.098815818280471,127.26703342788048,218.10215998500001,0.1714,null,null,2,0.90506999999999993,864.34185000000002,104,161,229,172,17,45,1.1000000000000001,3.1280000000000001,2.5,null,9.5,0.55000000000000004,null,null,null,null,null,null,null,null,null,null,null,null,93.600000000000009,0.82289872796188157,0.97785852990499988,864.52724698655015]
["Altramuz extrusionado",88,1.5275128795369315,1.5781926650923088,406,69.232090685749569,127.71452533022958,223.28119586800003,0.1714,null,null,2,0.91027000000000002,877.50027999999998,109,121,214,175,34.4,36,1.1000000000000001,3.06,1.7,0.23,10,0.11,null,null,null,null,null,null,null,null,null,null,null,null,83.93,0.82240293019900856,0.96016443876399993,769.79358280934184]
["Pulpas (cítricos) ensitjades",21,1.2247648530455373,1.2387634090832353,73,20.576516455389989,79.537256128989995,-58.876155740000002,0.22120000000000006,null,null,2,0.87227999999999994,824.30459999999994,97,156,356.65,206.62,44.65,55,11.22,1.35,1.6,null,6.2,0.9,0.2,0.16,6,null,null,160,7,null,16,null,null,null,58.199999999999996,0.68078367808218965,0.88300650397999969,785.49351337460575]
["Pulpas (cítricos)",90,1.0945776496498119,1.1035515879610236,70,20.494530967225,82.579768544825001,-65.708183715000004,0.22120000000000006,null,null,2,0.87930999999999993,822.1548499999999,28,137,223,158,14,65,4.6000000000000005,1.1700000000000002,null,null,null,null,null,null,null,null,null,null,null,null,null,null,null,null,16.8,0.6799461391636954,0.91478044680499992,367.90991842891236]
["Algarrobo (algarroba)",87,0.84349490499888424,0.82739527562045634,58,20.578036751799999,81.081596271800024,-76.256811750000026,0.28817428899999997,null,null,2,0.801456386292835,771.80250000000012,11,87,257.16000000000003,120.00999999999999,23.83,37,0.82500000000000007,0.40800000000000003,null,null,null,null,null,null,null,null,null,null,null,null,null,null,null,null,9.9,0.60525957312408907,0.89880263824999995,645.90878741880897]
["Algarrobo pulpa deshidratada sin semilla, IAMZ",86,0.81755713356327342,0.80100990873229949,56,19.887404593055997,81.023260765855994,-78.364775269999996,0.286199543,null,null,2,0.80349252336448596,773.76329999999996,0.1,84.5,253.55,116.86999999999999,23.07,37,0.82500000000000007,0.40800000000000003,null,null,null,null,null,null,null,null,null,null,null,null,null,null,null,null,8.0000000000000016E-2,0.60497831613785447,0.89901957128999999,332.89631139577602]
["Oliva molienda \"orujo\"",89,0.3555684594003049,0.23152849593807051,111,37.773671789926794,72.196085881446805,-21.365022018000008,0.58639999999999992,null,null,2,0.33429000000000003,306.87822,74,339,620.51,456.32,108.36,82,7.7000000000000011,2.3120000000000003,null,null,null,null,null,null,null,null,null,null,null,null,null,null,null,null,54.76,0.57995139706720433,0.81015231828599998,255.97633316094925]
["Oliva pulpa sin extracción, IAMZ",68.5,0.52852566084554287,0.41188219318965796,114,44.703288467039997,84.482230931040007,-28.474597600000006,0.58639999999999992,null,null,2,0.45799999999999996,425.02399999999994,74,200,341,295,60.21,72,6.5450000000000008,1.0880000000000001,null,null,null,null,null,null,null,null,null,null,null,null,null,null,null,null,54.76,0.54731158643493383,0.86623403119999987,172.26091942057013]
["Oliva pulpa de extracción ( \"orujo\"), IAMZ",87.6,0.28358208219027031,0.16307856023765305,66,20.210481566827202,53.349659430507202,-38.259965412,0.58639999999999992,null,null,2,0.26932,252.89148,74,412,725.77,527.95000000000005,134.64000000000001,61,3.08,0.6120000000000001,null,null,null,null,null,null,null,null,null,null,null,null,null,null,null,null,54.76,0.60054601929246265,0.766594983324,731.01164568458989]
["Patata-ITEB",13,1.2240398770980918,1.2703481114883948,100,34.239489082499993,100.58316924249999,-56.862000250000008,0.12159999999999993,null,null,2,0.94450000000000001,901.99749999999995,0.8,30,174.97,48.46,7.2799999999999994,45,0.55000000000000004,1.36,1,22,null,null,null,null,null,null,null,null,null,null,null,null,null,null,0.64000000000000012,0.63329746986550162,0.93371292174999998,746.31817387467254]
["Patata pulpa-ITEB",17,1.0475620581342135,1.0403259038381121,50,15.367721216250001,77.369791776250025,-80.57823525000002,0.12159999999999993,null,null,2,0.81010000000000004,789.84750000000008,2.5,150,348,199.08999999999997,43.7,25,2.75,0.34,0.8,6,null,null,null,null,null,null,null,null,null,null,null,null,null,null,2,0.64892165618683528,0.87545822674999996,866.03200000000004]
["Manzana desechos",22,1.1001886495245434,1.1027604333914458,23,8.7955432171043988,71.564699576784406,-100.08680681200001,0.48679999999999995,null,null,2,0.82908000000000004,813.32747999999992,18,68,229.76,96.16,18,19,0.33,0.40800000000000003,null,null,null,null,null,null,null,null,null,null,null,null,null,null,null,null,16.2,0.57243623367851648,0.89440442012400012,695.25000000000011]
["Manzana molienda ( \"marco\") deshidratada",94.1,0.5535459390511992,0.42986523768137502,79,22.417724090135192,65.611793691415201,-39.820733751999995,0.48679999999999995,null,null,2,0.44367999999999996,435.25007999999991,39,478,354,610.79,121,19,1.0449999999999999,1.0880000000000001,null,null,null,null,null,null,null,null,null,null,null,null,null,null,null,null,35.1,0.64126377758117026,0.79102315750399976,0]
["Manzana residuo deshidratado, NRC",89,1.0175921929055001,0.98320116886366127,49,17.456201438843994,73.715111672443996,-76.134547240000003,0.48679999999999995,null,null,2,0.73319999999999996,717.06959999999992,51,170,376.83,260,50.24,22,0.71500000000000008,0.74800000000000011,0.7,null,4.5999999999999996,1.2,0.2,null,10,null,null,300,7,null,null,null,null,null,45.9,0.58855484528181679,0.86584810847999993,628.0150685218556]
["Uva vinaza sin pepitas",67,0.66080505971637316,0.56171561481913768,172,20.015764349395198,59.872981870035204,-4.2369023759999997,0.58639999999999992,null,null,2,0.54432999999999998,483.36503999999996,97,103,777,685,536,112,3.3000000000000003,1.7000000000000002,null,null,null,null,null,null,null,null,null,null,null,null,null,null,null,null,72.75,0.68913529881265156,0.37434524575200001,0]
["Uva pulpa",90,0.30489011965292578,0.18655481578623268,120,11.608508946144001,48.208402918624003,-20.987334332000007,0.58639999999999992,null,null,2,0.30492000000000002,292.41828000000004,7,372,754,653,499,41,4.4000000000000004,2.72,null,null,null,null,null,null,null,null,null,null,null,null,null,null,null,null,5.25,0.75465044300790995,0.39428469216400003,477.34957705641352]
["Uva torta de huesos",89,0.16230419405379379,6.7872305095073068E-2,112,-1.6540106768192107,29.626211898540795,-16.035347774000005,0.58639999999999992,null,null,2,0.18833000000000005,181.17346000000003,16,503,847,751,644,38,3.63,0.88400000000000012,null,null,null,null,null,null,null,null,null,null,null,null,null,null,null,null,12,1.0632808876836617,0.23337144929799986,842.25416431416647]
["Remolacha pulpas ensitjades",22,1.0076659697674053,1.0014902800769032,98,33.631260467481596,93.731943465241613,-53.227317184,0.28759999999999997,null,null,2,0.85377999999999998,778.64736000000005,9,206,428.74,269.38,62.220000000000006,88,2.6,0.68,null,null,null,null,null,0.1,4.5999999999999996,0.3,null,null,52.4,0.03,9.6,null,null,null,4.5,0.60575801718969247,0.87047078236799991,468.17469725161038]
["Remolacha pulpas deshidratadas",90,1.0254716288107246,1.0191080235150367,98,34.16981376867458,94.986646944936979,-54.346301837909991,0.28759999999999997,null,null,2,0.85500100000000001,794.2104288999999,9,202.7,507.9,302.10000000000002,55.099999999999994,71.100000000000009,2.12,0.68,2.2333333333333334,0.4,4,2.2333333333333329,2.2000000000000002,9.3333333333333338E-2,7.7333333333333334,0.3,null,243,47.6,0.03,9.7333333333333325,null,0.6,null,4,0.60314025484359779,0.87857630642456985,592.83810019236694]
["Melaza Remolacha",76,1.184004733191649,1.2070895142316092,146,10.219999999999994,76.740128512000027,17.642299199999986,-0.70840000000000014,null,null,3,0.89,878.25200000000007,2,0,0,0,0,13.200000000000001,1.9250000000000003,0.34,16.5,null,55,12.5,null,null,null,null,null,null,null,null,null,null,null,null,2,0.93,1]
["Melaza caña",75,0.86106390989984793,0.83916162333276656,45,3.1499999999999977,61.811424000000009,-64.008475000000004,-1.5384,null,null,4,0.8,710.40000000000009,12,0,0,0,0,112,5.1150000000000011,0.74800000000000011,4.7,27,33,1.7,null,null,null,null,null,null,null,null,null,null,null,null,12,0.93,1]
["Grasa vegetal, manteca de cerdo (todos los tipos)",99.9,3.61,3.94,9.9999999999999995E-8,9.9999999999999995E-8,9.9999999999999995E-8,-14,0.25,null,null,2,0.9,9.9999999999999995E-8,999,9.9999999999999995E-8,9.9999999999999995E-8,9.9999999999999995E-8,9.9999999999999995E-8,9.9999999999999995E-8,5.5000000000000003E-8,6.8E-8,9.9999999999999995E-8,9.9999999999999995E-8,9.9999999999999995E-8,9.9999999999999995E-8,9.9999999999999995E-8,9.9999999999999995E-8,9.9999999999999995E-8,9.9999999999999995E-8,null,9.9999999999999995E-8,9.9999999999999995E-8,9.9999999999999995E-8,9.9999999999999995E-8,1300,9.9999999999999995E-8,95,999,0,0]
["Levadura cervecería",93.3,1.18,1.17,476,87,143,278,0.15,null,null,2,0.84,756,40,21,88,25,7,32,1.6500000000000001,9.1800000000000015,2.4,null,null,null,null,null,null,null,null,null,null,null,null,null,null,null,32,0.81515770697868817,0.98880568000000002]
["Urea",99,0.26,0.2,2870,9.9999999999999995E-7,71,2557,0.23,null,null,2,0.99,9.9999999999999995E-7,9.9999999999999995E-7,9.9999999999999995E-7,9.9999999999999995E-7,9.9999999999999995E-7,9.9999999999999995E-7,9.9999999999999995E-7,null,null,9.9999999999999995E-7,9.9999999999999995E-7,9.9999999999999995E-7,9.9999999999999995E-7,9.9999999999999995E-7,9.9999999999999995E-7,9.9999999999999995E-7,9.9999999999999995E-7,null,9.9999999999999995E-7,9.9999999999999995E-7,9.9999999999999995E-7,9.9999999999999995E-7,9.9999999999999995E-7,9.9999999999999995E-7,9.9999999999999995E-7,0,0,0]
["Residuo pan deshidratado, NRC",92,1.0961415666476575,1.0548754187213749,107,22.016129611689657,70.466557902495424,-10.723794204384003,0.29445700000000002,null,null,2,0.71421800000000002,628.16901535999989,127,130,180,130,10,44,0.77,1.7680000000000002,2.6,16.100000000000001,5.3,12.4,0.2,1.05,5,null,null,31,71,null,16,2000,null,45,null,0.77738842706928668,0.924292560180768]
["Mandioca",85,1.1420974625875657,1.1744543546403801,31,10.1054225265006,75.490022489380621,-97.453437442000009,0.12159999999999993,null,null,2,0.91761999999999999,861.64517999999998,8.1999999999999993,54,118,59,14.01,61,1.375,0.68,0.9,null,7.5,0.35,null,null,2,null,null,50,5,null,30,null,null,null,6.56,0.63899949400537248,0.90299422413399999]
["Alfalfa deshidratada y aglomerados",90.2,0.73987011742021469,0.6738447078476324,233,68.64631678888,116.14710297768001,51.380021579999976,0.37889999999999996,null,null,2,0.66579999999999995,579.91179999999997,34,237,405,280,76,129,3.84,1.7680000000000002,null,null,null,null,null,null,null,null,null,null,null,null,null,null,null,null,17,0.66636436588674008,0.88305730933999993]
["Gramíneas deshidratadas y aglomeradas",91,0.82899594181392655,0.78514605944839444,105,26.822401345057497,80.520582379937494,-29.853407866999998,0.38187409999999999,null,null,2,0.72206999999999999,649.14093000000003,25,238,508,269,73.08,101,2.3650000000000002,1.8360000000000003,null,null,null,null,null,null,null,null,null,null,null,null,null,null,null,null,12.5,0.70187781135587579,0.85686826110900005]
[]
[]
[]
[]
[]
[]
[]
[]
[]
[]
[]
[]
[]
[]
[]
[]
[]
[]
[]
[]
[]
[]
[]
[]
[]
[]
[]
[]
[]
[]
[]
[]
[]
[]
[]
[]
[]
[]
[]
[]
[]
[]
[]
[]
[]
[]
[]
[]
[]
[]
[]
[]
[]
[]
[]
[]
[]
[]
[]
[]
[]
[]
[]
[]
[]
[]
[]
[]
[]
[]
[]
[]
[]
[]
[]
[]
[]
[]
[]
[]
[]
[]
[]
[]
[]
[]
[]
[]
[]
[]
[]
[]
[]
[]
[]
[]
[]
[]
[]
[]
[]
[]
[]
[]
[]
[]
[]
[]
["","","","","","","","",null,null,null,null,"","","","","","","","","","","","","","","","","","","","","","","","","",""]
["","","","","","","","",null,null,null,null,"","","","","","","","","","","","","","","","","","","","","","","","","",""]
[]
["","","","","","","","",null,null,null,null,"","","","","","","","","","","","","","","","","","","","","","","","","",""]
[]
[]
["","","","","","","","",null,null,null,null,"","","","","","","","","","","","","","","","","","","","","","","","","",""]
[]
["","","","","","","","",null,null,null,null,"","","","","","","","","","","","","","","","","","","","","","","","","",""]

{"sheet":"Tabla Minerales-aa","index":3,"n_rows":24,"n_cols":42,"rows_kept":24,"cut":false,"hidden":false,"merged":[]}
["INGREDIENTES","MS","UFL","UFV","MNT_PB","PDIA","PDI","BPR","UEL","UEB","UEM","NI ref","dMO","MOD_TDN","EE","FB","NDF","ADF","Lignina","Cenizas","Ca","P","Mg","Cl","K","Na","S","Co","Cu","Mo","Yodo","Fe","Mn","Se","Zn","Vit A","Vit D","Vit E","AG","DT_N","dr","MOF"]
[]
["Carbonato cálcico",98,null,null,null,null,null,null,null,null,null,null,null,null,null,null,null,null,null,955,145.54,null,14,0.2,0.7,0.7,0.7,null,12,null,null,620]
["Fosfato bicálcico",98.8,null,null,null,null,null,null,null,null,null,null,null,null,null,null,null,null,null,836,244,122.4,5,0.4,1.2,0.8,11,null,15,null,null,7800]
["Fosfato monocálcico",98.8,null,null,null,null,null,null,null,null,null,null,null,null,null,null,null,null,null,null,88.2,155.04000000000002]
["Óxido magnésico",100,null,null,null,null,null,null,null,null,null,null,null,null,null,null,null,null,null,null,30,null,510]
["Harina de huesos",100,null,null,null,null,null,null,null,null,null,null,null,null,null,null,null,null,null,null,11.8,10.200000000000001]
["Fosfato sódico",100,null,null,null,null,null,null,null,null,null,null,null,null,null,null,null,null,null,null,null,13.600000000000001,null,null,null,19]
["Fosfórico",100,null,null,null,null,null,null,null,null,null,null,null,null,null,null,null,null,null,null,null,21.488000000000003]
["Bicarbonato sódico",99.7,null,null,null,null,null,null,null,null,null,null,null,null,null,null,null,null,null,null,null,null,null,null,null,270]
["Carbonato de cobalto",100,null,null,null,null,null,null,null,null,null,null,null,null,null,null,null,null,null,null,null,null,null,null,null,null,null,49]
["Carbonato de manganeso",100,null,null,null,null,null,null,null,null,null,null,null,null,null,null,null,null,null,null,null,null,null,null,null,null,null,null,null,null,null,null,47]
["Carbonato de zinc",100,null,null,null,null,null,null,null,null,null,null,null,null,null,null,null,null,null,null,null,null,null,null,null,null,null,null,null,null,null,null,null,null,52]
["Cloruro potásico",100,null,null,null,null,null,null,null,null,null,null,null,null,null,null,null,null,null,null,null,null,null,null,52]
["Cloruro sódico",98,null,null,null,null,null,null,null,null,null,null,null,null,null,null,null,null,null,null,null,null,null,570,null,360]
["Yoduro potásico",100,null,null,null,null,null,null,null,null,null,null,null,null,null,null,null,null,null,null,null,null,null,null,null,null,null,null,null,null,76]
["Óxido de cobre",100,null,null,null,null,null,null,null,null,null,null,null,null,null,null,null,null,null,null,null,null,null,null,null,null,null,null,80]
["Óxido de manganeso",100,null,null,null,null,null,null,null,null,null,null,null,null,null,null,null,null,null,null,null,null,null,null,null,null,null,null,null,null,null,null,77]
["Óxido de zinc",100,null,null,null,null,null,null,null,null,null,null,null,null,null,null,null,null,null,null,null,null,null,null,null,null,null,null,null,null,null,null,null,null,80]
["Sulfato de cobalto",100,null,null,null,null,null,null,null,null,null,null,null,null,null,null,null,null,null,null,null,null,null,null,null,null,null,22]
["Sulfato de cobre",100,null,null,null,null,null,null,null,null,null,null,null,null,null,null,null,null,null,null,null,null,null,null,null,null,null,null,25]
["Sulfato de zinc",100,null,null,null,null,null,null,null,null,null,null,null,null,null,null,null,null,null,null,null,null,null,null,null,null,null,null,null,null,null,null,null,null,23]
["Sulfato magnésico",100,null,null,null,null,null,null,null,null,null,null,null,null,null,null,null,null,null,null,null,null,10,null,null,null,13]
["Sulfato sódico",100,null,null,null,null,null,null,null,null,null,null,null,null,null,null,null,null,null,null,null,null,null,null,null,32,22]

{"sheet":"CálculosEV","index":4,"n_rows":53,"n_cols":109,"rows_kept":53,"cut":false,"hidden":true,"merged":[[2,0,6,0],[7,0,18,0],[19,0,24,0]]}
[null,null,null,{"$f":"OFFSET('Tabla Forrajes'!$A$1,0,D2,1,1)","v":"MS %"},{"$f":"OFFSET('Tabla Forrajes'!$A$1,0,E2,1,1)","v":"UEB"},{"$f":"OFFSET('Tabla Forrajes'!$A$1,0,F2,1,1)","v":"UFL"},{"$f":"OFFSET('Tabla Forrajes'!$A$1,0,G2,1,1)","v":"PDI"},{"$f":"OFFSET('Tabla Forrajes'!$A$1,0,H2,1,1)","v":"BPR"},{"$f":"OFFSET('Tabla Forrajes'!$A$1,0,I2,1,1)","v":"NI ref"},{"$f":"OFFSET('Tabla Forrajes'!$A$1,0,J2,1,1)","v":"Ca"},{"$f":"OFFSET('Tabla Forrajes'!$A$1,0,K2,1,1)","v":"P"},{"$f":"OFFSET('Tabla Forrajes'!$A$1,0,L2,1,1)","v":"Mg"},{"$f":"OFFSET('Tabla Forrajes'!$A$1,0,M2,1,1)","v":"K"},{"$f":"OFFSET('Tabla Forrajes'!$A$1,0,N2,1,1)","v":"Na"},{"$f":"OFFSET('Tabla Forrajes'!$A$1,0,O2,1,1)","v":"S"},{"$f":"OFFSET('Tabla Forrajes'!$A$1,0,P2,1,1)","v":"Cl"},{"$f":"OFFSET('Tabla Forrajes'!$A$1,0,Q2,1,1)","v":"Co"},{"$f":"OFFSET('Tabla Forrajes'!$A$1,0,R2,1,1)","v":"Cu"},{"$f":"OFFSET('Tabla Forrajes'!$A$1,0,S2,1,1)","v":"Mn"},{"$f":"OFFSET('Tabla Forrajes'!$A$1,0,T2,1,1)","v":"Zn"},{"$f":"OFFSET('Tabla Forrajes'!$A$1,0,U2,1,1)","v":"Yodo"},{"$f":"OFFSET('Tabla Forrajes'!$A$1,0,V2,1,1)","v":"Se"},{"$f":"OFFSET('Tabla Forrajes'!$A$1,0,W2,1,1)","v":"Vit A"},{"$f":"OFFSET('Tabla Forrajes'!$A$1,0,X2,1,1)","v":"Vit D"},{"$f":"OFFSET('Tabla Forrajes'!$A$1,0,Y2,1,1)","v":"Vit E"},{"$f":"OFFSET('Tabla Forrajes'!$A$1,0,Z2,1,1)","v":"AG"},{"$f":"OFFSET('Tabla Forrajes'!$A$1,0,AA2,1,1)","v":"MNT_PB"},{"$f":"OFFSET('Tabla Forrajes'!$A$1,0,AB2,1,1)","v":"PDIA"},{"$f":"OFFSET('Tabla Forrajes'!$A$1,0,AC2,1,1)","v":"dMO"},{"$f":"OFFSET('Tabla Forrajes'!$A$1,0,AD2,1,1)","v":"MOD"},{"$f":"OFFSET('Tabla Forrajes'!$A$1,0,AE2,1,1)","v":"EE"},{"$f":"OFFSET('Tabla Forrajes'!$A$1,0,AF2,1,1)","v":"FB"},{"$f":"OFFSET('Tabla Forrajes'!$A$1,0,AG2,1,1)","v":"NDF"},{"$f":"OFFSET('Tabla Forrajes'!$A$1,0,AH2,1,1)","v":"ADF"},{"$f":"OFFSET('Tabla Forrajes'!$A$1,0,AI2,1,1)","v":"Lignina"},{"$f":"OFFSET('Tabla Forrajes'!$A$1,0,AJ2,1,1)","v":"Cenizas"},{"$f":"OFFSET('Tabla Forrajes'!$A$1,0,AK2,1,1)","v":"Mo"},{"$f":"OFFSET('Tabla Forrajes'!$A$1,0,AL2,1,1)","v":"DT_N"},{"$f":"OFFSET('Tabla Forrajes'!$A$1,0,AM2,1,1)","v":"MOF"},null,null,null,null,null,null,null,null,null,null,null,null,null,null,null,null,null,null,null,null,null,"AG","MNT_PB","PDIA","dMO","MOD","EE","FB","NDF","ADF","Lignina","Cenizas","Mo"]
["TIPUS","INGREDIENTS UTILITZATS","Nº",1,9,{"$f":"E29+1","v":2},6,7,11,20,21,22,24,25,26,23,27,28,32,34,30,33,35,36,37,38,4,5,12,13,14,15,16,17,18,19,29,39,41,"UEB","UFV","PDI","BPR","NI ref","Ca","P","Mg","K","Na","S","Cl","Co","Cu","Mn","Zn","Iodo","Se","Vit A","Vit D","Vit E","AG","MNT_PB","PDIA","dMO","MOD","EE","FB","NDF","ADF","Lignina","Cenizas","Mo","DT_N","MOF"]
["FARRATGES",{"$f":"IF(OFFSET('Tabla Forrajes'!$A$1,C3,0,1,1)=0,\"\",OFFSET('Tabla Forrajes'!$A$1,C3,0,1,1))","v":"ENSILADO Prat natural plano, gramíneas en gran parte"},40,{"$f":"OFFSET('Tabla Forrajes'!$A$1,$C3,$D$2,1,1)","v":48},{"$f":"OFFSET('Tabla Forrajes'!$A$1,$C3,$E$2,1,1)","v":1.2295663735641016},{"$f":"OFFSET('Tabla Forrajes'!$A$1,$C3,$F$2,1,1)","v":0.9301076693133391},{"$f":"OFFSET('Tabla Forrajes'!$A$1,$C3,$G$2,1,1)","v":51.530586601789764},{"$f":"OFFSET('Tabla Forrajes'!$A$1,$C3,$H$2,1,1)","v":-5.2529299494965009},{"$f":"OFFSET('Tabla Forrajes'!$A$1,$C3,$I$2,1,1)","v":1.6448208043647601},{"$f":"OFFSET('Tabla Forrajes'!$A$1,$C3,$J$2,1,1)","v":3.48},{"$f":"OFFSET('Tabla Forrajes'!$A$1,$C3,$K$2,1,1)","v":1.8199999999999998},{"$f":"OFFSET('Tabla Forrajes'!$A$1,$C3,$L$2,1,1)","v":0},{"$f":"OFFSET('Tabla Forrajes'!$A$1,$C3,$M$2,1,1)","v":0},{"$f":"OFFSET('Tabla Forrajes'!$A$1,$C3,$N$2,1,1)","v":0},{"$f":"OFFSET('Tabla Forrajes'!$A$1,$C3,$O$2,1,1)","v":0},{"$f":"OFFSET('Tabla Forrajes'!$A$1,$C3,$P$2,1,1)","v":0},{"$f":"OFFSET('Tabla Forrajes'!$A$1,$C3,$Q$2,1,1)","v":0},{"$f":"OFFSET('Tabla Forrajes'!$A$1,$C3,$R$2,1,1)","v":0},{"$f":"OFFSET('Tabla Forrajes'!$A$1,$C3,$S$2,1,1)","v":0},{"$f":"OFFSET('Tabla Forrajes'!$A$1,$C3,$T$2,1,1)","v":0},{"$f":"OFFSET('Tabla Forrajes'!$A$1,$C3,$U$2,1,1)","v":0},{"$f":"OFFSET('Tabla Forrajes'!$A$1,$C3,$V$2,1,1)","v":0},{"$f":"OFFSET('Tabla Forrajes'!$A$1,$C3,$W$2,1,1)","v":8000},{"$f":"OFFSET('Tabla Forrajes'!$A$1,$C3,$X$2,1,1)","v":200},{"$f":"OFFSET('Tabla Forrajes'!$A$1,$C3,$Y$2,1,1)","v":5},{"$f":"OFFSET('Tabla Forrajes'!$A$1,$C3,$Z$2,1,1)","v":18.256900000000002},{"$f":"OFFSET('Tabla Forrajes'!$A$1,$C3,$AA$2,1,1)","v":114.3},{"$f":"OFFSET('Tabla Forrajes'!$A$1,$C3,$AB$2,1,1)","v":15.087599999999998},{"$f":"OFFSET('Tabla Forrajes'!$A$1,$C3,$AC$2,1,1)","v":0.66871099999999994},{"$f":"OFFSET('Tabla Forrajes'!$A$1,$C3,$AD$2,1,1)","v":599.16505599999994},{"$f":"OFFSET('Tabla Forrajes'!$A$1,$C3,$AE$2,1,1)","v":22.200000000000003},{"$f":"OFFSET('Tabla Forrajes'!$A$1,$C3,$AF$2,1,1)","v":311.3},{"$f":"OFFSET('Tabla Forrajes'!$A$1,$C3,$AG$2,1,1)","v":584.20000000000005},{"$f":"OFFSET('Tabla Forrajes'!$A$1,$C3,$AH$2,1,1)","v":385},{"$f":"OFFSET('Tabla Forrajes'!$A$1,$C3,$AI$2,1,1)","v":0},{"$f":"OFFSET('Tabla Forrajes'!$A$1,$C3,$AJ$2,1,1)","v":104},{"$f":"OFFSET('Tabla Forrajes'!$A$1,$C3,$AK$2,1,1)","v":0},{"$f":"OFFSET('Tabla Forrajes'!$A$1,$C3,$AL$2,1,1)","v":0.78},{"$f":"OFFSET('Tabla Forrajes'!$A$1,$C3,$AM$2,1,1)","v":535.97955423500002},{"$f":"IF('II_Plantear Ración'!$E4>0,IF(CálculosEV!E3>0,1,\"No\"),\"\")","v":1},{"$f":"IF('II_Plantear Ración'!$E4>0,IF(CálculosEV!F3>0,1,\"No\"),\"\")","v":1},{"$f":"IF('II_Plantear Ración'!$E4>0,IF(CálculosEV!G3>0,1,\"No\"),\"\")","v":1},{"$f":"IF('II_Plantear Ración'!$E4>0,IF(CálculosEV!H3=0,\"No\",1),\"\")","v":1},{"$f":"IF('II_Plantear Ración'!$E4>0,IF(CálculosEV!I3>0,1,\"No\"),\"\")","v":1},{"$f":"IF('II_Plantear Ración'!$E4>0,IF(CálculosEV!J3>0,1,\"No\"),\"\")","v":1},{"$f":"IF('II_Plantear Ración'!$E4>0,IF(CálculosEV!K3>0,1,\"No\"),\"\")","v":1},{"$f":"IF('II_Plantear Ración'!$E4>0,IF(CálculosEV!L3>0,1,\"No\"),\"\")","v":"No"},{"$f":"IF('II_Plantear Ración'!$E4>0,IF(CálculosEV!M3>0,1,\"No\"),\"\")","v":"No"},{"$f":"IF('II_Plantear Ración'!$E4>0,IF(CálculosEV!N3>0,1,\"No\"),\"\")","v":"No"},{"$f":"IF('II_Plantear Ración'!$E4>0,IF(CálculosEV!O3>0,1,\"No\"),\"\")","v":"No"},{"$f":"IF('II_Plantear Ración'!$E4>0,IF(CálculosEV!P3>0,1,\"No\"),\"\")","v":"No"},{"$f":"IF('II_Plantear Ración'!$E4>0,IF(CálculosEV!Q3>0,1,\"No\"),\"\")","v":"No"},{"$f":"IF('II_Plantear Ración'!$E4>0,IF(CálculosEV!R3>0,1,\"No\"),\"\")","v":"No"},{"$f":"IF('II_Plantear Ración'!$E4>0,IF(CálculosEV!S3>0,1,\"No\"),\"\")","v":"No"},{"$f":"IF('II_Plantear Ración'!$E4>0,IF(CálculosEV!T3>0,1,\"No\"),\"\")","v":"No"},{"$f":"IF('II_Plantear Ración'!$E4>0,IF(CálculosEV!U3>0,1,\"No\"),\"\")","v":"No"},{"$f":"IF('II_Plantear Ración'!$E4>0,IF(CálculosEV!V3>0,1,\"No\"),\"\")","v":"No"},{"$f":"IF('II_Plantear Ración'!$E4>0,IF(CálculosEV!W3>0,1,\"No\"),\"\")","v":1},{"$f":"IF('II_Plantear Ración'!$E4>0,IF(CálculosEV!X3>0,1,\"No\"),\"\")","v":1},{"$f":"IF('II_Plantear Ración'!$E4>0,IF(CálculosEV!Y3>0,1,\"No\"),\"\")","v":1},{"$f":"IF('II_Plantear Ración'!$E4>0,IF(CálculosEV!Z3>0,1,\"No\"),\"\")","v":1},{"$f":"IF('II_Plantear Ración'!$E4>0,IF(CálculosEV!AA3>0,1,\"No\"),\"\")","v":1},{"$f":"IF('II_Plantear Ración'!$E4>0,IF(CálculosEV!AB3>0,1,\"No\"),\"\")","v":1},{"$f":"IF('II_Plantear Ración'!$E4>0,IF(CálculosEV!AC3>0,1,\"No\"),\"\")","v":1},{"$f":"IF('II_Plantear Ración'!$E4>0,IF(CálculosEV!AD3>0,1,\"No\"),\"\")","v":1},{"$f":"IF('II_Plantear Ración'!$E4>0,IF(CálculosEV!AE3>0,1,\"No\"),\"\")","v":1},{"$f":"IF('II_Plantear Ración'!$E4>0,IF(CálculosEV!AF3>0,1,\"No\"),\"\")","v":1},{"$f":"IF('II_Plantear Ración'!$E4>0,IF(CálculosEV!AG3>0,1,\"No\"),\"\")","v":1},{"$f":"IF('II_Plantear Ración'!$E4>0,IF(CálculosEV!AH3>0,1,\"No\"),\"\")","v":1},{"$f":"IF('II_Plantear Ración'!$E4>0,IF(CálculosEV!AI3>0,1,\"No\"),\"\")","v":"No"},{"$f":"IF('II_Plantear Ración'!$E4>0,IF(CálculosEV!AJ3>0,1,\"No\"),\"\")","v":1},{"$f":"IF('II_Plantear Ración'!$E4>0,IF(CálculosEV!AK3>0,1,\"No\"),\"\")","v":"No"},{"$f":"IF('II_Plantear Ración'!$E4>0,IF(CálculosEV!AL3>0,1,\"No\"),\"\")","v":1},{"$f":"IF('II_Plantear Ración'!$E4>0,IF(CálculosEV!AM3>0,1,\"No\"),\"\")","v":1},{"$f":"IF(AN3=\"\",0,1)","v":1},1,1,1,1,1,1,1,1,1,1,1,1,1,1,1,1,1,1,1,1,1,1,1,1,1,1,1,1,1,1,1,1,1,1]
[null,{"$f":"IF(OFFSET('Tabla Forrajes'!$A$1,C4,0,1,1)=0,\"\",OFFSET('Tabla Forrajes'!$A$1,C4,0,1,1))","v":"HENO Bromo Final vegetación"},55,{"$f":"OFFSET('Tabla Forrajes'!$A$1,$C4,$D$2,1,1)","v":85},{"$f":"OFFSET('Tabla Forrajes'!$A$1,$C4,$E$2,1,1)","v":1.1490542116640832},{"$f":"OFFSET('Tabla Forrajes'!$A$1,$C4,$F$2,1,1)","v":0.76419285183337515},{"$f":"OFFSET('Tabla Forrajes'!$A$1,$C4,$G$2,1,1)","v":58.493150019206396},{"$f":"OFFSET('Tabla Forrajes'!$A$1,$C4,$H$2,1,1)","v":-20.427847183009998},{"$f":"OFFSET('Tabla Forrajes'!$A$1,$C4,$I$2,1,1)","v":1.832722892363662},{"$f":"OFFSET('Tabla Forrajes'!$A$1,$C4,$J$2,1,1)","v":1.2400000000000002},{"$f":"OFFSET('Tabla Forrajes'!$A$1,$C4,$K$2,1,1)","v":2.0299999999999998},{"$f":"OFFSET('Tabla Forrajes'!$A$1,$C4,$L$2,1,1)","v":0},{"$f":"OFFSET('Tabla Forrajes'!$A$1,$C4,$M$2,1,1)","v":0},{"$f":"OFFSET('Tabla Forrajes'!$A$1,$C4,$N$2,1,1)","v":0},{"$f":"OFFSET('Tabla Forrajes'!$A$1,$C4,$O$2,1,1)","v":0},{"$f":"OFFSET('Tabla Forrajes'!$A$1,$C4,$P$2,1,1)","v":0},{"$f":"OFFSET('Tabla Forrajes'!$A$1,$C4,$Q$2,1,1)","v":0},{"$f":"OFFSET('Tabla Forrajes'!$A$1,$C4,$R$2,1,1)","v":0},{"$f":"OFFSET('Tabla Forrajes'!$A$1,$C4,$S$2,1,1)","v":0},{"$f":"OFFSET('Tabla Forrajes'!$A$1,$C4,$T$2,1,1)","v":0},{"$f":"OFFSET('Tabla Forrajes'!$A$1,$C4,$U$2,1,1)","v":0},{"$f":"OFFSET('Tabla Forrajes'!$A$1,$C4,$V$2,1,1)","v":0},{"$f":"OFFSET('Tabla Forrajes'!$A$1,$C4,$W$2,1,1)","v":50000},{"$f":"OFFSET('Tabla Forrajes'!$A$1,$C4,$X$2,1,1)","v":50},{"$f":"OFFSET('Tabla Forrajes'!$A$1,$C4,$Y$2,1,1)","v":5},{"$f":"OFFSET('Tabla Forrajes'!$A$1,$C4,$Z$2,1,1)","v":15.93},{"$f":"OFFSET('Tabla Forrajes'!$A$1,$C4,$AA$2,1,1)","v":100},{"$f":"OFFSET('Tabla Forrajes'!$A$1,$C4,$AB$2,1,1)","v":20.3},{"$f":"OFFSET('Tabla Forrajes'!$A$1,$C4,$AC$2,1,1)","v":0.62748999999999999},{"$f":"OFFSET('Tabla Forrajes'!$A$1,$C4,$AD$2,1,1)","v":564.74099999999999},{"$f":"OFFSET('Tabla Forrajes'!$A$1,$C4,$AE$2,1,1)","v":34},{"$f":"OFFSET('Tabla Forrajes'!$A$1,$C4,$AF$2,1,1)","v":320},{"$f":"OFFSET('Tabla Forrajes'!$A$1,$C4,$AG$2,1,1)","v":640},{"$f":"OFFSET('Tabla Forrajes'!$A$1,$C4,$AH$2,1,1)","v":333},{"$f":"OFFSET('Tabla Forrajes'!$A$1,$C4,$AI$2,1,1)","v":0},{"$f":"OFFSET('Tabla Forrajes'!$A$1,$C4,$AJ$2,1,1)","v":100},{"$f":"OFFSET('Tabla Forrajes'!$A$1,$C4,$AK$2,1,1)","v":0},{"$f":"OFFSET('Tabla Forrajes'!$A$1,$C4,$AL$2,1,1)","v":0.71},{"$f":"OFFSET('Tabla Forrajes'!$A$1,$C4,$AM$2,1,1)","v":494.54585790000004},{"$f":"IF('II_Plantear Ración'!$E5>0,IF(CálculosEV!E4>0,1,\"No\"),\"\")","v":""},{"$f":"IF('II_Plantear Ración'!$E5>0,IF(CálculosEV!F4>0,1,\"No\"),\"\")","v":""},{"$f":"IF('II_Plantear Ración'!$E5>0,IF(CálculosEV!G4>0,1,\"No\"),\"\")","v":""},{"$f":"IF('II_Plantear Ración'!$E5>0,IF(CálculosEV!H4=0,\"No\",1),\"\")","v":""},{"$f":"IF('II_Plantear Ración'!$E5>0,IF(CálculosEV!I4>0,1,\"No\"),\"\")","v":""},{"$f":"IF('II_Plantear Ración'!$E5>0,IF(CálculosEV!J4>0,1,\"No\"),\"\")","v":""},{"$f":"IF('II_Plantear Ración'!$E5>0,IF(CálculosEV!K4>0,1,\"No\"),\"\")","v":""},{"$f":"IF('II_Plantear Ración'!$E5>0,IF(CálculosEV!L4>0,1,\"No\"),\"\")","v":""},{"$f":"IF('II_Plantear Ración'!$E5>0,IF(CálculosEV!M4>0,1,\"No\"),\"\")","v":""},{"$f":"IF('II_Plantear Ración'!$E5>0,IF(CálculosEV!N4>0,1,\"No\"),\"\")","v":""},{"$f":"IF('II_Plantear Ración'!$E5>0,IF(CálculosEV!O4>0,1,\"No\"),\"\")","v":""},{"$f":"IF('II_Plantear Ración'!$E5>0,IF(CálculosEV!P4>0,1,\"No\"),\"\")","v":""},{"$f":"IF('II_Plantear Ración'!$E5>0,IF(CálculosEV!Q4>0,1,\"No\"),\"\")","v":""},{"$f":"IF('II_Plantear Ración'!$E5>0,IF(CálculosEV!R4>0,1,\"No\"),\"\")","v":""},{"$f":"IF('II_Plantear Ración'!$E5>0,IF(CálculosEV!S4>0,1,\"No\"),\"\")","v":""},{"$f":"IF('II_Plantear Ración'!$E5>0,IF(CálculosEV!T4>0,1,\"No\"),\"\")","v":""},{"$f":"IF('II_Plantear Ración'!$E5>0,IF(CálculosEV!U4>0,1,\"No\"),\"\")","v":""},{"$f":"IF('II_Plantear Ración'!$E5>0,IF(CálculosEV!V4>0,1,\"No\"),\"\")","v":""},{"$f":"IF('II_Plantear Ración'!$E5>0,IF(CálculosEV!W4>0,1,\"No\"),\"\")","v":""},{"$f":"IF('II_Plantear Ración'!$E5>0,IF(CálculosEV!X4>0,1,\"No\"),\"\")","v":""},{"$f":"IF('II_Plantear Ración'!$E5>0,IF(CálculosEV!Y4>0,1,\"No\"),\"\")","v":""},{"$f":"IF('II_Plantear Ración'!$E5>0,IF(CálculosEV!Z4>0,1,\"No\"),\"\")","v":""},{"$f":"IF('II_Plantear Ración'!$E5>0,IF(CálculosEV!AA4>0,1,\"No\"),\"\")","v":""},{"$f":"IF('II_Plantear Ración'!$E5>0,IF(CálculosEV!AB4>0,1,\"No\"),\"\")","v":""},{"$f":"IF('II_Plantear Ración'!$E5>0,IF(CálculosEV!AC4>0,1,\"No\"),\"\")","v":""},{"$f":"IF('II_Plantear Ración'!$E5>0,IF(CálculosEV!AD4>0,1,\"No\"),\"\")","v":""},{"$f":"IF('II_Plantear Ración'!$E5>0,IF(CálculosEV!AE4>0,1,\"No\"),\"\")","v":""},{"$f":"IF('II_Plantear Ración'!$E5>0,IF(CálculosEV!AF4>0,1,\"No\"),\"\")","v":""},{"$f":"IF('II_Plantear Ración'!$E5>0,IF(CálculosEV!AG4>0,1,\"No\"),\"\")","v":""},{"$f":"IF('II_Plantear Ración'!$E5>0,IF(CálculosEV!AH4>0,1,\"No\"),\"\")","v":""},{"$f":"IF('II_Plantear Ración'!$E5>0,IF(CálculosEV!AI4>0,1,\"No\"),\"\")","v":""},{"$f":"IF('II_Plantear Ración'!$E5>0,IF(CálculosEV!AJ4>0,1,\"No\"),\"\")","v":""},{"$f":"IF('II_Plantear Ración'!$E5>0,IF(CálculosEV!AK4>0,1,\"No\"),\"\")","v":""},{"$f":"IF('II_Plantear Ración'!$E5>0,IF(CálculosEV!AL4>0,1,\"No\"),\"\")","v":""},{"$f":"IF('II_Plantear Ración'!$E5>0,IF(CálculosEV!AM4>0,1,\"No\"),\"\")","v":""},{"$f":"IF(AN4=\"\",0,1)","v":0},{"$f":"IF(AO4=\"\",0,1)","v":0},{"$f":"IF(AP4=\"\",0,1)","v":0},{"$f":"IF(AQ4=\"\",0,1)","v":0},{"$f":"IF(AR4=\"\",0,1)","v":0},{"$f":"IF(AS4=\"\",0,1)","v":0},{"$f":"IF(AT4=\"\",0,1)","v":0},{"$f":"IF(AU4=\"\",0,1)","v":0},{"$f":"IF(AV4=\"\",0,1)","v":0},{"$f":"IF(AW4=\"\",0,1)","v":0},{"$f":"IF(AX4=\"\",0,1)","v":0},{"$f":"IF(AY4=\"\",0,1)","v":0},{"$f":"IF(AZ4=\"\",0,1)","v":0},{"$f":"IF(BA4=\"\",0,1)","v":0},{"$f":"IF(BB4=\"\",0,1)","v":0},{"$f":"IF(BC4=\"\",0,1)","v":0},{"$f":"IF(BD4=\"\",0,1)","v":0},{"$f":"IF(BE4=\"\",0,1)","v":0},{"$f":"IF(BF4=\"\",0,1)","v":0},{"$f":"IF(BG4=\"\",0,1)","v":0},{"$f":"IF(BH4=\"\",0,1)","v":0},{"$f":"IF(BI4=\"\",0,1)","v":0},{"$f":"IF(BJ4=\"\",0,1)","v":0},{"$f":"IF(BK4=\"\",0,1)","v":0},{"$f":"IF(BL4=\"\",0,1)","v":0},{"$f":"IF(BM4=\"\",0,1)","v":0},{"$f":"IF(BN4=\"\",0,1)","v":0},{"$f":"IF(BO4=\"\",0,1)","v":0},{"$f":"IF(BP4=\"\",0,1)","v":0},{"$f":"IF(BQ4=\"\",0,1)","v":0},{"$f":"IF(BR4=\"\",0,1)","v":0},{"$f":"IF(BS4=\"\",0,1)","v":0},{"$f":"IF(BT4=\"\",0,1)","v":0},{"$f":"IF(BU4=\"\",0,1)","v":0},{"$f":"IF(BV4=\"\",0,1)","v":0}]
[null,{"$f":"IF(OFFSET('Tabla Forrajes'!$A$1,C5,0,1,1)=0,\"\",OFFSET('Tabla Forrajes'!$A$1,C5,0,1,1))","v":""},1,{"$f":"OFFSET('Tabla Forrajes'!$A$1,$C5,$D$2,1,1)","v":0},{"$f":"OFFSET('Tabla Forrajes'!$A$1,$C5,$E$2,1,1)","v":0},{"$f":"OFFSET('Tabla Forrajes'!$A$1,$C5,$F$2,1,1)","v":0},{"$f":"OFFSET('Tabla Forrajes'!$A$1,$C5,$G$2,1,1)","v":0},{"$f":"OFFSET('Tabla Forrajes'!$A$1,$C5,$H$2,1,1)","v":0},{"$f":"OFFSET('Tabla Forrajes'!$A$1,$C5,$I$2,1,1)","v":0},{"$f":"OFFSET('Tabla Forrajes'!$A$1,$C5,$J$2,1,1)","v":0},{"$f":"OFFSET('Tabla Forrajes'!$A$1,$C5,$K$2,1,1)","v":0},{"$f":"OFFSET('Tabla Forrajes'!$A$1,$C5,$L$2,1,1)","v":0},{"$f":"OFFSET('Tabla Forrajes'!$A$1,$C5,$M$2,1,1)","v":0},{"$f":"OFFSET('Tabla Forrajes'!$A$1,$C5,$N$2,1,1)","v":0},{"$f":"OFFSET('Tabla Forrajes'!$A$1,$C5,$O$2,1,1)","v":0},{"$f":"OFFSET('Tabla Forrajes'!$A$1,$C5,$P$2,1,1)","v":0},{"$f":"OFFSET('Tabla Forrajes'!$A$1,$C5,$Q$2,1,1)","v":0},{"$f":"OFFSET('Tabla Forrajes'!$A$1,$C5,$R$2,1,1)","v":0},{"$f":"OFFSET('Tabla Forrajes'!$A$1,$C5,$S$2,1,1)","v":0},{"$f":"OFFSET('Tabla Forrajes'!$A$1,$C5,$T$2,1,1)","v":0},{"$f":"OFFSET('Tabla Forrajes'!$A$1,$C5,$U$2,1,1)","v":0},{"$f":"OFFSET('Tabla Forrajes'!$A$1,$C5,$V$2,1,1)","v":0},{"$f":"OFFSET('Tabla Forrajes'!$A$1,$C5,$W$2,1,1)","v":0},{"$f":"OFFSET('Tabla Forrajes'!$A$1,$C5,$X$2,1,1)","v":0},{"$f":"OFFSET('Tabla Forrajes'!$A$1,$C5,$Y$2,1,1)","v":0},{"$f":"OFFSET('Tabla Forrajes'!$A$1,$C5,$Z$2,1,1)","v":0},{"$f":"OFFSET('Tabla Forrajes'!$A$1,$C5,$AA$2,1,1)","v":0},{"$f":"OFFSET('Tabla Forrajes'!$A$1,$C5,$AB$2,1,1)","v":0},{"$f":"OFFSET('Tabla Forrajes'!$A$1,$C5,$AC$2,1,1)","v":0},{"$f":"OFFSET('Tabla Forrajes'!$A$1,$C5,$AD$2,1,1)","v":0},{"$f":"OFFSET('Tabla Forrajes'!$A$1,$C5,$AE$2,1,1)","v":0},{"$f":"OFFSET('Tabla Forrajes'!$A$1,$C5,$AF$2,1,1)","v":0},{"$f":"OFFSET('Tabla Forrajes'!$A$1,$C5,$AG$2,1,1)","v":0},{"$f":"OFFSET('Tabla Forrajes'!$A$1,$C5,$AH$2,1,1)","v":0},{"$f":"OFFSET('Tabla Forrajes'!$A$1,$C5,$AI$2,1,1)","v":0},{"$f":"OFFSET('Tabla Forrajes'!$A$1,$C5,$AJ$2,1,1)","v":0},{"$f":"OFFSET('Tabla Forrajes'!$A$1,$C5,$AK$2,1,1)","v":0},{"$f":"OFFSET('Tabla Forrajes'!$A$1,$C5,$AL$2,1,1)","v":0},{"$f":"OFFSET('Tabla Forrajes'!$A$1,$C5,$AM$2,1,1)","v":0},{"$f":"IF('II_Plantear Ración'!$E6>0,IF(CálculosEV!E5>0,1,\"No\"),\"\")","v":""},{"$f":"IF('II_Plantear Ración'!$E6>0,IF(CálculosEV!F5>0,1,\"No\"),\"\")","v":""},{"$f":"IF('II_Plantear Ración'!$E6>0,IF(CálculosEV!G5>0,1,\"No\"),\"\")","v":""},{"$f":"IF('II_Plantear Ración'!$E6>0,IF(CálculosEV!H5=0,\"No\",1),\"\")","v":""},{"$f":"IF('II_Plantear Ración'!$E6>0,IF(CálculosEV!I5>0,1,\"No\"),\"\")","v":""},{"$f":"IF('II_Plantear Ración'!$E6>0,IF(CálculosEV!J5>0,1,\"No\"),\"\")","v":""},{"$f":"IF('II_Plantear Ración'!$E6>0,IF(CálculosEV!K5>0,1,\"No\"),\"\")","v":""},{"$f":"IF('II_Plantear Ración'!$E6>0,IF(CálculosEV!L5>0,1,\"No\"),\"\")","v":""},{"$f":"IF('II_Plantear Ración'!$E6>0,IF(CálculosEV!M5>0,1,\"No\"),\"\")","v":""},{"$f":"IF('II_Plantear Ración'!$E6>0,IF(CálculosEV!N5>0,1,\"No\"),\"\")","v":""},{"$f":"IF('II_Plantear Ración'!$E6>0,IF(CálculosEV!O5>0,1,\"No\"),\"\")","v":""},{"$f":"IF('II_Plantear Ración'!$E6>0,IF(CálculosEV!P5>0,1,\"No\"),\"\")","v":""},{"$f":"IF('II_Plantear Ración'!$E6>0,IF(CálculosEV!Q5>0,1,\"No\"),\"\")","v":""},{"$f":"IF('II_Plantear Ración'!$E6>0,IF(CálculosEV!R5>0,1,\"No\"),\"\")","v":""},{"$f":"IF('II_Plantear Ración'!$E6>0,IF(CálculosEV!S5>0,1,\"No\"),\"\")","v":""},{"$f":"IF('II_Plantear Ración'!$E6>0,IF(CálculosEV!T5>0,1,\"No\"),\"\")","v":""},{"$f":"IF('II_Plantear Ración'!$E6>0,IF(CálculosEV!U5>0,1,\"No\"),\"\")","v":""},{"$f":"IF('II_Plantear Ración'!$E6>0,IF(CálculosEV!V5>0,1,\"No\"),\"\")","v":""},{"$f":"IF('II_Plantear Ración'!$E6>0,IF(CálculosEV!W5>0,1,\"No\"),\"\")","v":""},{"$f":"IF('II_Plantear Ración'!$E6>0,IF(CálculosEV!X5>0,1,\"No\"),\"\")","v":""},{"$f":"IF('II_Plantear Ración'!$E6>0,IF(CálculosEV!Y5>0,1,\"No\"),\"\")","v":""},{"$f":"IF('II_Plantear Ración'!$E6>0,IF(CálculosEV!Z5>0,1,\"No\"),\"\")","v":""},{"$f":"IF('II_Plantear Ración'!$E6>0,IF(CálculosEV!AA5>0,1,\"No\"),\"\")","v":""},{"$f":"IF('II_Plantear Ración'!$E6>0,IF(CálculosEV!AB5>0,1,\"No\"),\"\")","v":""},{"$f":"IF('II_Plantear Ración'!$E6>0,IF(CálculosEV!AC5>0,1,\"No\"),\"\")","v":""},{"$f":"IF('II_Plantear Ración'!$E6>0,IF(CálculosEV!AD5>0,1,\"No\"),\"\")","v":""},{"$f":"IF('II_Plantear Ración'!$E6>0,IF(CálculosEV!AE5>0,1,\"No\"),\"\")","v":""},{"$f":"IF('II_Plantear Ración'!$E6>0,IF(CálculosEV!AF5>0,1,\"No\"),\"\")","v":""},{"$f":"IF('II_Plantear Ración'!$E6>0,IF(CálculosEV!AG5>0,1,\"No\"),\"\")","v":""},{"$f":"IF('II_Plantear Ración'!$E6>0,IF(CálculosEV!AH5>0,1,\"No\"),\"\")","v":""},{"$f":"IF('II_Plantear Ración'!$E6>0,IF(CálculosEV!AI5>0,1,\"No\"),\"\")","v":""},{"$f":"IF('II_Plantear Ración'!$E6>0,IF(CálculosEV!AJ5>0,1,\"No\"),\"\")","v":""},{"$f":"IF('II_Plantear Ración'!$E6>0,IF(CálculosEV!AK5>0,1,\"No\"),\"\")","v":""},{"$f":"IF('II_Plantear Ración'!$E6>0,IF(CálculosEV!AL5>0,1,\"No\"),\"\")","v":""},{"$f":"IF('II_Plantear Ración'!$E6>0,IF(CálculosEV!AM5>0,1,\"No\"),\"\")","v":""},0,0,0,0,0,0,0,0,0,0,0,0,0,0,0,0,0,0,0,0,0,0,0,0,0,0,0,0,0,0,0,0,0,0,0]
[null,{"$f":"IF(OFFSET('Tabla Forrajes'!$A$1,C6,0,1,1)=0,\"\",OFFSET('Tabla Forrajes'!$A$1,C6,0,1,1))","v":""},1,{"$f":"OFFSET('Tabla Forrajes'!$A$1,$C6,$D$2,1,1)","v":0},{"$f":"OFFSET('Tabla Forrajes'!$A$1,$C6,$E$2,1,1)","v":0},{"$f":"OFFSET('Tabla Forrajes'!$A$1,$C6,$F$2,1,1)","v":0},{"$f":"OFFSET('Tabla Forrajes'!$A$1,$C6,$G$2,1,1)","v":0},{"$f":"OFFSET('Tabla Forrajes'!$A$1,$C6,$H$2,1,1)","v":0},{"$f":"OFFSET('Tabla Forrajes'!$A$1,$C6,$I$2,1,1)","v":0},{"$f":"OFFSET('Tabla Forrajes'!$A$1,$C6,$J$2,1,1)","v":0},{"$f":"OFFSET('Tabla Forrajes'!$A$1,$C6,$K$2,1,1)","v":0},{"$f":"OFFSET('Tabla Forrajes'!$A$1,$C6,$L$2,1,1)","v":0},{"$f":"OFFSET('Tabla Forrajes'!$A$1,$C6,$M$2,1,1)","v":0},{"$f":"OFFSET('Tabla Forrajes'!$A$1,$C6,$N$2,1,1)","v":0},{"$f":"OFFSET('Tabla Forrajes'!$A$1,$C6,$O$2,1,1)","v":0},{"$f":"OFFSET('Tabla Forrajes'!$A$1,$C6,$P$2,1,1)","v":0},{"$f":"OFFSET('Tabla Forrajes'!$A$1,$C6,$Q$2,1,1)","v":0},{"$f":"OFFSET('Tabla Forrajes'!$A$1,$C6,$R$2,1,1)","v":0},{"$f":"OFFSET('Tabla Forrajes'!$A$1,$C6,$S$2,1,1)","v":0},{"$f":"OFFSET('Tabla Forrajes'!$A$1,$C6,$T$2,1,1)","v":0},{"$f":"OFFSET('Tabla Forrajes'!$A$1,$C6,$U$2,1,1)","v":0},{"$f":"OFFSET('Tabla Forrajes'!$A$1,$C6,$V$2,1,1)","v":0},{"$f":"OFFSET('Tabla Forrajes'!$A$1,$C6,$W$2,1,1)","v":0},{"$f":"OFFSET('Tabla Forrajes'!$A$1,$C6,$X$2,1,1)","v":0},{"$f":"OFFSET('Tabla Forrajes'!$A$1,$C6,$Y$2,1,1)","v":0},{"$f":"OFFSET('Tabla Forrajes'!$A$1,$C6,$Z$2,1,1)","v":0},{"$f":"OFFSET('Tabla Forrajes'!$A$1,$C6,$AA$2,1,1)","v":0},{"$f":"OFFSET('Tabla Forrajes'!$A$1,$C6,$AB$2,1,1)","v":0},{"$f":"OFFSET('Tabla Forrajes'!$A$1,$C6,$AC$2,1,1)","v":0},{"$f":"OFFSET('Tabla Forrajes'!$A$1,$C6,$AD$2,1,1)","v":0},{"$f":"OFFSET('Tabla Forrajes'!$A$1,$C6,$AE$2,1,1)","v":0},{"$f":"OFFSET('Tabla Forrajes'!$A$1,$C6,$AF$2,1,1)","v":0},{"$f":"OFFSET('Tabla Forrajes'!$A$1,$C6,$AG$2,1,1)","v":0},{"$f":"OFFSET('Tabla Forrajes'!$A$1,$C6,$AH$2,1,1)","v":0},{"$f":"OFFSET('Tabla Forrajes'!$A$1,$C6,$AI$2,1,1)","v":0},{"$f":"OFFSET('Tabla Forrajes'!$A$1,$C6,$AJ$2,1,1)","v":0},{"$f":"OFFSET('Tabla Forrajes'!$A$1,$C6,$AK$2,1,1)","v":0},{"$f":"OFFSET('Tabla Forrajes'!$A$1,$C6,$AL$2,1,1)","v":0},{"$f":"OFFSET('Tabla Forrajes'!$A$1,$C6,$AM$2,1,1)","v":0},{"$f":"IF('II_Plantear Ración'!$E7>0,IF(CálculosEV!E6>0,1,\"No\"),\"\")","v":""},{"$f":"IF('II_Plantear Ración'!$E7>0,IF(CálculosEV!F6>0,1,\"No\"),\"\")","v":""},{"$f":"IF('II_Plantear Ración'!$E7>0,IF(CálculosEV!G6>0,1,\"No\"),\"\")","v":""},{"$f":"IF('II_Plantear Ración'!$E7>0,IF(CálculosEV!H6=0,\"No\",1),\"\")","v":""},{"$f":"IF('II_Plantear Ración'!$E7>0,IF(CálculosEV!I6>0,1,\"No\"),\"\")","v":""},{"$f":"IF('II_Plantear Ración'!$E7>0,IF(CálculosEV!J6>0,1,\"No\"),\"\")","v":""},{"$f":"IF('II_Plantear Ración'!$E7>0,IF(CálculosEV!K6>0,1,\"No\"),\"\")","v":""},{"$f":"IF('II_Plantear Ración'!$E7>0,IF(CálculosEV!L6>0,1,\"No\"),\"\")","v":""},{"$f":"IF('II_Plantear Ración'!$E7>0,IF(CálculosEV!M6>0,1,\"No\"),\"\")","v":""},{"$f":"IF('II_Plantear Ración'!$E7>0,IF(CálculosEV!N6>0,1,\"No\"),\"\")","v":""},{"$f":"IF('II_Plantear Ración'!$E7>0,IF(CálculosEV!O6>0,1,\"No\"),\"\")","v":""},{"$f":"IF('II_Plantear Ración'!$E7>0,IF(CálculosEV!P6>0,1,\"No\"),\"\")","v":""},{"$f":"IF('II_Plantear Ración'!$E7>0,IF(CálculosEV!Q6>0,1,\"No\"),\"\")","v":""},{"$f":"IF('II_Plantear Ración'!$E7>0,IF(CálculosEV!R6>0,1,\"No\"),\"\")","v":""},{"$f":"IF('II_Plantear Ración'!$E7>0,IF(CálculosEV!S6>0,1,\"No\"),\"\")","v":""},{"$f":"IF('II_Plantear Ración'!$E7>0,IF(CálculosEV!T6>0,1,\"No\"),\"\")","v":""},{"$f":"IF('II_Plantear Ración'!$E7>0,IF(CálculosEV!U6>0,1,\"No\"),\"\")","v":""},{"$f":"IF('II_Plantear Ración'!$E7>0,IF(CálculosEV!V6>0,1,\"No\"),\"\")","v":""},{"$f":"IF('II_Plantear Ración'!$E7>0,IF(CálculosEV!W6>0,1,\"No\"),\"\")","v":""},{"$f":"IF('II_Plantear Ración'!$E7>0,IF(CálculosEV!X6>0,1,\"No\"),\"\")","v":""},{"$f":"IF('II_Plantear Ración'!$E7>0,IF(CálculosEV!Y6>0,1,\"No\"),\"\")","v":""},{"$f":"IF('II_Plantear Ración'!$E7>0,IF(CálculosEV!Z6>0,1,\"No\"),\"\")","v":""},{"$f":"IF('II_Plantear Ración'!$E7>0,IF(CálculosEV!AA6>0,1,\"No\"),\"\")","v":""},{"$f":"IF('II_Plantear Ración'!$E7>0,IF(CálculosEV!AB6>0,1,\"No\"),\"\")","v":""},{"$f":"IF('II_Plantear Ración'!$E7>0,IF(CálculosEV!AC6>0,1,\"No\"),\"\")","v":""},{"$f":"IF('II_Plantear Ración'!$E7>0,IF(CálculosEV!AD6>0,1,\"No\"),\"\")","v":""},{"$f":"IF('II_Plantear Ración'!$E7>0,IF(CálculosEV!AE6>0,1,\"No\"),\"\")","v":""},{"$f":"IF('II_Plantear Ración'!$E7>0,IF(CálculosEV!AF6>0,1,\"No\"),\"\")","v":""},{"$f":"IF('II_Plantear Ración'!$E7>0,IF(CálculosEV!AG6>0,1,\"No\"),\"\")","v":""},{"$f":"IF('II_Plantear Ración'!$E7>0,IF(CálculosEV!AH6>0,1,\"No\"),\"\")","v":""},{"$f":"IF('II_Plantear Ración'!$E7>0,IF(CálculosEV!AI6>0,1,\"No\"),\"\")","v":""},{"$f":"IF('II_Plantear Ración'!$E7>0,IF(CálculosEV!AJ6>0,1,\"No\"),\"\")","v":""},{"$f":"IF('II_Plantear Ración'!$E7>0,IF(CálculosEV!AK6>0,1,\"No\"),\"\")","v":""},{"$f":"IF('II_Plantear Ración'!$E7>0,IF(CálculosEV!AL6>0,1,\"No\"),\"\")","v":""},{"$f":"IF('II_Plantear Ración'!$E7>0,IF(CálculosEV!AM6>0,1,\"No\"),\"\")","v":""},0,0,0,0,0,0,0,0,0,0,0,0,0,0,0,0,0,0,0,0,0,0,0,0,0,0,0,0,0,0,0,0,0,0,0]
[null,{"$f":"IF(OFFSET('Tabla Forrajes'!$A$1,C7,0,1,1)=0,\"\",OFFSET('Tabla Forrajes'!$A$1,C7,0,1,1))","v":""},1,{"$f":"OFFSET('Tabla Forrajes'!$A$1,$C7,$D$2,1,1)","v":0},{"$f":"OFFSET('Tabla Forrajes'!$A$1,$C7,$E$2,1,1)","v":0},{"$f":"OFFSET('Tabla Forrajes'!$A$1,$C7,$F$2,1,1)","v":0},{"$f":"OFFSET('Tabla Forrajes'!$A$1,$C7,$G$2,1,1)","v":0},{"$f":"OFFSET('Tabla Forrajes'!$A$1,$C7,$H$2,1,1)","v":0},{"$f":"OFFSET('Tabla Forrajes'!$A$1,$C7,$I$2,1,1)","v":0},{"$f":"OFFSET('Tabla Forrajes'!$A$1,$C7,$J$2,1,1)","v":0},{"$f":"OFFSET('Tabla Forrajes'!$A$1,$C7,$K$2,1,1)","v":0},{"$f":"OFFSET('Tabla Forrajes'!$A$1,$C7,$L$2,1,1)","v":0},{"$f":"OFFSET('Tabla Forrajes'!$A$1,$C7,$M$2,1,1)","v":0},{"$f":"OFFSET('Tabla Forrajes'!$A$1,$C7,$N$2,1,1)","v":0},{"$f":"OFFSET('Tabla Forrajes'!$A$1,$C7,$O$2,1,1)","v":0},{"$f":"OFFSET('Tabla Forrajes'!$A$1,$C7,$P$2,1,1)","v":0},{"$f":"OFFSET('Tabla Forrajes'!$A$1,$C7,$Q$2,1,1)","v":0},{"$f":"OFFSET('Tabla Forrajes'!$A$1,$C7,$R$2,1,1)","v":0},{"$f":"OFFSET('Tabla Forrajes'!$A$1,$C7,$S$2,1,1)","v":0},{"$f":"OFFSET('Tabla Forrajes'!$A$1,$C7,$T$2,1,1)","v":0},{"$f":"OFFSET('Tabla Forrajes'!$A$1,$C7,$U$2,1,1)","v":0},{"$f":"OFFSET('Tabla Forrajes'!$A$1,$C7,$V$2,1,1)","v":0},{"$f":"OFFSET('Tabla Forrajes'!$A$1,$C7,$W$2,1,1)","v":0},{"$f":"OFFSET('Tabla Forrajes'!$A$1,$C7,$X$2,1,1)","v":0},{"$f":"OFFSET('Tabla Forrajes'!$A$1,$C7,$Y$2,1,1)","v":0},{"$f":"OFFSET('Tabla Forrajes'!$A$1,$C7,$Z$2,1,1)","v":0},{"$f":"OFFSET('Tabla Forrajes'!$A$1,$C7,$AA$2,1,1)","v":0},{"$f":"OFFSET('Tabla Forrajes'!$A$1,$C7,$AB$2,1,1)","v":0},{"$f":"OFFSET('Tabla Forrajes'!$A$1,$C7,$AC$2,1,1)","v":0},{"$f":"OFFSET('Tabla Forrajes'!$A$1,$C7,$AD$2,1,1)","v":0},{"$f":"OFFSET('Tabla Forrajes'!$A$1,$C7,$AE$2,1,1)","v":0},{"$f":"OFFSET('Tabla Forrajes'!$A$1,$C7,$AF$2,1,1)","v":0},{"$f":"OFFSET('Tabla Forrajes'!$A$1,$C7,$AG$2,1,1)","v":0},{"$f":"OFFSET('Tabla Forrajes'!$A$1,$C7,$AH$2,1,1)","v":0},{"$f":"OFFSET('Tabla Forrajes'!$A$1,$C7,$AI$2,1,1)","v":0},{"$f":"OFFSET('Tabla Forrajes'!$A$1,$C7,$AJ$2,1,1)","v":0},{"$f":"OFFSET('Tabla Forrajes'!$A$1,$C7,$AK$2,1,1)","v":0},{"$f":"OFFSET('Tabla Forrajes'!$A$1,$C7,$AL$2,1,1)","v":0},{"$f":"OFFSET('Tabla Forrajes'!$A$1,$C7,$AM$2,1,1)","v":0},{"$f":"IF('II_Plantear Ración'!$E8>0,IF(CálculosEV!E7>0,1,\"No\"),\"\")","v":""},{"$f":"IF('II_Plantear Ración'!$E8>0,IF(CálculosEV!F7>0,1,\"No\"),\"\")","v":""},{"$f":"IF('II_Plantear Ración'!$E8>0,IF(CálculosEV!G7>0,1,\"No\"),\"\")","v":""},{"$f":"IF('II_Plantear Ración'!$E8>0,IF(CálculosEV!H7=0,\"No\",1),\"\")","v":""},{"$f":"IF('II_Plantear Ración'!$E8>0,IF(CálculosEV!I7>0,1,\"No\"),\"\")","v":""},{"$f":"IF('II_Plantear Ración'!$E8>0,IF(CálculosEV!J7>0,1,\"No\"),\"\")","v":""},{"$f":"IF('II_Plantear Ración'!$E8>0,IF(CálculosEV!K7>0,1,\"No\"),\"\")","v":""},{"$f":"IF('II_Plantear Ración'!$E8>0,IF(CálculosEV!L7>0,1,\"No\"),\"\")","v":""},{"$f":"IF('II_Plantear Ración'!$E8>0,IF(CálculosEV!M7>0,1,\"No\"),\"\")","v":""},{"$f":"IF('II_Plantear Ración'!$E8>0,IF(CálculosEV!N7>0,1,\"No\"),\"\")","v":""},{"$f":"IF('II_Plantear Ración'!$E8>0,IF(CálculosEV!O7>0,1,\"No\"),\"\")","v":""},{"$f":"IF('II_Plantear Ración'!$E8>0,IF(CálculosEV!P7>0,1,\"No\"),\"\")","v":""},{"$f":"IF('II_Plantear Ración'!$E8>0,IF(CálculosEV!Q7>0,1,\"No\"),\"\")","v":""},{"$f":"IF('II_Plantear Ración'!$E8>0,IF(CálculosEV!R7>0,1,\"No\"),\"\")","v":""},{"$f":"IF('II_Plantear Ración'!$E8>0,IF(CálculosEV!S7>0,1,\"No\"),\"\")","v":""},{"$f":"IF('II_Plantear Ración'!$E8>0,IF(CálculosEV!T7>0,1,\"No\"),\"\")","v":""},{"$f":"IF('II_Plantear Ración'!$E8>0,IF(CálculosEV!U7>0,1,\"No\"),\"\")","v":""},{"$f":"IF('II_Plantear Ración'!$E8>0,IF(CálculosEV!V7>0,1,\"No\"),\"\")","v":""},{"$f":"IF('II_Plantear Ración'!$E8>0,IF(CálculosEV!W7>0,1,\"No\"),\"\")","v":""},{"$f":"IF('II_Plantear Ración'!$E8>0,IF(CálculosEV!X7>0,1,\"No\"),\"\")","v":""},{"$f":"IF('II_Plantear Ración'!$E8>0,IF(CálculosEV!Y7>0,1,\"No\"),\"\")","v":""},{"$f":"IF('II_Plantear Ración'!$E8>0,IF(CálculosEV!Z7>0,1,\"No\"),\"\")","v":""},{"$f":"IF('II_Plantear Ración'!$E8>0,IF(CálculosEV!AA7>0,1,\"No\"),\"\")","v":""},{"$f":"IF('II_Plantear Ración'!$E8>0,IF(CálculosEV!AB7>0,1,\"No\"),\"\")","v":""},{"$f":"IF('II_Plantear Ración'!$E8>0,IF(CálculosEV!AC7>0,1,\"No\"),\"\")","v":""},{"$f":"IF('II_Plantear Ración'!$E8>0,IF(CálculosEV!AD7>0,1,\"No\"),\"\")","v":""},{"$f":"IF('II_Plantear Ración'!$E8>0,IF(CálculosEV!AE7>0,1,\"No\"),\"\")","v":""},{"$f":"IF('II_Plantear Ración'!$E8>0,IF(CálculosEV!AF7>0,1,\"No\"),\"\")","v":""},{"$f":"IF('II_Plantear Ración'!$E8>0,IF(CálculosEV!AG7>0,1,\"No\"),\"\")","v":""},{"$f":"IF('II_Plantear Ración'!$E8>0,IF(CálculosEV!AH7>0,1,\"No\"),\"\")","v":""},{"$f":"IF('II_Plantear Ración'!$E8>0,IF(CálculosEV!AI7>0,1,\"No\"),\"\")","v":""},{"$f":"IF('II_Plantear Ración'!$E8>0,IF(CálculosEV!AJ7>0,1,\"No\"),\"\")","v":""},{"$f":"IF('II_Plantear Ración'!$E8>0,IF(CálculosEV!AK7>0,1,\"No\"),\"\")","v":""},{"$f":"IF('II_Plantear Ración'!$E8>0,IF(CálculosEV!AL7>0,1,\"No\"),\"\")","v":""},{"$f":"IF('II_Plantear Ración'!$E8>0,IF(CálculosEV!AM7>0,1,\"No\"),\"\")","v":""},0,0,0,0,0,0,0,0,0,0,0,0,0,0,0,0,0,0,0,0,0,0,0,0,0,0,0,0,0,0,0,0,0,0,0]
["CONCENTRATS",{"$f":"IF(OFFSET('Tabla Concentrados'!$A$1,C8,0,1,1)=0,\"\",OFFSET('Tabla Concentrados'!$A$1,C8,0,1,1))","v":""},1,{"$f":"OFFSET('Tabla Concentrados'!$A$1,$C8,$D$2,1,1)","v":0},{"$f":"OFFSET('Tabla Concentrados'!$A$1,$C8,$E$2,1,1)","v":0},{"$f":"OFFSET('Tabla Concentrados'!$A$1,$C8,$F$2,1,1)","v":0},{"$f":"OFFSET('Tabla Concentrados'!$A$1,$C8,$G$2,1,1)","v":0},{"$f":"OFFSET('Tabla Concentrados'!$A$1,$C8,$H$2,1,1)","v":0},{"$f":"OFFSET('Tabla Concentrados'!$A$1,$C8,$I$2,1,1)","v":0},{"$f":"OFFSET('Tabla Concentrados'!$A$1,$C8,$J$2,1,1)","v":0},{"$f":"OFFSET('Tabla Concentrados'!$A$1,$C8,$K$2,1,1)","v":0},{"$f":"OFFSET('Tabla Concentrados'!$A$1,$C8,$L$2,1,1)","v":0},{"$f":"OFFSET('Tabla Concentrados'!$A$1,$C8,$M$2,1,1)","v":0},{"$f":"OFFSET('Tabla Concentrados'!$A$1,$C8,$N$2,1,1)","v":0},{"$f":"OFFSET('Tabla Concentrados'!$A$1,$C8,$O$2,1,1)","v":0},{"$f":"OFFSET('Tabla Concentrados'!$A$1,$C8,$P$2,1,1)","v":0},{"$f":"OFFSET('Tabla Concentrados'!$A$1,$C8,$Q$2,1,1)","v":0},{"$f":"OFFSET('Tabla Concentrados'!$A$1,$C8,$R$2,1,1)","v":0},{"$f":"OFFSET('Tabla Concentrados'!$A$1,$C8,$S$2,1,1)","v":0},{"$f":"OFFSET('Tabla Concentrados'!$A$1,$C8,$T$2,1,1)","v":0},{"$f":"OFFSET('Tabla Concentrados'!$A$1,$C8,$U$2,1,1)","v":0},{"$f":"OFFSET('Tabla Concentrados'!$A$1,$C8,$V$2,1,1)","v":0},{"$f":"OFFSET('Tabla Concentrados'!$A$1,$C8,$W$2,1,1)","v":0},{"$f":"OFFSET('Tabla Concentrados'!$A$1,$C8,$X$2,1,1)","v":0},{"$f":"OFFSET('Tabla Concentrados'!$A$1,$C8,$Y$2,1,1)","v":0},{"$f":"OFFSET('Tabla Concentrados'!$A$1,$C8,$Z$2,1,1)","v":0},{"$f":"OFFSET('Tabla Concentrados'!$A$1,$C8,$AA$2,1,1)","v":0},{"$f":"OFFSET('Tabla Concentrados'!$A$1,$C8,$AB$2,1,1)","v":0},{"$f":"OFFSET('Tabla Concentrados'!$A$1,$C8,$AC$2,1,1)","v":0},{"$f":"OFFSET('Tabla Concentrados'!$A$1,$C8,$AD$2,1,1)","v":0},{"$f":"OFFSET('Tabla Concentrados'!$A$1,$C8,$AE$2,1,1)","v":0},{"$f":"OFFSET('Tabla Concentrados'!$A$1,$C8,$AF$2,1,1)","v":0},{"$f":"OFFSET('Tabla Concentrados'!$A$1,$C8,$AG$2,1,1)","v":0},{"$f":"OFFSET('Tabla Concentrados'!$A$1,$C8,$AH$2,1,1)","v":0},{"$f":"OFFSET('Tabla Concentrados'!$A$1,$C8,$AI$2,1,1)","v":0},{"$f":"OFFSET('Tabla Concentrados'!$A$1,$C8,$AJ$2,1,1)","v":0},{"$f":"OFFSET('Tabla Concentrados'!$A$1,$C8,$AK$2,1,1)","v":0},{"$f":"OFFSET('Tabla Concentrados'!$A$1,$C8,$AL$2,1,1)","v":0},{"$f":"OFFSET('Tabla Concentrados'!$A$1,$C8,$AM$2,1,1)","v":0},{"$f":"IF('II_Plantear Ración'!$E9>0,IF(CálculosEV!E8>=0,1,\"No\"),\"\")","v":""},{"$f":"IF('II_Plantear Ración'!$E9>0,IF(CálculosEV!F8>0,1,\"No\"),\"\")","v":""},{"$f":"IF('II_Plantear Ración'!$E9>0,IF(CálculosEV!G8>0,1,\"No\"),\"\")","v":""},{"$f":"IF('II_Plantear Ración'!$E9>0,IF(CálculosEV!H8=0,\"No\",1),\"\")","v":""},{"$f":"IF('II_Plantear Ración'!$E9>0,IF(CálculosEV!I8>0,1,\"No\"),\"\")","v":""},{"$f":"IF('II_Plantear Ración'!$E9>0,IF(CálculosEV!J8>0,1,\"No\"),\"\")","v":""},{"$f":"IF('II_Plantear Ración'!$E9>0,IF(CálculosEV!K8>0,1,\"No\"),\"\")","v":""},{"$f":"IF('II_Plantear Ración'!$E9>0,IF(CálculosEV!L8>0,1,\"No\"),\"\")","v":""},{"$f":"IF('II_Plantear Ración'!$E9>0,IF(CálculosEV!M8>0,1,\"No\"),\"\")","v":""},{"$f":"IF('II_Plantear Ración'!$E9>0,IF(CálculosEV!N8>0,1,\"No\"),\"\")","v":""},{"$f":"IF('II_Plantear Ración'!$E9>0,IF(CálculosEV!O8>0,1,\"No\"),\"\")","v":""},{"$f":"IF('II_Plantear Ración'!$E9>0,IF(CálculosEV!P8>0,1,\"No\"),\"\")","v":""},{"$f":"IF('II_Plantear Ración'!$E9>0,IF(CálculosEV!Q8>0,1,\"No\"),\"\")","v":""},{"$f":"IF('II_Plantear Ración'!$E9>0,IF(CálculosEV!R8>0,1,\"No\"),\"\")","v":""},{"$f":"IF('II_Plantear Ración'!$E9>0,IF(CálculosEV!S8>0,1,\"No\"),\"\")","v":""},{"$f":"IF('II_Plantear Ración'!$E9>0,IF(CálculosEV!T8>0,1,\"No\"),\"\")","v":""},{"$f":"IF('II_Plantear Ración'!$E9>0,IF(CálculosEV!U8>0,1,\"No\"),\"\")","v":""},{"$f":"IF('II_Plantear Ración'!$E9>0,IF(CálculosEV!V8>0,1,\"No\"),\"\")","v":""},{"$f":"IF('II_Plantear Ración'!$E9>0,IF(CálculosEV!W8>0,1,\"No\"),\"\")","v":""},{"$f":"IF('II_Plantear Ración'!$E9>0,IF(CálculosEV!X8>0,1,\"No\"),\"\")","v":""},{"$f":"IF('II_Plantear Ración'!$E9>0,IF(CálculosEV!Y8>0,1,\"No\"),\"\")","v":""},{"$f":"IF('II_Plantear Ración'!$E9>0,IF(CálculosEV!Z8>0,1,\"No\"),\"\")","v":""},{"$f":"IF('II_Plantear Ración'!$E9>0,IF(CálculosEV!AA8>0,1,\"No\"),\"\")","v":""},{"$f":"IF('II_Plantear Ración'!$E9>0,IF(CálculosEV!AB8>0,1,\"No\"),\"\")","v":""},{"$f":"IF('II_Plantear Ración'!$E9>0,IF(CálculosEV!AC8>0,1,\"No\"),\"\")","v":""},{"$f":"IF('II_Plantear Ración'!$E9>0,IF(CálculosEV!AD8>0,1,\"No\"),\"\")","v":""},{"$f":"IF('II_Plantear Ración'!$E9>0,IF(CálculosEV!AE8>0,1,\"No\"),\"\")","v":""},{"$f":"IF('II_Plantear Ración'!$E9>0,IF(CálculosEV!AF8>0,1,\"No\"),\"\")","v":""},{"$f":"IF('II_Plantear Ración'!$E9>0,IF(CálculosEV!AG8>0,1,\"No\"),\"\")","v":""},{"$f":"IF('II_Plantear Ración'!$E9>0,IF(CálculosEV!AH8>0,1,\"No\"),\"\")","v":""},{"$f":"IF('II_Plantear Ración'!$E9>0,IF(CálculosEV!AI8>0,1,\"No\"),\"\")","v":""},{"$f":"IF('II_Plantear Ración'!$E9>0,IF(CálculosEV!AJ8>0,1,\"No\"),\"\")","v":""},{"$f":"IF('II_Plantear Ración'!$E9>0,IF(CálculosEV!AK8>0,1,\"No\"),\"\")","v":""},{"$f":"IF('II_Plantear Ración'!$E9>0,IF(CálculosEV!AL8>0,1,\"No\"),\"\")","v":""},{"$f":"IF('II_Plantear Ración'!$E9>0,IF(CálculosEV!AM8>0,1,\"No\"),\"\")","v":""},0,0,0,0,0,0,0,0,0,0,0,0,0,0,0,0,0,0,0,0,0,0,0,0,0,0,0,0,0,0,0,0,0,0,0]
[null,{"$f":"IF(OFFSET('Tabla Concentrados'!$A$1,C9,0,1,1)=0,\"\",OFFSET('Tabla Concentrados'!$A$1,C9,0,1,1))","v":"Cebada grano"},2,{"$f":"OFFSET('Tabla Concentrados'!$A$1,$C9,$D$2,1,1)","v":88.8},{"$f":"OFFSET('Tabla Concentrados'!$A$1,$C9,$E$2,1,1)","v":0},{"$f":"OFFSET('Tabla Concentrados'!$A$1,$C9,$F$2,1,1)","v":1.0789699893040996},{"$f":"OFFSET('Tabla Concentrados'!$A$1,$C9,$G$2,1,1)","v":89.462201893951999},{"$f":"OFFSET('Tabla Concentrados'!$A$1,$C9,$H$2,1,1)","v":-31.347374120000008},{"$f":"OFFSET('Tabla Concentrados'!$A$1,$C9,$I$2,1,1)","v":2},{"$f":"OFFSET('Tabla Concentrados'!$A$1,$C9,$J$2,1,1)","v":0.44000000000000006},{"$f":"OFFSET('Tabla Concentrados'!$A$1,$C9,$K$2,1,1)","v":2.964},{"$f":"OFFSET('Tabla Concentrados'!$A$1,$C9,$L$2,1,1)","v":1.3},{"$f":"OFFSET('Tabla Concentrados'!$A$1,$C9,$M$2,1,1)","v":5.55},{"$f":"OFFSET('Tabla Concentrados'!$A$1,$C9,$N$2,1,1)","v":0.35},{"$f":"OFFSET('Tabla Concentrados'!$A$1,$C9,$O$2,1,1)","v":0},{"$f":"OFFSET('Tabla Concentrados'!$A$1,$C9,$P$2,1,1)","v":0},{"$f":"OFFSET('Tabla Concentrados'!$A$1,$C9,$Q$2,1,1)","v":0.01},{"$f":"OFFSET('Tabla Concentrados'!$A$1,$C9,$R$2,1,1)","v":4.0999999999999996},{"$f":"OFFSET('Tabla Concentrados'!$A$1,$C9,$S$2,1,1)","v":17.600000000000001},{"$f":"OFFSET('Tabla Concentrados'!$A$1,$C9,$T$2,1,1)","v":24.4},{"$f":"OFFSET('Tabla Concentrados'!$A$1,$C9,$U$2,1,1)","v":0},{"$f":"OFFSET('Tabla Concentrados'!$A$1,$C9,$V$2,1,1)","v":0.02},{"$f":"OFFSET('Tabla Concentrados'!$A$1,$C9,$W$2,1,1)","v":1000},{"$f":"OFFSET('Tabla Concentrados'!$A$1,$C9,$X$2,1,1)","v":0},{"$f":"OFFSET('Tabla Concentrados'!$A$1,$C9,$Y$2,1,1)","v":25},{"$f":"OFFSET('Tabla Concentrados'!$A$1,$C9,$Z$2,1,1)","v":14.25},{"$f":"OFFSET('Tabla Concentrados'!$A$1,$C9,$AA$2,1,1)","v":112},{"$f":"OFFSET('Tabla Concentrados'!$A$1,$C9,$AB$2,1,1)","v":27.595082457151996},{"$f":"OFFSET('Tabla Concentrados'!$A$1,$C9,$AC$2,1,1)","v":0.83732799999999996},{"$f":"OFFSET('Tabla Concentrados'!$A$1,$C9,$AD$2,1,1)","v":816.39479999999992},{"$f":"OFFSET('Tabla Concentrados'!$A$1,$C9,$AE$2,1,1)","v":19},{"$f":"OFFSET('Tabla Concentrados'!$A$1,$C9,$AF$2,1,1)","v":54},{"$f":"OFFSET('Tabla Concentrados'!$A$1,$C9,$AG$2,1,1)","v":215},{"$f":"OFFSET('Tabla Concentrados'!$A$1,$C9,$AH$2,1,1)","v":65},{"$f":"OFFSET('Tabla Concentrados'!$A$1,$C9,$AI$2,1,1)","v":12},{"$f":"OFFSET('Tabla Concentrados'!$A$1,$C9,$AJ$2,1,1)","v":25},{"$f":"OFFSET('Tabla Concentrados'!$A$1,$C9,$AK$2,1,1)","v":0.3},{"$f":"OFFSET('Tabla Concentrados'!$A$1,$C9,$AL$2,1,1)","v":0.73492599485689536},{"$f":"OFFSET('Tabla Concentrados'!$A$1,$C9,$AM$2,1,1)","v":596.08337706731925},{"$f":"IF('II_Plantear Ración'!$E10>0,IF(CálculosEV!E9>=0,1,\"No\"),\"\")","v":1},{"$f":"IF('II_Plantear Ración'!$E10>0,IF(CálculosEV!F9>0,1,\"No\"),\"\")","v":1},{"$f":"IF('II_Plantear Ración'!$E10>0,IF(CálculosEV!G9>0,1,\"No\"),\"\")","v":1},{"$f":"IF('II_Plantear Ración'!$E10>0,IF(CálculosEV!H9=0,\"No\",1),\"\")","v":1},{"$f":"IF('II_Plantear Ración'!$E10>0,IF(CálculosEV!I9>0,1,\"No\"),\"\")","v":1},{"$f":"IF('II_Plantear Ración'!$E10>0,IF(CálculosEV!J9>0,1,\"No\"),\"\")","v":1},{"$f":"IF('II_Plantear Ración'!$E10>0,IF(CálculosEV!K9>0,1,\"No\"),\"\")","v":1},{"$f":"IF('II_Plantear Ración'!$E10>0,IF(CálculosEV!L9>0,1,\"No\"),\"\")","v":1},{"$f":"IF('II_Plantear Ración'!$E10>0,IF(CálculosEV!M9>0,1,\"No\"),\"\")","v":1},{"$f":"IF('II_Plantear Ración'!$E10>0,IF(CálculosEV!N9>0,1,\"No\"),\"\")","v":1},{"$f":"IF('II_Plantear Ración'!$E10>0,IF(CálculosEV!O9>0,1,\"No\"),\"\")","v":"No"},{"$f":"IF('II_Plantear Ración'!$E10>0,IF(CálculosEV!P9>0,1,\"No\"),\"\")","v":"No"},{"$f":"IF('II_Plantear Ración'!$E10>0,IF(CálculosEV!Q9>0,1,\"No\"),\"\")","v":1},{"$f":"IF('II_Plantear Ración'!$E10>0,IF(CálculosEV!R9>0,1,\"No\"),\"\")","v":1},{"$f":"IF('II_Plantear Ración'!$E10>0,IF(CálculosEV!S9>0,1,\"No\"),\"\")","v":1},{"$f":"IF('II_Plantear Ración'!$E10>0,IF(CálculosEV!T9>0,1,\"No\"),\"\")","v":1},{"$f":"IF('II_Plantear Ración'!$E10>0,IF(CálculosEV!U9>0,1,\"No\"),\"\")","v":"No"},{"$f":"IF('II_Plantear Ración'!$E10>0,IF(CálculosEV!V9>0,1,\"No\"),\"\")","v":1},{"$f":"IF('II_Plantear Ración'!$E10>0,IF(CálculosEV!W9>0,1,\"No\"),\"\")","v":1},{"$f":"IF('II_Plantear Ración'!$E10>0,IF(CálculosEV!X9>0,1,\"No\"),\"\")","v":"No"},{"$f":"IF('II_Plantear Ración'!$E10>0,IF(CálculosEV!Y9>0,1,\"No\"),\"\")","v":1},{"$f":"IF('II_Plantear Ración'!$E10>0,IF(CálculosEV!Z9>0,1,\"No\"),\"\")","v":1},{"$f":"IF('II_Plantear Ración'!$E10>0,IF(CálculosEV!AA9>0,1,\"No\"),\"\")","v":1},{"$f":"IF('II_Plantear Ración'!$E10>0,IF(CálculosEV!AB9>0,1,\"No\"),\"\")","v":1},{"$f":"IF('II_Plantear Ración'!$E10>0,IF(CálculosEV!AC9>0,1,\"No\"),\"\")","v":1},{"$f":"IF('II_Plantear Ración'!$E10>0,IF(CálculosEV!AD9>0,1,\"No\"),\"\")","v":1},{"$f":"IF('II_Plantear Ración'!$E10>0,IF(CálculosEV!AE9>0,1,\"No\"),\"\")","v":1},{"$f":"IF('II_Plantear Ración'!$E10>0,IF(CálculosEV!AF9>0,1,\"No\"),\"\")","v":1},{"$f":"IF('II_Plantear Ración'!$E10>0,IF(CálculosEV!AG9>0,1,\"No\"),\"\")","v":1},{"$f":"IF('II_Plantear Ración'!$E10>0,IF(CálculosEV!AH9>0,1,\"No\"),\"\")","v":1},{"$f":"IF('II_Plantear Ración'!$E10>0,IF(CálculosEV!AI9>0,1,\"No\"),\"\")","v":1},{"$f":"IF('II_Plantear Ración'!$E10>0,IF(CálculosEV!AJ9>0,1,\"No\"),\"\")","v":1},{"$f":"IF('II_Plantear Ración'!$E10>0,IF(CálculosEV!AK9>0,1,\"No\"),\"\")","v":1},{"$f":"IF('II_Plantear Ración'!$E10>0,IF(CálculosEV!AL9>0,1,\"No\"),\"\")","v":1},{"$f":"IF('II_Plantear Ración'!$E10>0,IF(CálculosEV!AM9>0,1,\"No\"),\"\")","v":1},1,1,1,1,1,1,1,1,1,1,1,1,1,1,1,1,1,1,1,1,1,1,1,1,1,1,1,1,1,1,1,1,1,1,1]
[null,{"$f":"IF(OFFSET('Tabla Concentrados'!$A$1,C10,0,1,1)=0,\"\",OFFSET('Tabla Concentrados'!$A$1,C10,0,1,1))","v":"Colza, turtó"},32,{"$f":"OFFSET('Tabla Concentrados'!$A$1,$C10,$D$2,1,1)","v":90},{"$f":"OFFSET('Tabla Concentrados'!$A$1,$C10,$E$2,1,1)","v":0},{"$f":"OFFSET('Tabla Concentrados'!$A$1,$C10,$F$2,1,1)","v":0.95800502495921236},{"$f":"OFFSET('Tabla Concentrados'!$A$1,$C10,$G$2,1,1)","v":155.86270835653204},{"$f":"OFFSET('Tabla Concentrados'!$A$1,$C10,$H$2,1,1)","v":193.04700397999994},{"$f":"OFFSET('Tabla Concentrados'!$A$1,$C10,$I$2,1,1)","v":2},{"$f":"OFFSET('Tabla Concentrados'!$A$1,$C10,$J$2,1,1)","v":4.620000000000001},{"$f":"OFFSET('Tabla Concentrados'!$A$1,$C10,$K$2,1,1)","v":8.8040000000000003},{"$f":"OFFSET('Tabla Concentrados'!$A$1,$C10,$L$2,1,1)","v":5.15},{"$f":"OFFSET('Tabla Concentrados'!$A$1,$C10,$M$2,1,1)","v":12.4},{"$f":"OFFSET('Tabla Concentrados'!$A$1,$C10,$N$2,1,1)","v":0.75},{"$f":"OFFSET('Tabla Concentrados'!$A$1,$C10,$O$2,1,1)","v":0},{"$f":"OFFSET('Tabla Concentrados'!$A$1,$C10,$P$2,1,1)","v":0},{"$f":"OFFSET('Tabla Concentrados'!$A$1,$C10,$Q$2,1,1)","v":0.1},{"$f":"OFFSET('Tabla Concentrados'!$A$1,$C10,$R$2,1,1)","v":5.5},{"$f":"OFFSET('Tabla Concentrados'!$A$1,$C10,$S$2,1,1)","v":63.5},{"$f":"OFFSET('Tabla Concentrados'!$A$1,$C10,$T$2,1,1)","v":64.5},{"$f":"OFFSET('Tabla Concentrados'!$A$1,$C10,$U$2,1,1)","v":0},{"$f":"OFFSET('Tabla Concentrados'!$A$1,$C10,$V$2,1,1)","v":7.0000000000000007E-2},{"$f":"OFFSET('Tabla Concentrados'!$A$1,$C10,$W$2,1,1)","v":0},{"$f":"OFFSET('Tabla Concentrados'!$A$1,$C10,$X$2,1,1)","v":0},{"$f":"OFFSET('Tabla Concentrados'!$A$1,$C10,$Y$2,1,1)","v":20},{"$f":"OFFSET('Tabla Concentrados'!$A$1,$C10,$Z$2,1,1)","v":20.8},{"$f":"OFFSET('Tabla Concentrados'!$A$1,$C10,$AA$2,1,1)","v":418},{"$f":"OFFSET('Tabla Concentrados'!$A$1,$C10,$AB$2,1,1)","v":103.91199090373202},{"$f":"OFFSET('Tabla Concentrados'!$A$1,$C10,$AC$2,1,1)","v":0.78420000000000001},{"$f":"OFFSET('Tabla Concentrados'!$A$1,$C10,$AD$2,1,1)","v":704.99580000000014},{"$f":"OFFSET('Tabla Concentrados'!$A$1,$C10,$AE$2,1,1)","v":26},{"$f":"OFFSET('Tabla Concentrados'!$A$1,$C10,$AF$2,1,1)","v":120},{"$f":"OFFSET('Tabla Concentrados'!$A$1,$C10,$AG$2,1,1)","v":287},{"$f":"OFFSET('Tabla Concentrados'!$A$1,$C10,$AH$2,1,1)","v":182},{"$f":"OFFSET('Tabla Concentrados'!$A$1,$C10,$AI$2,1,1)","v":74},{"$f":"OFFSET('Tabla Concentrados'!$A$1,$C10,$AJ$2,1,1)","v":101},{"$f":"OFFSET('Tabla Concentrados'!$A$1,$C10,$AK$2,1,1)","v":0.5},{"$f":"OFFSET('Tabla Concentrados'!$A$1,$C10,$AL$2,1,1)","v":0.72777380875241571},{"$f":"OFFSET('Tabla Concentrados'!$A$1,$C10,$AM$2,1,1)","v":325.12141598538869},{"$f":"IF('II_Plantear Ración'!$E11>0,IF(CálculosEV!E10>=0,1,\"No\"),\"\")","v":""},{"$f":"IF('II_Plantear Ración'!$E11>0,IF(CálculosEV!F10>0,1,\"No\"),\"\")","v":""},{"$f":"IF('II_Plantear Ración'!$E11>0,IF(CálculosEV!G10>0,1,\"No\"),\"\")","v":""},{"$f":"IF('II_Plantear Ración'!$E11>0,IF(CálculosEV!H10=0,\"No\",1),\"\")","v":""},{"$f":"IF('II_Plantear Ración'!$E11>0,IF(CálculosEV!I10>0,1,\"No\"),\"\")","v":""},{"$f":"IF('II_Plantear Ración'!$E11>0,IF(CálculosEV!J10>0,1,\"No\"),\"\")","v":""},{"$f":"IF('II_Plantear Ración'!$E11>0,IF(CálculosEV!K10>0,1,\"No\"),\"\")","v":""},{"$f":"IF('II_Plantear Ración'!$E11>0,IF(CálculosEV!L10>0,1,\"No\"),\"\")","v":""},{"$f":"IF('II_Plantear Ración'!$E11>0,IF(CálculosEV!M10>0,1,\"No\"),\"\")","v":""},{"$f":"IF('II_Plantear Ración'!$E11>0,IF(CálculosEV!N10>0,1,\"No\"),\"\")","v":""},{"$f":"IF('II_Plantear Ración'!$E11>0,IF(CálculosEV!O10>0,1,\"No\"),\"\")","v":""},{"$f":"IF('II_Plantear Ración'!$E11>0,IF(CálculosEV!P10>0,1,\"No\"),\"\")","v":""},{"$f":"IF('II_Plantear Ración'!$E11>0,IF(CálculosEV!Q10>0,1,\"No\"),\"\")","v":""},{"$f":"IF('II_Plantear Ración'!$E11>0,IF(CálculosEV!R10>0,1,\"No\"),\"\")","v":""},{"$f":"IF('II_Plantear Ración'!$E11>0,IF(CálculosEV!S10>0,1,\"No\"),\"\")","v":""},{"$f":"IF('II_Plantear Ración'!$E11>0,IF(CálculosEV!T10>0,1,\"No\"),\"\")","v":""},{"$f":"IF('II_Plantear Ración'!$E11>0,IF(CálculosEV!U10>0,1,\"No\"),\"\")","v":""},{"$f":"IF('II_Plantear Ración'!$E11>0,IF(CálculosEV!V10>0,1,\"No\"),\"\")","v":""},{"$f":"IF('II_Plantear Ración'!$E11>0,IF(CálculosEV!W10>0,1,\"No\"),\"\")","v":""},{"$f":"IF('II_Plantear Ración'!$E11>0,IF(CálculosEV!X10>0,1,\"No\"),\"\")","v":""},{"$f":"IF('II_Plantear Ración'!$E11>0,IF(CálculosEV!Y10>0,1,\"No\"),\"\")","v":""},{"$f":"IF('II_Plantear Ración'!$E11>0,IF(CálculosEV!Z10>0,1,\"No\"),\"\")","v":""},{"$f":"IF('II_Plantear Ración'!$E11>0,IF(CálculosEV!AA10>0,1,\"No\"),\"\")","v":""},{"$f":"IF('II_Plantear Ración'!$E11>0,IF(CálculosEV!AB10>0,1,\"No\"),\"\")","v":""},{"$f":"IF('II_Plantear Ración'!$E11>0,IF(CálculosEV!AC10>0,1,\"No\"),\"\")","v":""},{"$f":"IF('II_Plantear Ración'!$E11>0,IF(CálculosEV!AD10>0,1,\"No\"),\"\")","v":""},{"$f":"IF('II_Plantear Ración'!$E11>0,IF(CálculosEV!AE10>0,1,\"No\"),\"\")","v":""},{"$f":"IF('II_Plantear Ración'!$E11>0,IF(CálculosEV!AF10>0,1,\"No\"),\"\")","v":""},{"$f":"IF('II_Plantear Ración'!$E11>0,IF(CálculosEV!AG10>0,1,\"No\"),\"\")","v":""},{"$f":"IF('II_Plantear Ración'!$E11>0,IF(CálculosEV!AH10>0,1,\"No\"),\"\")","v":""},{"$f":"IF('II_Plantear Ración'!$E11>0,IF(CálculosEV!AI10>0,1,\"No\"),\"\")","v":""},{"$f":"IF('II_Plantear Ración'!$E11>0,IF(CálculosEV!AJ10>0,1,\"No\"),\"\")","v":""},{"$f":"IF('II_Plantear Ración'!$E11>0,IF(CálculosEV!AK10>0,1,\"No\"),\"\")","v":""},{"$f":"IF('II_Plantear Ración'!$E11>0,IF(CálculosEV!AL10>0,1,\"No\"),\"\")","v":""},{"$f":"IF('II_Plantear Ración'!$E11>0,IF(CálculosEV!AM10>0,1,\"No\"),\"\")","v":""},0,0,0,0,0,0,0,0,0,0,0,0,0,0,0,0,0,0,0,0,0,0,0,0,0,0,0,0,0,0,0,0,0,0,0]
[null,{"$f":"IF(OFFSET('Tabla Concentrados'!$A$1,C11,0,1,1)=0,\"\",OFFSET('Tabla Concentrados'!$A$1,C11,0,1,1))","v":"Maíz grano"},3,{"$f":"OFFSET('Tabla Concentrados'!$A$1,$C11,$D$2,1,1)","v":86},{"$f":"OFFSET('Tabla Concentrados'!$A$1,$C11,$E$2,1,1)","v":0},{"$f":"OFFSET('Tabla Concentrados'!$A$1,$C11,$F$2,1,1)","v":1.2447554097468898},{"$f":"OFFSET('Tabla Concentrados'!$A$1,$C11,$G$2,1,1)","v":94},{"$f":"OFFSET('Tabla Concentrados'!$A$1,$C11,$H$2,1,1)","v":-53},{"$f":"OFFSET('Tabla Concentrados'!$A$1,$C11,$I$2,1,1)","v":2},{"$f":"OFFSET('Tabla Concentrados'!$A$1,$C11,$J$2,1,1)","v":0.27500000000000002},{"$f":"OFFSET('Tabla Concentrados'!$A$1,$C11,$K$2,1,1)","v":2.1749999999999998},{"$f":"OFFSET('Tabla Concentrados'!$A$1,$C11,$L$2,1,1)","v":1.4},{"$f":"OFFSET('Tabla Concentrados'!$A$1,$C11,$M$2,1,1)","v":3.6},{"$f":"OFFSET('Tabla Concentrados'!$A$1,$C11,$N$2,1,1)","v":0.33},{"$f":"OFFSET('Tabla Concentrados'!$A$1,$C11,$O$2,1,1)","v":0},{"$f":"OFFSET('Tabla Concentrados'!$A$1,$C11,$P$2,1,1)","v":0},{"$f":"OFFSET('Tabla Concentrados'!$A$1,$C11,$Q$2,1,1)","v":0.02},{"$f":"OFFSET('Tabla Concentrados'!$A$1,$C11,$R$2,1,1)","v":2.2999999999999998},{"$f":"OFFSET('Tabla Concentrados'!$A$1,$C11,$S$2,1,1)","v":10.8},{"$f":"OFFSET('Tabla Concentrados'!$A$1,$C11,$T$2,1,1)","v":21.4},{"$f":"OFFSET('Tabla Concentrados'!$A$1,$C11,$U$2,1,1)","v":0},{"$f":"OFFSET('Tabla Concentrados'!$A$1,$C11,$V$2,1,1)","v":0.02},{"$f":"OFFSET('Tabla Concentrados'!$A$1,$C11,$W$2,1,1)","v":0},{"$f":"OFFSET('Tabla Concentrados'!$A$1,$C11,$X$2,1,1)","v":0},{"$f":"OFFSET('Tabla Concentrados'!$A$1,$C11,$Y$2,1,1)","v":0},{"$f":"OFFSET('Tabla Concentrados'!$A$1,$C11,$Z$2,1,1)","v":36.549999999999997},{"$f":"OFFSET('Tabla Concentrados'!$A$1,$C11,$AA$2,1,1)","v":89},{"$f":"OFFSET('Tabla Concentrados'!$A$1,$C11,$AB$2,1,1)","v":43},{"$f":"OFFSET('Tabla Concentrados'!$A$1,$C11,$AC$2,1,1)","v":0.88284600000000013},{"$f":"OFFSET('Tabla Concentrados'!$A$1,$C11,$AD$2,1,1)","v":870.48615600000005},{"$f":"OFFSET('Tabla Concentrados'!$A$1,$C11,$AE$2,1,1)","v":43},{"$f":"OFFSET('Tabla Concentrados'!$A$1,$C11,$AF$2,1,1)","v":26},{"$f":"OFFSET('Tabla Concentrados'!$A$1,$C11,$AG$2,1,1)","v":125},{"$f":"OFFSET('Tabla Concentrados'!$A$1,$C11,$AH$2,1,1)","v":31},{"$f":"OFFSET('Tabla Concentrados'!$A$1,$C11,$AI$2,1,1)","v":60},{"$f":"OFFSET('Tabla Concentrados'!$A$1,$C11,$AJ$2,1,1)","v":14},{"$f":"OFFSET('Tabla Concentrados'!$A$1,$C11,$AK$2,1,1)","v":0.3},{"$f":"OFFSET('Tabla Concentrados'!$A$1,$C11,$AL$2,1,1)","v":0.44657089748905021},{"$f":"OFFSET('Tabla Concentrados'!$A$1,$C11,$AM$2,1,1)","v":780.90364228385977},{"$f":"IF('II_Plantear Ración'!$E12>0,IF(CálculosEV!E11>=0,1,\"No\"),\"\")","v":""},{"$f":"IF('II_Plantear Ración'!$E12>0,IF(CálculosEV!F11>0,1,\"No\"),\"\")","v":""},{"$f":"IF('II_Plantear Ración'!$E12>0,IF(CálculosEV!G11>0,1,\"No\"),\"\")","v":""},{"$f":"IF('II_Plantear Ración'!$E12>0,IF(CálculosEV!H11=0,\"No\",1),\"\")","v":""},{"$f":"IF('II_Plantear Ración'!$E12>0,IF(CálculosEV!I11>0,1,\"No\"),\"\")","v":""},{"$f":"IF('II_Plantear Ración'!$E12>0,IF(CálculosEV!J11>0,1,\"No\"),\"\")","v":""},{"$f":"IF('II_Plantear Ración'!$E12>0,IF(CálculosEV!K11>0,1,\"No\"),\"\")","v":""},{"$f":"IF('II_Plantear Ración'!$E12>0,IF(CálculosEV!L11>0,1,\"No\"),\"\")","v":""},{"$f":"IF('II_Plantear Ración'!$E12>0,IF(CálculosEV!M11>0,1,\"No\"),\"\")","v":""},{"$f":"IF('II_Plantear Ración'!$E12>0,IF(CálculosEV!N11>0,1,\"No\"),\"\")","v":""},{"$f":"IF('II_Plantear Ración'!$E12>0,IF(CálculosEV!O11>0,1,\"No\"),\"\")","v":""},{"$f":"IF('II_Plantear Ración'!$E12>0,IF(CálculosEV!P11>0,1,\"No\"),\"\")","v":""},{"$f":"IF('II_Plantear Ración'!$E12>0,IF(CálculosEV!Q11>0,1,\"No\"),\"\")","v":""},{"$f":"IF('II_Plantear Ración'!$E12>0,IF(CálculosEV!R11>0,1,\"No\"),\"\")","v":""},{"$f":"IF('II_Plantear Ración'!$E12>0,IF(CálculosEV!S11>0,1,\"No\"),\"\")","v":""},{"$f":"IF('II_Plantear Ración'!$E12>0,IF(CálculosEV!T11>0,1,\"No\"),\"\")","v":""},{"$f":"IF('II_Plantear Ración'!$E12>0,IF(CálculosEV!U11>0,1,\"No\"),\"\")","v":""},{"$f":"IF('II_Plantear Ración'!$E12>0,IF(CálculosEV!V11>0,1,\"No\"),\"\")","v":""},{"$f":"IF('II_Plantear Ración'!$E12>0,IF(CálculosEV!W11>0,1,\"No\"),\"\")","v":""},{"$f":"IF('II_Plantear Ración'!$E12>0,IF(CálculosEV!X11>0,1,\"No\"),\"\")","v":""},{"$f":"IF('II_Plantear Ración'!$E12>0,IF(CálculosEV!Y11>0,1,\"No\"),\"\")","v":""},{"$f":"IF('II_Plantear Ración'!$E12>0,IF(CálculosEV!Z11>0,1,\"No\"),\"\")","v":""},{"$f":"IF('II_Plantear Ración'!$E12>0,IF(CálculosEV!AA11>0,1,\"No\"),\"\")","v":""},{"$f":"IF('II_Plantear Ración'!$E12>0,IF(CálculosEV!AB11>0,1,\"No\"),\"\")","v":""},{"$f":"IF('II_Plantear Ración'!$E12>0,IF(CálculosEV!AC11>0,1,\"No\"),\"\")","v":""},{"$f":"IF('II_Plantear Ración'!$E12>0,IF(CálculosEV!AD11>0,1,\"No\"),\"\")","v":""},{"$f":"IF('II_Plantear Ración'!$E12>0,IF(CálculosEV!AE11>0,1,\"No\"),\"\")","v":""},{"$f":"IF('II_Plantear Ración'!$E12>0,IF(CálculosEV!AF11>0,1,\"No\"),\"\")","v":""},{"$f":"IF('II_Plantear Ración'!$E12>0,IF(CálculosEV!AG11>0,1,\"No\"),\"\")","v":""},{"$f":"IF('II_Plantear Ración'!$E12>0,IF(CálculosEV!AH11>0,1,\"No\"),\"\")","v":""},{"$f":"IF('II_Plantear Ración'!$E12>0,IF(CálculosEV!AI11>0,1,\"No\"),\"\")","v":""},{"$f":"IF('II_Plantear Ración'!$E12>0,IF(CálculosEV!AJ11>0,1,\"No\"),\"\")","v":""},{"$f":"IF('II_Plantear Ración'!$E12>0,IF(CálculosEV!AK11>0,1,\"No\"),\"\")","v":""},{"$f":"IF('II_Plantear Ración'!$E12>0,IF(CálculosEV!AL11>0,1,\"No\"),\"\")","v":""},{"$f":"IF('II_Plantear Ración'!$E12>0,IF(CálculosEV!AM11>0,1,\"No\"),\"\")","v":""},0,0,0,0,0,0,0,0,0,0,0,0,0,0,0,0,0,0,0,0,0,0,0,0,0,0,0,0,0,0,0,0,0,0,0]
[null,{"$f":"IF(OFFSET('Tabla Concentrados'!$A$1,C12,0,1,1)=0,\"\",OFFSET('Tabla Concentrados'!$A$1,C12,0,1,1))","v":"Soja torta 44"},48,{"$f":"OFFSET('Tabla Concentrados'!$A$1,$C12,$D$2,1,1)","v":87.2},{"$f":"OFFSET('Tabla Concentrados'!$A$1,$C12,$E$2,1,1)","v":0},{"$f":"OFFSET('Tabla Concentrados'!$A$1,$C12,$F$2,1,1)","v":1.1656258626018918},{"$f":"OFFSET('Tabla Concentrados'!$A$1,$C12,$G$2,1,1)","v":207.06952650471396},{"$f":"OFFSET('Tabla Concentrados'!$A$1,$C12,$H$2,1,1)","v":219.17261164349998},{"$f":"OFFSET('Tabla Concentrados'!$A$1,$C12,$I$2,1,1)","v":2},{"$f":"OFFSET('Tabla Concentrados'!$A$1,$C12,$J$2,1,1)","v":1.87},{"$f":"OFFSET('Tabla Concentrados'!$A$1,$C12,$K$2,1,1)","v":4.8999999999999995},{"$f":"OFFSET('Tabla Concentrados'!$A$1,$C12,$L$2,1,1)","v":2.7},{"$f":"OFFSET('Tabla Concentrados'!$A$1,$C12,$M$2,1,1)","v":20},{"$f":"OFFSET('Tabla Concentrados'!$A$1,$C12,$N$2,1,1)","v":1.95},{"$f":"OFFSET('Tabla Concentrados'!$A$1,$C12,$O$2,1,1)","v":0},{"$f":"OFFSET('Tabla Concentrados'!$A$1,$C12,$P$2,1,1)","v":0},{"$f":"OFFSET('Tabla Concentrados'!$A$1,$C12,$Q$2,1,1)","v":0.3},{"$f":"OFFSET('Tabla Concentrados'!$A$1,$C12,$R$2,1,1)","v":17.100000000000001},{"$f":"OFFSET('Tabla Concentrados'!$A$1,$C12,$S$2,1,1)","v":43.7},{"$f":"OFFSET('Tabla Concentrados'!$A$1,$C12,$T$2,1,1)","v":54.6},{"$f":"OFFSET('Tabla Concentrados'!$A$1,$C12,$U$2,1,1)","v":0},{"$f":"OFFSET('Tabla Concentrados'!$A$1,$C12,$V$2,1,1)","v":0.2},{"$f":"OFFSET('Tabla Concentrados'!$A$1,$C12,$W$2,1,1)","v":0},{"$f":"OFFSET('Tabla Concentrados'!$A$1,$C12,$X$2,1,1)","v":0},{"$f":"OFFSET('Tabla Concentrados'!$A$1,$C12,$Y$2,1,1)","v":7},{"$f":"OFFSET('Tabla Concentrados'!$A$1,$C12,$Z$2,1,1)","v":16.5},{"$f":"OFFSET('Tabla Concentrados'!$A$1,$C12,$AA$2,1,1)","v":488},{"$f":"OFFSET('Tabla Concentrados'!$A$1,$C12,$AB$2,1,1)","v":153.41999795655397},{"$f":"OFFSET('Tabla Concentrados'!$A$1,$C12,$AC$2,1,1)","v":0.84965499999999994},{"$f":"OFFSET('Tabla Concentrados'!$A$1,$C12,$AD$2,1,1)","v":779.13363500000003},{"$f":"OFFSET('Tabla Concentrados'!$A$1,$C12,$AE$2,1,1)","v":22},{"$f":"OFFSET('Tabla Concentrados'!$A$1,$C12,$AF$2,1,1)","v":84},{"$f":"OFFSET('Tabla Concentrados'!$A$1,$C12,$AG$2,1,1)","v":163},{"$f":"OFFSET('Tabla Concentrados'!$A$1,$C12,$AH$2,1,1)","v":104},{"$f":"OFFSET('Tabla Concentrados'!$A$1,$C12,$AI$2,1,1)","v":8},{"$f":"OFFSET('Tabla Concentrados'!$A$1,$C12,$AJ$2,1,1)","v":83},{"$f":"OFFSET('Tabla Concentrados'!$A$1,$C12,$AK$2,1,1)","v":2.2999999999999998},{"$f":"OFFSET('Tabla Concentrados'!$A$1,$C12,$AL$2,1,1)","v":0.68199960346033861},{"$f":"OFFSET('Tabla Concentrados'!$A$1,$C12,$AM$2,1,1)","v":737.90755524119731},{"$f":"IF('II_Plantear Ración'!$E13>0,IF(CálculosEV!E12>=0,1,\"No\"),\"\")","v":1},{"$f":"IF('II_Plantear Ración'!$E13>0,IF(CálculosEV!F12>0,1,\"No\"),\"\")","v":1},{"$f":"IF('II_Plantear Ración'!$E13>0,IF(CálculosEV!G12>0,1,\"No\"),\"\")","v":1},{"$f":"IF('II_Plantear Ración'!$E13>0,IF(CálculosEV!H12=0,\"No\",1),\"\")","v":1},{"$f":"IF('II_Plantear Ración'!$E13>0,IF(CálculosEV!I12>0,1,\"No\"),\"\")","v":1},{"$f":"IF('II_Plantear Ración'!$E13>0,IF(CálculosEV!J12>0,1,\"No\"),\"\")","v":1},{"$f":"IF('II_Plantear Ración'!$E13>0,IF(CálculosEV!K12>0,1,\"No\"),\"\")","v":1},{"$f":"IF('II_Plantear Ración'!$E13>0,IF(CálculosEV!L12>0,1,\"No\"),\"\")","v":1},{"$f":"IF('II_Plantear Ración'!$E13>0,IF(CálculosEV!M12>0,1,\"No\"),\"\")","v":1},{"$f":"IF('II_Plantear Ración'!$E13>0,IF(CálculosEV!N12>0,1,\"No\"),\"\")","v":1},{"$f":"IF('II_Plantear Ración'!$E13>0,IF(CálculosEV!O12>0,1,\"No\"),\"\")","v":"No"},{"$f":"IF('II_Plantear Ración'!$E13>0,IF(CálculosEV!P12>0,1,\"No\"),\"\")","v":"No"},{"$f":"IF('II_Plantear Ración'!$E13>0,IF(CálculosEV!Q12>0,1,\"No\"),\"\")","v":1},{"$f":"IF('II_Plantear Ración'!$E13>0,IF(CálculosEV!R12>0,1,\"No\"),\"\")","v":1},{"$f":"IF('II_Plantear Ración'!$E13>0,IF(CálculosEV!S12>0,1,\"No\"),\"\")","v":1},{"$f":"IF('II_Plantear Ración'!$E13>0,IF(CálculosEV!T12>0,1,\"No\"),\"\")","v":1},{"$f":"IF('II_Plantear Ración'!$E13>0,IF(CálculosEV!U12>0,1,\"No\"),\"\")","v":"No"},{"$f":"IF('II_Plantear Ración'!$E13>0,IF(CálculosEV!V12>0,1,\"No\"),\"\")","v":1},{"$f":"IF('II_Plantear Ración'!$E13>0,IF(CálculosEV!W12>0,1,\"No\"),\"\")","v":"No"},{"$f":"IF('II_Plantear Ración'!$E13>0,IF(CálculosEV!X12>0,1,\"No\"),\"\")","v":"No"},{"$f":"IF('II_Plantear Ración'!$E13>0,IF(CálculosEV!Y12>0,1,\"No\"),\"\")","v":1},{"$f":"IF('II_Plantear Ración'!$E13>0,IF(CálculosEV!Z12>0,1,\"No\"),\"\")","v":1},{"$f":"IF('II_Plantear Ración'!$E13>0,IF(CálculosEV!AA12>0,1,\"No\"),\"\")","v":1},{"$f":"IF('II_Plantear Ración'!$E13>0,IF(CálculosEV!AB12>0,1,\"No\"),\"\")","v":1},{"$f":"IF('II_Plantear Ración'!$E13>0,IF(CálculosEV!AC12>0,1,\"No\"),\"\")","v":1},{"$f":"IF('II_Plantear Ración'!$E13>0,IF(CálculosEV!AD12>0,1,\"No\"),\"\")","v":1},{"$f":"IF('II_Plantear Ración'!$E13>0,IF(CálculosEV!AE12>0,1,\"No\"),\"\")","v":1},{"$f":"IF('II_Plantear Ración'!$E13>0,IF(CálculosEV!AF12>0,1,\"No\"),\"\")","v":1},{"$f":"IF('II_Plantear Ración'!$E13>0,IF(CálculosEV!AG12>0,1,\"No\"),\"\")","v":1},{"$f":"IF('II_Plantear Ración'!$E13>0,IF(CálculosEV!AH12>0,1,\"No\"),\"\")","v":1},{"$f":"IF('II_Plantear Ración'!$E13>0,IF(CálculosEV!AI12>0,1,\"No\"),\"\")","v":1},{"$f":"IF('II_Plantear Ración'!$E13>0,IF(CálculosEV!AJ12>0,1,\"No\"),\"\")","v":1},{"$f":"IF('II_Plantear Ración'!$E13>0,IF(CálculosEV!AK12>0,1,\"No\"),\"\")","v":1},{"$f":"IF('II_Plantear Ración'!$E13>0,IF(CálculosEV!AL12>0,1,\"No\"),\"\")","v":1},{"$f":"IF('II_Plantear Ración'!$E13>0,IF(CálculosEV!AM12>0,1,\"No\"),\"\")","v":1},1,1,1,1,1,1,1,1,1,1,1,1,1,1,1,1,1,1,1,1,1,1,1,1,1,1,1,1,1,1,1,1,1,1,1]
[null,{"$f":"IF(OFFSET('Tabla Concentrados'!$A$1,C13,0,1,1)=0,\"\",OFFSET('Tabla Concentrados'!$A$1,C13,0,1,1))","v":"Mandioca"},78,{"$f":"OFFSET('Tabla Concentrados'!$A$1,$C13,$D$2,1,1)","v":85},{"$f":"OFFSET('Tabla Concentrados'!$A$1,$C13,$E$2,1,1)","v":0},{"$f":"OFFSET('Tabla Concentrados'!$A$1,$C13,$F$2,1,1)","v":1.1420974625875657},{"$f":"OFFSET('Tabla Concentrados'!$A$1,$C13,$G$2,1,1)","v":75.490022489380621},{"$f":"OFFSET('Tabla Concentrados'!$A$1,$C13,$H$2,1,1)","v":-97.453437442000009},{"$f":"OFFSET('Tabla Concentrados'!$A$1,$C13,$I$2,1,1)","v":2},{"$f":"OFFSET('Tabla Concentrados'!$A$1,$C13,$J$2,1,1)","v":1.375},{"$f":"OFFSET('Tabla Concentrados'!$A$1,$C13,$K$2,1,1)","v":0.68},{"$f":"OFFSET('Tabla Concentrados'!$A$1,$C13,$L$2,1,1)","v":0.9},{"$f":"OFFSET('Tabla Concentrados'!$A$1,$C13,$M$2,1,1)","v":7.5},{"$f":"OFFSET('Tabla Concentrados'!$A$1,$C13,$N$2,1,1)","v":0.35},{"$f":"OFFSET('Tabla Concentrados'!$A$1,$C13,$O$2,1,1)","v":0},{"$f":"OFFSET('Tabla Concentrados'!$A$1,$C13,$P$2,1,1)","v":0},{"$f":"OFFSET('Tabla Concentrados'!$A$1,$C13,$Q$2,1,1)","v":0},{"$f":"OFFSET('Tabla Concentrados'!$A$1,$C13,$R$2,1,1)","v":2},{"$f":"OFFSET('Tabla Concentrados'!$A$1,$C13,$S$2,1,1)","v":5},{"$f":"OFFSET('Tabla Concentrados'!$A$1,$C13,$T$2,1,1)","v":30},{"$f":"OFFSET('Tabla Concentrados'!$A$1,$C13,$U$2,1,1)","v":0},{"$f":"OFFSET('Tabla Concentrados'!$A$1,$C13,$V$2,1,1)","v":0},{"$f":"OFFSET('Tabla Concentrados'!$A$1,$C13,$W$2,1,1)","v":0},{"$f":"OFFSET('Tabla Concentrados'!$A$1,$C13,$X$2,1,1)","v":0},{"$f":"OFFSET('Tabla Concentrados'!$A$1,$C13,$Y$2,1,1)","v":0},{"$f":"OFFSET('Tabla Concentrados'!$A$1,$C13,$Z$2,1,1)","v":6.56},{"$f":"OFFSET('Tabla Concentrados'!$A$1,$C13,$AA$2,1,1)","v":31},{"$f":"OFFSET('Tabla Concentrados'!$A$1,$C13,$AB$2,1,1)","v":10.1054225265006},{"$f":"OFFSET('Tabla Concentrados'!$A$1,$C13,$AC$2,1,1)","v":0.91761999999999999},{"$f":"OFFSET('Tabla Concentrados'!$A$1,$C13,$AD$2,1,1)","v":861.64517999999998},{"$f":"OFFSET('Tabla Concentrados'!$A$1,$C13,$AE$2,1,1)","v":8.1999999999999993},{"$f":"OFFSET('Tabla Concentrados'!$A$1,$C13,$AF$2,1,1)","v":54},{"$f":"OFFSET('Tabla Concentrados'!$A$1,$C13,$AG$2,1,1)","v":118},{"$f":"OFFSET('Tabla Concentrados'!$A$1,$C13,$AH$2,1,1)","v":59},{"$f":"OFFSET('Tabla Concentrados'!$A$1,$C13,$AI$2,1,1)","v":14.01},{"$f":"OFFSET('Tabla Concentrados'!$A$1,$C13,$AJ$2,1,1)","v":61},{"$f":"OFFSET('Tabla Concentrados'!$A$1,$C13,$AK$2,1,1)","v":0},{"$f":"OFFSET('Tabla Concentrados'!$A$1,$C13,$AL$2,1,1)","v":0.63899949400537248},{"$f":"OFFSET('Tabla Concentrados'!$A$1,$C13,$AM$2,1,1)","v":0},{"$f":"IF('II_Plantear Ración'!$E14>0,IF(CálculosEV!E13>=0,1,\"No\"),\"\")","v":""},{"$f":"IF('II_Plantear Ración'!$E14>0,IF(CálculosEV!F13>0,1,\"No\"),\"\")","v":""},{"$f":"IF('II_Plantear Ración'!$E14>0,IF(CálculosEV!G13>0,1,\"No\"),\"\")","v":""},{"$f":"IF('II_Plantear Ración'!$E14>0,IF(CálculosEV!H13=0,\"No\",1),\"\")","v":""},{"$f":"IF('II_Plantear Ración'!$E14>0,IF(CálculosEV!I13>0,1,\"No\"),\"\")","v":""},{"$f":"IF('II_Plantear Ración'!$E14>0,IF(CálculosEV!J13>0,1,\"No\"),\"\")","v":""},{"$f":"IF('II_Plantear Ración'!$E14>0,IF(CálculosEV!K13>0,1,\"No\"),\"\")","v":""},{"$f":"IF('II_Plantear Ración'!$E14>0,IF(CálculosEV!L13>0,1,\"No\"),\"\")","v":""},{"$f":"IF('II_Plantear Ración'!$E14>0,IF(CálculosEV!M13>0,1,\"No\"),\"\")","v":""},{"$f":"IF('II_Plantear Ración'!$E14>0,IF(CálculosEV!N13>0,1,\"No\"),\"\")","v":""},{"$f":"IF('II_Plantear Ración'!$E14>0,IF(CálculosEV!O13>0,1,\"No\"),\"\")","v":""},{"$f":"IF('II_Plantear Ración'!$E14>0,IF(CálculosEV!P13>0,1,\"No\"),\"\")","v":""},{"$f":"IF('II_Plantear Ración'!$E14>0,IF(CálculosEV!Q13>0,1,\"No\"),\"\")","v":""},{"$f":"IF('II_Plantear Ración'!$E14>0,IF(CálculosEV!R13>0,1,\"No\"),\"\")","v":""},{"$f":"IF('II_Plantear Ración'!$E14>0,IF(CálculosEV!S13>0,1,\"No\"),\"\")","v":""},{"$f":"IF('II_Plantear Ración'!$E14>0,IF(CálculosEV!T13>0,1,\"No\"),\"\")","v":""},{"$f":"IF('II_Plantear Ración'!$E14>0,IF(CálculosEV!U13>0,1,\"No\"),\"\")","v":""},{"$f":"IF('II_Plantear Ración'!$E14>0,IF(CálculosEV!V13>0,1,\"No\"),\"\")","v":""},{"$f":"IF('II_Plantear Ración'!$E14>0,IF(CálculosEV!W13>0,1,\"No\"),\"\")","v":""},{"$f":"IF('II_Plantear Ración'!$E14>0,IF(CálculosEV!X13>0,1,\"No\"),\"\")","v":""},{"$f":"IF('II_Plantear Ración'!$E14>0,IF(CálculosEV!Y13>0,1,\"No\"),\"\")","v":""},{"$f":"IF('II_Plantear Ración'!$E14>0,IF(CálculosEV!Z13>0,1,\"No\"),\"\")","v":""},{"$f":"IF('II_Plantear Ración'!$E14>0,IF(CálculosEV!AA13>0,1,\"No\"),\"\")","v":""},{"$f":"IF('II_Plantear Ración'!$E14>0,IF(CálculosEV!AB13>0,1,\"No\"),\"\")","v":""},{"$f":"IF('II_Plantear Ración'!$E14>0,IF(CálculosEV!AC13>0,1,\"No\"),\"\")","v":""},{"$f":"IF('II_Plantear Ración'!$E14>0,IF(CálculosEV!AD13>0,1,\"No\"),\"\")","v":""},{"$f":"IF('II_Plantear Ración'!$E14>0,IF(CálculosEV!AE13>0,1,\"No\"),\"\")","v":""},{"$f":"IF('II_Plantear Ración'!$E14>0,IF(CálculosEV!AF13>0,1,\"No\"),\"\")","v":""},{"$f":"IF('II_Plantear Ración'!$E14>0,IF(CálculosEV!AG13>0,1,\"No\"),\"\")","v":""},{"$f":"IF('II_Plantear Ración'!$E14>0,IF(CálculosEV!AH13>0,1,\"No\"),\"\")","v":""},{"$f":"IF('II_Plantear Ración'!$E14>0,IF(CálculosEV!AI13>0,1,\"No\"),\"\")","v":""},{"$f":"IF('II_Plantear Ración'!$E14>0,IF(CálculosEV!AJ13>0,1,\"No\"),\"\")","v":""},{"$f":"IF('II_Plantear Ración'!$E14>0,IF(CálculosEV!AK13>0,1,\"No\"),\"\")","v":""},{"$f":"IF('II_Plantear Ración'!$E14>0,IF(CálculosEV!AL13>0,1,\"No\"),\"\")","v":""},{"$f":"IF('II_Plantear Ración'!$E14>0,IF(CálculosEV!AM13>0,1,\"No\"),\"\")","v":""},0,0,0,0,0,0,0,0,0,0,0,0,0,0,0,0,0,0,0,0,0,0,0,0,0,0,0,0,0,0,0,0,0,0,0]
[null,{"$f":"IF(OFFSET('Tabla Concentrados'!$A$1,C14,0,1,1)=0,\"\",OFFSET('Tabla Concentrados'!$A$1,C14,0,1,1))","v":"Cebada bagazo cervecería seco"},24,{"$f":"OFFSET('Tabla Concentrados'!$A$1,$C14,$D$2,1,1)","v":91.9},{"$f":"OFFSET('Tabla Concentrados'!$A$1,$C14,$E$2,1,1)","v":0},{"$f":"OFFSET('Tabla Concentrados'!$A$1,$C14,$F$2,1,1)","v":0.87119356499561229},{"$f":"OFFSET('Tabla Concentrados'!$A$1,$C14,$G$2,1,1)","v":151.63839868082431},{"$f":"OFFSET('Tabla Concentrados'!$A$1,$C14,$H$2,1,1)","v":35.094428351199994},{"$f":"OFFSET('Tabla Concentrados'!$A$1,$C14,$I$2,1,1)","v":2},{"$f":"OFFSET('Tabla Concentrados'!$A$1,$C14,$J$2,1,1)","v":1.2649999999999999},{"$f":"OFFSET('Tabla Concentrados'!$A$1,$C14,$K$2,1,1)","v":4.9139999999999997},{"$f":"OFFSET('Tabla Concentrados'!$A$1,$C14,$L$2,1,1)","v":0},{"$f":"OFFSET('Tabla Concentrados'!$A$1,$C14,$M$2,1,1)","v":0},{"$f":"OFFSET('Tabla Concentrados'!$A$1,$C14,$N$2,1,1)","v":0},{"$f":"OFFSET('Tabla Concentrados'!$A$1,$C14,$O$2,1,1)","v":0},{"$f":"OFFSET('Tabla Concentrados'!$A$1,$C14,$P$2,1,1)","v":0},{"$f":"OFFSET('Tabla Concentrados'!$A$1,$C14,$Q$2,1,1)","v":0.08},{"$f":"OFFSET('Tabla Concentrados'!$A$1,$C14,$R$2,1,1)","v":22.2},{"$f":"OFFSET('Tabla Concentrados'!$A$1,$C14,$S$2,1,1)","v":38.5},{"$f":"OFFSET('Tabla Concentrados'!$A$1,$C14,$T$2,1,1)","v":85},{"$f":"OFFSET('Tabla Concentrados'!$A$1,$C14,$U$2,1,1)","v":0},{"$f":"OFFSET('Tabla Concentrados'!$A$1,$C14,$V$2,1,1)","v":0.06},{"$f":"OFFSET('Tabla Concentrados'!$A$1,$C14,$W$2,1,1)","v":0},{"$f":"OFFSET('Tabla Concentrados'!$A$1,$C14,$X$2,1,1)","v":0},{"$f":"OFFSET('Tabla Concentrados'!$A$1,$C14,$Y$2,1,1)","v":29},{"$f":"OFFSET('Tabla Concentrados'!$A$1,$C14,$Z$2,1,1)","v":35.955000000000005},{"$f":"OFFSET('Tabla Concentrados'!$A$1,$C14,$AA$2,1,1)","v":262.39999999999998},{"$f":"OFFSET('Tabla Concentrados'!$A$1,$C14,$AB$2,1,1)","v":107.61563282559231},{"$f":"OFFSET('Tabla Concentrados'!$A$1,$C14,$AC$2,1,1)","v":0.62731999999999999},{"$f":"OFFSET('Tabla Concentrados'!$A$1,$C14,$AD$2,1,1)","v":601.34895199999994},{"$f":"OFFSET('Tabla Concentrados'!$A$1,$C14,$AE$2,1,1)","v":79.900000000000006},{"$f":"OFFSET('Tabla Concentrados'!$A$1,$C14,$AF$2,1,1)","v":161.6},{"$f":"OFFSET('Tabla Concentrados'!$A$1,$C14,$AG$2,1,1)","v":643.29999999999995},{"$f":"OFFSET('Tabla Concentrados'!$A$1,$C14,$AH$2,1,1)","v":236.4},{"$f":"OFFSET('Tabla Concentrados'!$A$1,$C14,$AI$2,1,1)","v":78.899999999999991},{"$f":"OFFSET('Tabla Concentrados'!$A$1,$C14,$AJ$2,1,1)","v":41.4},{"$f":"OFFSET('Tabla Concentrados'!$A$1,$C14,$AK$2,1,1)","v":0.5},{"$f":"OFFSET('Tabla Concentrados'!$A$1,$C14,$AL$2,1,1)","v":0.53718506650710496},{"$f":"OFFSET('Tabla Concentrados'!$A$1,$C14,$AM$2,1,1)","v":529.6572153518573},{"$f":"IF('II_Plantear Ración'!$E15>0,IF(CálculosEV!E14>=0,1,\"No\"),\"\")","v":""},{"$f":"IF('II_Plantear Ración'!$E15>0,IF(CálculosEV!F14>0,1,\"No\"),\"\")","v":""},{"$f":"IF('II_Plantear Ración'!$E15>0,IF(CálculosEV!G14>0,1,\"No\"),\"\")","v":""},{"$f":"IF('II_Plantear Ración'!$E15>0,IF(CálculosEV!H14=0,\"No\",1),\"\")","v":""},{"$f":"IF('II_Plantear Ración'!$E15>0,IF(CálculosEV!I14>0,1,\"No\"),\"\")","v":""},{"$f":"IF('II_Plantear Ración'!$E15>0,IF(CálculosEV!J14>0,1,\"No\"),\"\")","v":""},{"$f":"IF('II_Plantear Ración'!$E15>0,IF(CálculosEV!K14>0,1,\"No\"),\"\")","v":""},{"$f":"IF('II_Plantear Ración'!$E15>0,IF(CálculosEV!L14>0,1,\"No\"),\"\")","v":""},{"$f":"IF('II_Plantear Ración'!$E15>0,IF(CálculosEV!M14>0,1,\"No\"),\"\")","v":""},{"$f":"IF('II_Plantear Ración'!$E15>0,IF(CálculosEV!N14>0,1,\"No\"),\"\")","v":""},{"$f":"IF('II_Plantear Ración'!$E15>0,IF(CálculosEV!O14>0,1,\"No\"),\"\")","v":""},{"$f":"IF('II_Plantear Ración'!$E15>0,IF(CálculosEV!P14>0,1,\"No\"),\"\")","v":""},{"$f":"IF('II_Plantear Ración'!$E15>0,IF(CálculosEV!Q14>0,1,\"No\"),\"\")","v":""},{"$f":"IF('II_Plantear Ración'!$E15>0,IF(CálculosEV!R14>0,1,\"No\"),\"\")","v":""},{"$f":"IF('II_Plantear Ración'!$E15>0,IF(CálculosEV!S14>0,1,\"No\"),\"\")","v":""},{"$f":"IF('II_Plantear Ración'!$E15>0,IF(CálculosEV!T14>0,1,\"No\"),\"\")","v":""},{"$f":"IF('II_Plantear Ración'!$E15>0,IF(CálculosEV!U14>0,1,\"No\"),\"\")","v":""},{"$f":"IF('II_Plantear Ración'!$E15>0,IF(CálculosEV!V14>0,1,\"No\"),\"\")","v":""},{"$f":"IF('II_Plantear Ración'!$E15>0,IF(CálculosEV!W14>0,1,\"No\"),\"\")","v":""},{"$f":"IF('II_Plantear Ración'!$E15>0,IF(CálculosEV!X14>0,1,\"No\"),\"\")","v":""},{"$f":"IF('II_Plantear Ración'!$E15>0,IF(CálculosEV!Y14>0,1,\"No\"),\"\")","v":""},{"$f":"IF('II_Plantear Ración'!$E15>0,IF(CálculosEV!Z14>0,1,\"No\"),\"\")","v":""},{"$f":"IF('II_Plantear Ración'!$E15>0,IF(CálculosEV!AA14>0,1,\"No\"),\"\")","v":""},{"$f":"IF('II_Plantear Ración'!$E15>0,IF(CálculosEV!AB14>0,1,\"No\"),\"\")","v":""},{"$f":"IF('II_Plantear Ración'!$E15>0,IF(CálculosEV!AC14>0,1,\"No\"),\"\")","v":""},{"$f":"IF('II_Plantear Ración'!$E15>0,IF(CálculosEV!AD14>0,1,\"No\"),\"\")","v":""},{"$f":"IF('II_Plantear Ración'!$E15>0,IF(CálculosEV!AE14>0,1,\"No\"),\"\")","v":""},{"$f":"IF('II_Plantear Ración'!$E15>0,IF(CálculosEV!AF14>0,1,\"No\"),\"\")","v":""},{"$f":"IF('II_Plantear Ración'!$E15>0,IF(CálculosEV!AG14>0,1,\"No\"),\"\")","v":""},{"$f":"IF('II_Plantear Ración'!$E15>0,IF(CálculosEV!AH14>0,1,\"No\"),\"\")","v":""},{"$f":"IF('II_Plantear Ración'!$E15>0,IF(CálculosEV!AI14>0,1,\"No\"),\"\")","v":""},{"$f":"IF('II_Plantear Ración'!$E15>0,IF(CálculosEV!AJ14>0,1,\"No\"),\"\")","v":""},{"$f":"IF('II_Plantear Ración'!$E15>0,IF(CálculosEV!AK14>0,1,\"No\"),\"\")","v":""},{"$f":"IF('II_Plantear Ración'!$E15>0,IF(CálculosEV!AL14>0,1,\"No\"),\"\")","v":""},{"$f":"IF('II_Plantear Ración'!$E15>0,IF(CálculosEV!AM14>0,1,\"No\"),\"\")","v":""},0,0,0,0,0,0,0,0,0,0,0,0,0,0,0,0,0,0,0,0,0,0,0,0,0,0,0,0,0,0,0,0,0,0,0]
[null,{"$f":"IF(OFFSET('Tabla Concentrados'!$A$1,C15,0,1,1)=0,\"\",OFFSET('Tabla Concentrados'!$A$1,C15,0,1,1))","v":"Algodón, grano"},34,{"$f":"OFFSET('Tabla Concentrados'!$A$1,$C15,$D$2,1,1)","v":92},{"$f":"OFFSET('Tabla Concentrados'!$A$1,$C15,$E$2,1,1)","v":0},{"$f":"OFFSET('Tabla Concentrados'!$A$1,$C15,$F$2,1,1)","v":1.1057454642423121},{"$f":"OFFSET('Tabla Concentrados'!$A$1,$C15,$G$2,1,1)","v":91.654792821464014},{"$f":"OFFSET('Tabla Concentrados'!$A$1,$C15,$H$2,1,1)","v":70.583837883999976},{"$f":"OFFSET('Tabla Concentrados'!$A$1,$C15,$I$2,1,1)","v":2},{"$f":"OFFSET('Tabla Concentrados'!$A$1,$C15,$J$2,1,1)","v":1.1550000000000002},{"$f":"OFFSET('Tabla Concentrados'!$A$1,$C15,$K$2,1,1)","v":4.7359999999999998},{"$f":"OFFSET('Tabla Concentrados'!$A$1,$C15,$L$2,1,1)","v":0},{"$f":"OFFSET('Tabla Concentrados'!$A$1,$C15,$M$2,1,1)","v":0},{"$f":"OFFSET('Tabla Concentrados'!$A$1,$C15,$N$2,1,1)","v":0},{"$f":"OFFSET('Tabla Concentrados'!$A$1,$C15,$O$2,1,1)","v":0},{"$f":"OFFSET('Tabla Concentrados'!$A$1,$C15,$P$2,1,1)","v":0},{"$f":"OFFSET('Tabla Concentrados'!$A$1,$C15,$Q$2,1,1)","v":0},{"$f":"OFFSET('Tabla Concentrados'!$A$1,$C15,$R$2,1,1)","v":0},{"$f":"OFFSET('Tabla Concentrados'!$A$1,$C15,$S$2,1,1)","v":0},{"$f":"OFFSET('Tabla Concentrados'!$A$1,$C15,$T$2,1,1)","v":0},{"$f":"OFFSET('Tabla Concentrados'!$A$1,$C15,$U$2,1,1)","v":0},{"$f":"OFFSET('Tabla Concentrados'!$A$1,$C15,$V$2,1,1)","v":0},{"$f":"OFFSET('Tabla Concentrados'!$A$1,$C15,$W$2,1,1)","v":0},{"$f":"OFFSET('Tabla Concentrados'!$A$1,$C15,$X$2,1,1)","v":0},{"$f":"OFFSET('Tabla Concentrados'!$A$1,$C15,$Y$2,1,1)","v":0},{"$f":"OFFSET('Tabla Concentrados'!$A$1,$C15,$Z$2,1,1)","v":188.1},{"$f":"OFFSET('Tabla Concentrados'!$A$1,$C15,$AA$2,1,1)","v":220},{"$f":"OFFSET('Tabla Concentrados'!$A$1,$C15,$AB$2,1,1)","v":48.764449067224007},{"$f":"OFFSET('Tabla Concentrados'!$A$1,$C15,$AC$2,1,1)","v":0.64651999999999998},{"$f":"OFFSET('Tabla Concentrados'!$A$1,$C15,$AD$2,1,1)","v":618.71964000000003},{"$f":"OFFSET('Tabla Concentrados'!$A$1,$C15,$AE$2,1,1)","v":198},{"$f":"OFFSET('Tabla Concentrados'!$A$1,$C15,$AF$2,1,1)","v":276},{"$f":"OFFSET('Tabla Concentrados'!$A$1,$C15,$AG$2,1,1)","v":456},{"$f":"OFFSET('Tabla Concentrados'!$A$1,$C15,$AH$2,1,1)","v":354},{"$f":"OFFSET('Tabla Concentrados'!$A$1,$C15,$AI$2,1,1)","v":105},{"$f":"OFFSET('Tabla Concentrados'!$A$1,$C15,$AJ$2,1,1)","v":43},{"$f":"OFFSET('Tabla Concentrados'!$A$1,$C15,$AK$2,1,1)","v":0},{"$f":"OFFSET('Tabla Concentrados'!$A$1,$C15,$AL$2,1,1)","v":0.73941085414823005},{"$f":"OFFSET('Tabla Concentrados'!$A$1,$C15,$AM$2,1,1)","v":581.85751744287006},{"$f":"IF('II_Plantear Ración'!$E16>0,IF(CálculosEV!E15>=0,1,\"No\"),\"\")","v":""},{"$f":"IF('II_Plantear Ración'!$E16>0,IF(CálculosEV!F15>0,1,\"No\"),\"\")","v":""},{"$f":"IF('II_Plantear Ración'!$E16>0,IF(CálculosEV!G15>0,1,\"No\"),\"\")","v":""},{"$f":"IF('II_Plantear Ración'!$E16>0,IF(CálculosEV!H15=0,\"No\",1),\"\")","v":""},{"$f":"IF('II_Plantear Ración'!$E16>0,IF(CálculosEV!I15>0,1,\"No\"),\"\")","v":""},{"$f":"IF('II_Plantear Ración'!$E16>0,IF(CálculosEV!J15>0,1,\"No\"),\"\")","v":""},{"$f":"IF('II_Plantear Ración'!$E16>0,IF(CálculosEV!K15>0,1,\"No\"),\"\")","v":""},{"$f":"IF('II_Plantear Ración'!$E16>0,IF(CálculosEV!L15>0,1,\"No\"),\"\")","v":""},{"$f":"IF('II_Plantear Ración'!$E16>0,IF(CálculosEV!M15>0,1,\"No\"),\"\")","v":""},{"$f":"IF('II_Plantear Ración'!$E16>0,IF(CálculosEV!N15>0,1,\"No\"),\"\")","v":""},{"$f":"IF('II_Plantear Ración'!$E16>0,IF(CálculosEV!O15>0,1,\"No\"),\"\")","v":""},{"$f":"IF('II_Plantear Ración'!$E16>0,IF(CálculosEV!P15>0,1,\"No\"),\"\")","v":""},{"$f":"IF('II_Plantear Ración'!$E16>0,IF(CálculosEV!Q15>0,1,\"No\"),\"\")","v":""},{"$f":"IF('II_Plantear Ración'!$E16>0,IF(CálculosEV!R15>0,1,\"No\"),\"\")","v":""},{"$f":"IF('II_Plantear Ración'!$E16>0,IF(CálculosEV!S15>0,1,\"No\"),\"\")","v":""},{"$f":"IF('II_Plantear Ración'!$E16>0,IF(CálculosEV!T15>0,1,\"No\"),\"\")","v":""},{"$f":"IF('II_Plantear Ración'!$E16>0,IF(CálculosEV!U15>0,1,\"No\"),\"\")","v":""},{"$f":"IF('II_Plantear Ración'!$E16>0,IF(CálculosEV!V15>0,1,\"No\"),\"\")","v":""},{"$f":"IF('II_Plantear Ración'!$E16>0,IF(CálculosEV!W15>0,1,\"No\"),\"\")","v":""},{"$f":"IF('II_Plantear Ración'!$E16>0,IF(CálculosEV!X15>0,1,\"No\"),\"\")","v":""},{"$f":"IF('II_Plantear Ración'!$E16>0,IF(CálculosEV!Y15>0,1,\"No\"),\"\")","v":""},{"$f":"IF('II_Plantear Ración'!$E16>0,IF(CálculosEV!Z15>0,1,\"No\"),\"\")","v":""},{"$f":"IF('II_Plantear Ración'!$E16>0,IF(CálculosEV!AA15>0,1,\"No\"),\"\")","v":""},{"$f":"IF('II_Plantear Ración'!$E16>0,IF(CálculosEV!AB15>0,1,\"No\"),\"\")","v":""},{"$f":"IF('II_Plantear Ración'!$E16>0,IF(CálculosEV!AC15>0,1,\"No\"),\"\")","v":""},{"$f":"IF('II_Plantear Ración'!$E16>0,IF(CálculosEV!AD15>0,1,\"No\"),\"\")","v":""},{"$f":"IF('II_Plantear Ración'!$E16>0,IF(CálculosEV!AE15>0,1,\"No\"),\"\")","v":""},{"$f":"IF('II_Plantear Ración'!$E16>0,IF(CálculosEV!AF15>0,1,\"No\"),\"\")","v":""},{"$f":"IF('II_Plantear Ración'!$E16>0,IF(CálculosEV!AG15>0,1,\"No\"),\"\")","v":""},{"$f":"IF('II_Plantear Ración'!$E16>0,IF(CálculosEV!AH15>0,1,\"No\"),\"\")","v":""},{"$f":"IF('II_Plantear Ración'!$E16>0,IF(CálculosEV!AI15>0,1,\"No\"),\"\")","v":""},{"$f":"IF('II_Plantear Ración'!$E16>0,IF(CálculosEV!AJ15>0,1,\"No\"),\"\")","v":""},{"$f":"IF('II_Plantear Ración'!$E16>0,IF(CálculosEV!AK15>0,1,\"No\"),\"\")","v":""},{"$f":"IF('II_Plantear Ración'!$E16>0,IF(CálculosEV!AL15>0,1,\"No\"),\"\")","v":""},{"$f":"IF('II_Plantear Ración'!$E16>0,IF(CálculosEV!AM15>0,1,\"No\"),\"\")","v":""},0,0,0,0,0,0,0,0,0,0,0,0,0,0,0,0,0,0,0,0,0,0,0,0,0,0,0,0,0,0,0,0,0,0,0]
[null,{"$f":"IF(OFFSET('Tabla Concentrados'!$A$1,C16,0,1,1)=0,\"\",OFFSET('Tabla Concentrados'!$A$1,C16,0,1,1))","v":"Levadura cervecería"},75,{"$f":"OFFSET('Tabla Concentrados'!$A$1,$C16,$D$2,1,1)","v":93.3},{"$f":"OFFSET('Tabla Concentrados'!$A$1,$C16,$E$2,1,1)","v":0},{"$f":"OFFSET('Tabla Concentrados'!$A$1,$C16,$F$2,1,1)","v":1.18},{"$f":"OFFSET('Tabla Concentrados'!$A$1,$C16,$G$2,1,1)","v":143},{"$f":"OFFSET('Tabla Concentrados'!$A$1,$C16,$H$2,1,1)","v":278},{"$f":"OFFSET('Tabla Concentrados'!$A$1,$C16,$I$2,1,1)","v":2},{"$f":"OFFSET('Tabla Concentrados'!$A$1,$C16,$J$2,1,1)","v":1.6500000000000001},{"$f":"OFFSET('Tabla Concentrados'!$A$1,$C16,$K$2,1,1)","v":9.1800000000000015},{"$f":"OFFSET('Tabla Concentrados'!$A$1,$C16,$L$2,1,1)","v":2.4},{"$f":"OFFSET('Tabla Concentrados'!$A$1,$C16,$M$2,1,1)","v":0},{"$f":"OFFSET('Tabla Concentrados'!$A$1,$C16,$N$2,1,1)","v":0},{"$f":"OFFSET('Tabla Concentrados'!$A$1,$C16,$O$2,1,1)","v":0},{"$f":"OFFSET('Tabla Concentrados'!$A$1,$C16,$P$2,1,1)","v":0},{"$f":"OFFSET('Tabla Concentrados'!$A$1,$C16,$Q$2,1,1)","v":0},{"$f":"OFFSET('Tabla Concentrados'!$A$1,$C16,$R$2,1,1)","v":0},{"$f":"OFFSET('Tabla Concentrados'!$A$1,$C16,$S$2,1,1)","v":0},{"$f":"OFFSET('Tabla Concentrados'!$A$1,$C16,$T$2,1,1)","v":0},{"$f":"OFFSET('Tabla Concentrados'!$A$1,$C16,$U$2,1,1)","v":0},{"$f":"OFFSET('Tabla Concentrados'!$A$1,$C16,$V$2,1,1)","v":0},{"$f":"OFFSET('Tabla Concentrados'!$A$1,$C16,$W$2,1,1)","v":0},{"$f":"OFFSET('Tabla Concentrados'!$A$1,$C16,$X$2,1,1)","v":0},{"$f":"OFFSET('Tabla Concentrados'!$A$1,$C16,$Y$2,1,1)","v":0},{"$f":"OFFSET('Tabla Concentrados'!$A$1,$C16,$Z$2,1,1)","v":32},{"$f":"OFFSET('Tabla Concentrados'!$A$1,$C16,$AA$2,1,1)","v":476},{"$f":"OFFSET('Tabla Concentrados'!$A$1,$C16,$AB$2,1,1)","v":87},{"$f":"OFFSET('Tabla Concentrados'!$A$1,$C16,$AC$2,1,1)","v":0.84},{"$f":"OFFSET('Tabla Concentrados'!$A$1,$C16,$AD$2,1,1)","v":756},{"$f":"OFFSET('Tabla Concentrados'!$A$1,$C16,$AE$2,1,1)","v":40},{"$f":"OFFSET('Tabla Concentrados'!$A$1,$C16,$AF$2,1,1)","v":21},{"$f":"OFFSET('Tabla Concentrados'!$A$1,$C16,$AG$2,1,1)","v":88},{"$f":"OFFSET('Tabla Concentrados'!$A$1,$C16,$AH$2,1,1)","v":25},{"$f":"OFFSET('Tabla Concentrados'!$A$1,$C16,$AI$2,1,1)","v":7},{"$f":"OFFSET('Tabla Concentrados'!$A$1,$C16,$AJ$2,1,1)","v":32},{"$f":"OFFSET('Tabla Concentrados'!$A$1,$C16,$AK$2,1,1)","v":0},{"$f":"OFFSET('Tabla Concentrados'!$A$1,$C16,$AL$2,1,1)","v":0.81515770697868817},{"$f":"OFFSET('Tabla Concentrados'!$A$1,$C16,$AM$2,1,1)","v":0},{"$f":"IF('II_Plantear Ración'!$E17>0,IF(CálculosEV!E16>=0,1,\"No\"),\"\")","v":""},{"$f":"IF('II_Plantear Ración'!$E17>0,IF(CálculosEV!F16>0,1,\"No\"),\"\")","v":""},{"$f":"IF('II_Plantear Ración'!$E17>0,IF(CálculosEV!G16>0,1,\"No\"),\"\")","v":""},{"$f":"IF('II_Plantear Ración'!$E17>0,IF(CálculosEV!H16=0,\"No\",1),\"\")","v":""},{"$f":"IF('II_Plantear Ración'!$E17>0,IF(CálculosEV!I16>0,1,\"No\"),\"\")","v":""},{"$f":"IF('II_Plantear Ración'!$E17>0,IF(CálculosEV!J16>0,1,\"No\"),\"\")","v":""},{"$f":"IF('II_Plantear Ración'!$E17>0,IF(CálculosEV!K16>0,1,\"No\"),\"\")","v":""},{"$f":"IF('II_Plantear Ración'!$E17>0,IF(CálculosEV!L16>0,1,\"No\"),\"\")","v":""},{"$f":"IF('II_Plantear Ración'!$E17>0,IF(CálculosEV!M16>0,1,\"No\"),\"\")","v":""},{"$f":"IF('II_Plantear Ración'!$E17>0,IF(CálculosEV!N16>0,1,\"No\"),\"\")","v":""},{"$f":"IF('II_Plantear Ración'!$E17>0,IF(CálculosEV!O16>0,1,\"No\"),\"\")","v":""},{"$f":"IF('II_Plantear Ración'!$E17>0,IF(CálculosEV!P16>0,1,\"No\"),\"\")","v":""},{"$f":"IF('II_Plantear Ración'!$E17>0,IF(CálculosEV!Q16>0,1,\"No\"),\"\")","v":""},{"$f":"IF('II_Plantear Ración'!$E17>0,IF(CálculosEV!R16>0,1,\"No\"),\"\")","v":""},{"$f":"IF('II_Plantear Ración'!$E17>0,IF(CálculosEV!S16>0,1,\"No\"),\"\")","v":""},{"$f":"IF('II_Plantear Ración'!$E17>0,IF(CálculosEV!T16>0,1,\"No\"),\"\")","v":""},{"$f":"IF('II_Plantear Ración'!$E17>0,IF(CálculosEV!U16>0,1,\"No\"),\"\")","v":""},{"$f":"IF('II_Plantear Ración'!$E17>0,IF(CálculosEV!V16>0,1,\"No\"),\"\")","v":""},{"$f":"IF('II_Plantear Ración'!$E17>0,IF(CálculosEV!W16>0,1,\"No\"),\"\")","v":""},{"$f":"IF('II_Plantear Ración'!$E17>0,IF(CálculosEV!X16>0,1,\"No\"),\"\")","v":""},{"$f":"IF('II_Plantear Ración'!$E17>0,IF(CálculosEV!Y16>0,1,\"No\"),\"\")","v":""},{"$f":"IF('II_Plantear Ración'!$E17>0,IF(CálculosEV!Z16>0,1,\"No\"),\"\")","v":""},{"$f":"IF('II_Plantear Ración'!$E17>0,IF(CálculosEV!AA16>0,1,\"No\"),\"\")","v":""},{"$f":"IF('II_Plantear Ración'!$E17>0,IF(CálculosEV!AB16>0,1,\"No\"),\"\")","v":""},{"$f":"IF('II_Plantear Ración'!$E17>0,IF(CálculosEV!AC16>0,1,\"No\"),\"\")","v":""},{"$f":"IF('II_Plantear Ración'!$E17>0,IF(CálculosEV!AD16>0,1,\"No\"),\"\")","v":""},{"$f":"IF('II_Plantear Ración'!$E17>0,IF(CálculosEV!AE16>0,1,\"No\"),\"\")","v":""},{"$f":"IF('II_Plantear Ración'!$E17>0,IF(CálculosEV!AF16>0,1,\"No\"),\"\")","v":""},{"$f":"IF('II_Plantear Ración'!$E17>0,IF(CálculosEV!AG16>0,1,\"No\"),\"\")","v":""},{"$f":"IF('II_Plantear Ración'!$E17>0,IF(CálculosEV!AH16>0,1,\"No\"),\"\")","v":""},{"$f":"IF('II_Plantear Ración'!$E17>0,IF(CálculosEV!AI16>0,1,\"No\"),\"\")","v":""},{"$f":"IF('II_Plantear Ración'!$E17>0,IF(CálculosEV!AJ16>0,1,\"No\"),\"\")","v":""},{"$f":"IF('II_Plantear Ración'!$E17>0,IF(CálculosEV!AK16>0,1,\"No\"),\"\")","v":""},{"$f":"IF('II_Plantear Ración'!$E17>0,IF(CálculosEV!AL16>0,1,\"No\"),\"\")","v":""},{"$f":"IF('II_Plantear Ración'!$E17>0,IF(CálculosEV!AM16>0,1,\"No\"),\"\")","v":""},0,0,0,0,0,0,0,0,0,0,0,0,0,0,0,0,0,0,0,0,0,0,0,0,0,0,0,0,0,0,0,0,0,0,0]
[null,{"$f":"IF(OFFSET('Tabla Concentrados'!$A$1,C17,0,1,1)=0,\"\",OFFSET('Tabla Concentrados'!$A$1,C17,0,1,1))","v":"Grasa vegetal, manteca de cerdo (todos los tipos)"},74,{"$f":"OFFSET('Tabla Concentrados'!$A$1,$C17,$D$2,1,1)","v":99.9},{"$f":"OFFSET('Tabla Concentrados'!$A$1,$C17,$E$2,1,1)","v":0},{"$f":"OFFSET('Tabla Concentrados'!$A$1,$C17,$F$2,1,1)","v":3.61},{"$f":"OFFSET('Tabla Concentrados'!$A$1,$C17,$G$2,1,1)","v":9.9999999999999995E-8},{"$f":"OFFSET('Tabla Concentrados'!$A$1,$C17,$H$2,1,1)","v":-14},{"$f":"OFFSET('Tabla Concentrados'!$A$1,$C17,$I$2,1,1)","v":2},{"$f":"OFFSET('Tabla Concentrados'!$A$1,$C17,$J$2,1,1)","v":5.5000000000000003E-8},{"$f":"OFFSET('Tabla Concentrados'!$A$1,$C17,$K$2,1,1)","v":6.8E-8},{"$f":"OFFSET('Tabla Concentrados'!$A$1,$C17,$L$2,1,1)","v":9.9999999999999995E-8},{"$f":"OFFSET('Tabla Concentrados'!$A$1,$C17,$M$2,1,1)","v":9.9999999999999995E-8},{"$f":"OFFSET('Tabla Concentrados'!$A$1,$C17,$N$2,1,1)","v":9.9999999999999995E-8},{"$f":"OFFSET('Tabla Concentrados'!$A$1,$C17,$O$2,1,1)","v":9.9999999999999995E-8},{"$f":"OFFSET('Tabla Concentrados'!$A$1,$C17,$P$2,1,1)","v":9.9999999999999995E-8},{"$f":"OFFSET('Tabla Concentrados'!$A$1,$C17,$Q$2,1,1)","v":9.9999999999999995E-8},{"$f":"OFFSET('Tabla Concentrados'!$A$1,$C17,$R$2,1,1)","v":9.9999999999999995E-8},{"$f":"OFFSET('Tabla Concentrados'!$A$1,$C17,$S$2,1,1)","v":9.9999999999999995E-8},{"$f":"OFFSET('Tabla Concentrados'!$A$1,$C17,$T$2,1,1)","v":9.9999999999999995E-8},{"$f":"OFFSET('Tabla Concentrados'!$A$1,$C17,$U$2,1,1)","v":0},{"$f":"OFFSET('Tabla Concentrados'!$A$1,$C17,$V$2,1,1)","v":9.9999999999999995E-8},{"$f":"OFFSET('Tabla Concentrados'!$A$1,$C17,$W$2,1,1)","v":1300},{"$f":"OFFSET('Tabla Concentrados'!$A$1,$C17,$X$2,1,1)","v":9.9999999999999995E-8},{"$f":"OFFSET('Tabla Concentrados'!$A$1,$C17,$Y$2,1,1)","v":95},{"$f":"OFFSET('Tabla Concentrados'!$A$1,$C17,$Z$2,1,1)","v":999},{"$f":"OFFSET('Tabla Concentrados'!$A$1,$C17,$AA$2,1,1)","v":9.9999999999999995E-8},{"$f":"OFFSET('Tabla Concentrados'!$A$1,$C17,$AB$2,1,1)","v":9.9999999999999995E-8},{"$f":"OFFSET('Tabla Concentrados'!$A$1,$C17,$AC$2,1,1)","v":0.9},{"$f":"OFFSET('Tabla Concentrados'!$A$1,$C17,$AD$2,1,1)","v":9.9999999999999995E-8},{"$f":"OFFSET('Tabla Concentrados'!$A$1,$C17,$AE$2,1,1)","v":999},{"$f":"OFFSET('Tabla Concentrados'!$A$1,$C17,$AF$2,1,1)","v":9.9999999999999995E-8},{"$f":"OFFSET('Tabla Concentrados'!$A$1,$C17,$AG$2,1,1)","v":9.9999999999999995E-8},{"$f":"OFFSET('Tabla Concentrados'!$A$1,$C17,$AH$2,1,1)","v":9.9999999999999995E-8},{"$f":"OFFSET('Tabla Concentrados'!$A$1,$C17,$AI$2,1,1)","v":9.9999999999999995E-8},{"$f":"OFFSET('Tabla Concentrados'!$A$1,$C17,$AJ$2,1,1)","v":9.9999999999999995E-8},{"$f":"OFFSET('Tabla Concentrados'!$A$1,$C17,$AK$2,1,1)","v":9.9999999999999995E-8},{"$f":"OFFSET('Tabla Concentrados'!$A$1,$C17,$AL$2,1,1)","v":0},{"$f":"OFFSET('Tabla Concentrados'!$A$1,$C17,$AM$2,1,1)","v":0},{"$f":"IF('II_Plantear Ración'!$E18>0,IF(CálculosEV!E17>=0,1,\"No\"),\"\")","v":1},{"$f":"IF('II_Plantear Ración'!$E18>0,IF(CálculosEV!F17>0,1,\"No\"),\"\")","v":1},{"$f":"IF('II_Plantear Ración'!$E18>0,IF(CálculosEV!G17>0,1,\"No\"),\"\")","v":1},{"$f":"IF('II_Plantear Ración'!$E18>0,IF(CálculosEV!H17=0,\"No\",1),\"\")","v":1},{"$f":"IF('II_Plantear Ración'!$E18>0,IF(CálculosEV!I17>0,1,\"No\"),\"\")","v":1},{"$f":"IF('II_Plantear Ración'!$E18>0,IF(CálculosEV!J17>0,1,\"No\"),\"\")","v":1},{"$f":"IF('II_Plantear Ración'!$E18>0,IF(CálculosEV!K17>0,1,\"No\"),\"\")","v":1},{"$f":"IF('II_Plantear Ración'!$E18>0,IF(CálculosEV!L17>0,1,\"No\"),\"\")","v":1},{"$f":"IF('II_Plantear Ración'!$E18>0,IF(CálculosEV!M17>0,1,\"No\"),\"\")","v":1},{"$f":"IF('II_Plantear Ración'!$E18>0,IF(CálculosEV!N17>0,1,\"No\"),\"\")","v":1},{"$f":"IF('II_Plantear Ración'!$E18>0,IF(CálculosEV!O17>0,1,\"No\"),\"\")","v":1},{"$f":"IF('II_Plantear Ración'!$E18>0,IF(CálculosEV!P17>0,1,\"No\"),\"\")","v":1},{"$f":"IF('II_Plantear Ración'!$E18>0,IF(CálculosEV!Q17>0,1,\"No\"),\"\")","v":1},{"$f":"IF('II_Plantear Ración'!$E18>0,IF(CálculosEV!R17>0,1,\"No\"),\"\")","v":1},{"$f":"IF('II_Plantear Ración'!$E18>0,IF(CálculosEV!S17>0,1,\"No\"),\"\")","v":1},{"$f":"IF('II_Plantear Ración'!$E18>0,IF(CálculosEV!T17>0,1,\"No\"),\"\")","v":1},{"$f":"IF('II_Plantear Ración'!$E18>0,IF(CálculosEV!U17>0,1,\"No\"),\"\")","v":"No"},{"$f":"IF('II_Plantear Ración'!$E18>0,IF(CálculosEV!V17>0,1,\"No\"),\"\")","v":1},{"$f":"IF('II_Plantear Ración'!$E18>0,IF(CálculosEV!W17>0,1,\"No\"),\"\")","v":1},{"$f":"IF('II_Plantear Ración'!$E18>0,IF(CálculosEV!X17>0,1,\"No\"),\"\")","v":1},{"$f":"IF('II_Plantear Ración'!$E18>0,IF(CálculosEV!Y17>0,1,\"No\"),\"\")","v":1},{"$f":"IF('II_Plantear Ración'!$E18>0,IF(CálculosEV!Z17>0,1,\"No\"),\"\")","v":1},{"$f":"IF('II_Plantear Ración'!$E18>0,IF(CálculosEV!AA17>0,1,\"No\"),\"\")","v":1},{"$f":"IF('II_Plantear Ración'!$E18>0,IF(CálculosEV!AB17>0,1,\"No\"),\"\")","v":1},{"$f":"IF('II_Plantear Ración'!$E18>0,IF(CálculosEV!AC17>0,1,\"No\"),\"\")","v":1},{"$f":"IF('II_Plantear Ración'!$E18>0,IF(CálculosEV!AD17>0,1,\"No\"),\"\")","v":1},{"$f":"IF('II_Plantear Ración'!$E18>0,IF(CálculosEV!AE17>0,1,\"No\"),\"\")","v":1},{"$f":"IF('II_Plantear Ración'!$E18>0,IF(CálculosEV!AF17>0,1,\"No\"),\"\")","v":1},{"$f":"IF('II_Plantear Ración'!$E18>0,IF(CálculosEV!AG17>0,1,\"No\"),\"\")","v":1},{"$f":"IF('II_Plantear Ración'!$E18>0,IF(CálculosEV!AH17>0,1,\"No\"),\"\")","v":1},{"$f":"IF('II_Plantear Ración'!$E18>0,IF(CálculosEV!AI17>0,1,\"No\"),\"\")","v":1},{"$f":"IF('II_Plantear Ración'!$E18>0,IF(CálculosEV!AJ17>0,1,\"No\"),\"\")","v":1},{"$f":"IF('II_Plantear Ración'!$E18>0,IF(CálculosEV!AK17>0,1,\"No\"),\"\")","v":1},{"$f":"IF('II_Plantear Ración'!$E18>0,IF(CálculosEV!AL17>0,1,\"No\"),\"\")","v":"No"},{"$f":"IF('II_Plantear Ración'!$E18>0,IF(CálculosEV!AM17>0,1,\"No\"),\"\")","v":"No"},1,1,1,1,1,1,1,1,1,1,1,1,1,1,1,1,1,1,1,1,1,1,1,1,1,1,1,1,1,1,1,1,1,1,1]
[null,{"$f":"IF(OFFSET('Tabla Concentrados'!$A$1,C18,0,1,1)=0,\"\",OFFSET('Tabla Concentrados'!$A$1,C18,0,1,1))","v":"Urea"},76,{"$f":"OFFSET('Tabla Concentrados'!$A$1,$C18,$D$2,1,1)","v":99},{"$f":"OFFSET('Tabla Concentrados'!$A$1,$C18,$E$2,1,1)","v":0},{"$f":"OFFSET('Tabla Concentrados'!$A$1,$C18,$F$2,1,1)","v":0.26},{"$f":"OFFSET('Tabla Concentrados'!$A$1,$C18,$G$2,1,1)","v":71},{"$f":"OFFSET('Tabla Concentrados'!$A$1,$C18,$H$2,1,1)","v":2557},{"$f":"OFFSET('Tabla Concentrados'!$A$1,$C18,$I$2,1,1)","v":2},{"$f":"OFFSET('Tabla Concentrados'!$A$1,$C18,$J$2,1,1)","v":0},{"$f":"OFFSET('Tabla Concentrados'!$A$1,$C18,$K$2,1,1)","v":0},{"$f":"OFFSET('Tabla Concentrados'!$A$1,$C18,$L$2,1,1)","v":9.9999999999999995E-7},{"$f":"OFFSET('Tabla Concentrados'!$A$1,$C18,$M$2,1,1)","v":9.9999999999999995E-7},{"$f":"OFFSET('Tabla Concentrados'!$A$1,$C18,$N$2,1,1)","v":9.9999999999999995E-7},{"$f":"OFFSET('Tabla Concentrados'!$A$1,$C18,$O$2,1,1)","v":9.9999999999999995E-7},{"$f":"OFFSET('Tabla Concentrados'!$A$1,$C18,$P$2,1,1)","v":9.9999999999999995E-7},{"$f":"OFFSET('Tabla Concentrados'!$A$1,$C18,$Q$2,1,1)","v":9.9999999999999995E-7},{"$f":"OFFSET('Tabla Concentrados'!$A$1,$C18,$R$2,1,1)","v":9.9999999999999995E-7},{"$f":"OFFSET('Tabla Concentrados'!$A$1,$C18,$S$2,1,1)","v":9.9999999999999995E-7},{"$f":"OFFSET('Tabla Concentrados'!$A$1,$C18,$T$2,1,1)","v":9.9999999999999995E-7},{"$f":"OFFSET('Tabla Concentrados'!$A$1,$C18,$U$2,1,1)","v":0},{"$f":"OFFSET('Tabla Concentrados'!$A$1,$C18,$V$2,1,1)","v":9.9999999999999995E-7},{"$f":"OFFSET('Tabla Concentrados'!$A$1,$C18,$W$2,1,1)","v":9.9999999999999995E-7},{"$f":"OFFSET('Tabla Concentrados'!$A$1,$C18,$X$2,1,1)","v":9.9999999999999995E-7},{"$f":"OFFSET('Tabla Concentrados'!$A$1,$C18,$Y$2,1,1)","v":9.9999999999999995E-7},{"$f":"OFFSET('Tabla Concentrados'!$A$1,$C18,$Z$2,1,1)","v":0},{"$f":"OFFSET('Tabla Concentrados'!$A$1,$C18,$AA$2,1,1)","v":2870},{"$f":"OFFSET('Tabla Concentrados'!$A$1,$C18,$AB$2,1,1)","v":9.9999999999999995E-7},{"$f":"OFFSET('Tabla Concentrados'!$A$1,$C18,$AC$2,1,1)","v":0.99},{"$f":"OFFSET('Tabla Concentrados'!$A$1,$C18,$AD$2,1,1)","v":9.9999999999999995E-7},{"$f":"OFFSET('Tabla Concentrados'!$A$1,$C18,$AE$2,1,1)","v":9.9999999999999995E-7},{"$f":"OFFSET('Tabla Concentrados'!$A$1,$C18,$AF$2,1,1)","v":9.9999999999999995E-7},{"$f":"OFFSET('Tabla Concentrados'!$A$1,$C18,$AG$2,1,1)","v":9.9999999999999995E-7},{"$f":"OFFSET('Tabla Concentrados'!$A$1,$C18,$AH$2,1,1)","v":9.9999999999999995E-7},{"$f":"OFFSET('Tabla Concentrados'!$A$1,$C18,$AI$2,1,1)","v":9.9999999999999995E-7},{"$f":"OFFSET('Tabla Concentrados'!$A$1,$C18,$AJ$2,1,1)","v":9.9999999999999995E-7},{"$f":"OFFSET('Tabla Concentrados'!$A$1,$C18,$AK$2,1,1)","v":9.9999999999999995E-7},{"$f":"OFFSET('Tabla Concentrados'!$A$1,$C18,$AL$2,1,1)","v":0},{"$f":"OFFSET('Tabla Concentrados'!$A$1,$C18,$AM$2,1,1)","v":0},{"$f":"IF('II_Plantear Ración'!$E19>0,IF(CálculosEV!E18>=0,1,\"No\"),\"\")","v":""},{"$f":"IF('II_Plantear Ración'!$E19>0,IF(CálculosEV!F18>0,1,\"No\"),\"\")","v":""},{"$f":"IF('II_Plantear Ración'!$E19>0,IF(CálculosEV!G18>0,1,\"No\"),\"\")","v":""},{"$f":"IF('II_Plantear Ración'!$E19>0,IF(CálculosEV!H18=0,\"No\",1),\"\")","v":""},{"$f":"IF('II_Plantear Ración'!$E19>0,IF(CálculosEV!I18>0,1,\"No\"),\"\")","v":""},{"$f":"IF('II_Plantear Ración'!$E19>0,IF(CálculosEV!J18>0,1,\"No\"),\"\")","v":""},{"$f":"IF('II_Plantear Ración'!$E19>0,IF(CálculosEV!K18>0,1,\"No\"),\"\")","v":""},{"$f":"IF('II_Plantear Ración'!$E19>0,IF(CálculosEV!L18>0,1,\"No\"),\"\")","v":""},{"$f":"IF('II_Plantear Ración'!$E19>0,IF(CálculosEV!M18>0,1,\"No\"),\"\")","v":""},{"$f":"IF('II_Plantear Ración'!$E19>0,IF(CálculosEV!N18>0,1,\"No\"),\"\")","v":""},{"$f":"IF('II_Plantear Ración'!$E19>0,IF(CálculosEV!O18>0,1,\"No\"),\"\")","v":""},{"$f":"IF('II_Plantear Ración'!$E19>0,IF(CálculosEV!P18>0,1,\"No\"),\"\")","v":""},{"$f":"IF('II_Plantear Ración'!$E19>0,IF(CálculosEV!Q18>0,1,\"No\"),\"\")","v":""},{"$f":"IF('II_Plantear Ración'!$E19>0,IF(CálculosEV!R18>0,1,\"No\"),\"\")","v":""},{"$f":"IF('II_Plantear Ración'!$E19>0,IF(CálculosEV!S18>0,1,\"No\"),\"\")","v":""},{"$f":"IF('II_Plantear Ración'!$E19>0,IF(CálculosEV!T18>0,1,\"No\"),\"\")","v":""},{"$f":"IF('II_Plantear Ración'!$E19>0,IF(CálculosEV!U18>0,1,\"No\"),\"\")","v":""},{"$f":"IF('II_Plantear Ración'!$E19>0,IF(CálculosEV!V18>0,1,\"No\"),\"\")","v":""},{"$f":"IF('II_Plantear Ración'!$E19>0,IF(CálculosEV!W18>0,1,\"No\"),\"\")","v":""},{"$f":"IF('II_Plantear Ración'!$E19>0,IF(CálculosEV!X18>0,1,\"No\"),\"\")","v":""},{"$f":"IF('II_Plantear Ración'!$E19>0,IF(CálculosEV!Y18>0,1,\"No\"),\"\")","v":""},{"$f":"IF('II_Plantear Ración'!$E19>0,IF(CálculosEV!Z18>0,1,\"No\"),\"\")","v":""},{"$f":"IF('II_Plantear Ración'!$E19>0,IF(CálculosEV!AA18>0,1,\"No\"),\"\")","v":""},{"$f":"IF('II_Plantear Ración'!$E19>0,IF(CálculosEV!AB18>0,1,\"No\"),\"\")","v":""},{"$f":"IF('II_Plantear Ración'!$E19>0,IF(CálculosEV!AC18>0,1,\"No\"),\"\")","v":""},{"$f":"IF('II_Plantear Ración'!$E19>0,IF(CálculosEV!AD18>0,1,\"No\"),\"\")","v":""},{"$f":"IF('II_Plantear Ración'!$E19>0,IF(CálculosEV!AE18>0,1,\"No\"),\"\")","v":""},{"$f":"IF('II_Plantear Ración'!$E19>0,IF(CálculosEV!AF18>0,1,\"No\"),\"\")","v":""},{"$f":"IF('II_Plantear Ración'!$E19>0,IF(CálculosEV!AG18>0,1,\"No\"),\"\")","v":""},{"$f":"IF('II_Plantear Ración'!$E19>0,IF(CálculosEV!AH18>0,1,\"No\"),\"\")","v":""},{"$f":"IF('II_Plantear Ración'!$E19>0,IF(CálculosEV!AI18>0,1,\"No\"),\"\")","v":""},{"$f":"IF('II_Plantear Ración'!$E19>0,IF(CálculosEV!AJ18>0,1,\"No\"),\"\")","v":""},{"$f":"IF('II_Plantear Ración'!$E19>0,IF(CálculosEV!AK18>0,1,\"No\"),\"\")","v":""},{"$f":"IF('II_Plantear Ración'!$E19>0,IF(CálculosEV!AL18>0,1,\"No\"),\"\")","v":""},{"$f":"IF('II_Plantear Ración'!$E19>0,IF(CálculosEV!AM18>0,1,\"No\"),\"\")","v":""},0,0,0,0,0,0,0,0,0,0,0,0,0,0,0,0,0,0,0,0,0,0,0,0,0,0,0,0,0,0,0,0,0,0,0]
[null,{"$f":"IF(OFFSET('Tabla Concentrados'!$A$1,C19,0,1,1)=0,\"\",OFFSET('Tabla Concentrados'!$A$1,C19,0,1,1))","v":""},1,{"$f":"OFFSET('Tabla Concentrados'!$A$1,$C19,$D$2,1,1)","v":0},{"$f":"OFFSET('Tabla Concentrados'!$A$1,$C19,$E$2,1,1)","v":0},{"$f":"OFFSET('Tabla Concentrados'!$A$1,$C19,$F$2,1,1)","v":0},{"$f":"OFFSET('Tabla Concentrados'!$A$1,$C19,$G$2,1,1)","v":0},{"$f":"OFFSET('Tabla Concentrados'!$A$1,$C19,$H$2,1,1)","v":0},{"$f":"OFFSET('Tabla Concentrados'!$A$1,$C19,$I$2,1,1)","v":0},{"$f":"OFFSET('Tabla Concentrados'!$A$1,$C19,$J$2,1,1)","v":0},{"$f":"OFFSET('Tabla Concentrados'!$A$1,$C19,$K$2,1,1)","v":0},{"$f":"OFFSET('Tabla Concentrados'!$A$1,$C19,$L$2,1,1)","v":0},{"$f":"OFFSET('Tabla Concentrados'!$A$1,$C19,$M$2,1,1)","v":0},{"$f":"OFFSET('Tabla Concentrados'!$A$1,$C19,$N$2,1,1)","v":0},{"$f":"OFFSET('Tabla Concentrados'!$A$1,$C19,$O$2,1,1)","v":0},{"$f":"OFFSET('Tabla Concentrados'!$A$1,$C19,$P$2,1,1)","v":0},{"$f":"OFFSET('Tabla Concentrados'!$A$1,$C19,$Q$2,1,1)","v":0},{"$f":"OFFSET('Tabla Concentrados'!$A$1,$C19,$R$2,1,1)","v":0},{"$f":"OFFSET('Tabla Concentrados'!$A$1,$C19,$S$2,1,1)","v":0},{"$f":"OFFSET('Tabla Concentrados'!$A$1,$C19,$T$2,1,1)","v":0},{"$f":"OFFSET('Tabla Concentrados'!$A$1,$C19,$U$2,1,1)","v":0},{"$f":"OFFSET('Tabla Concentrados'!$A$1,$C19,$V$2,1,1)","v":0},{"$f":"OFFSET('Tabla Concentrados'!$A$1,$C19,$W$2,1,1)","v":0},{"$f":"OFFSET('Tabla Concentrados'!$A$1,$C19,$X$2,1,1)","v":0},{"$f":"OFFSET('Tabla Concentrados'!$A$1,$C19,$Y$2,1,1)","v":0},{"$f":"OFFSET('Tabla Concentrados'!$A$1,$C19,$Z$2,1,1)","v":0},{"$f":"OFFSET('Tabla Concentrados'!$A$1,$C19,$AA$2,1,1)","v":0},{"$f":"OFFSET('Tabla Concentrados'!$A$1,$C19,$AB$2,1,1)","v":0},{"$f":"OFFSET('Tabla Concentrados'!$A$1,$C19,$AC$2,1,1)","v":0},{"$f":"OFFSET('Tabla Concentrados'!$A$1,$C19,$AD$2,1,1)","v":0},{"$f":"OFFSET('Tabla Concentrados'!$A$1,$C19,$AE$2,1,1)","v":0},{"$f":"OFFSET('Tabla Concentrados'!$A$1,$C19,$AF$2,1,1)","v":0},{"$f":"OFFSET('Tabla Concentrados'!$A$1,$C19,$AG$2,1,1)","v":0},{"$f":"OFFSET('Tabla Concentrados'!$A$1,$C19,$AH$2,1,1)","v":0},{"$f":"OFFSET('Tabla Concentrados'!$A$1,$C19,$AI$2,1,1)","v":0},{"$f":"OFFSET('Tabla Concentrados'!$A$1,$C19,$AJ$2,1,1)","v":0},{"$f":"OFFSET('Tabla Concentrados'!$A$1,$C19,$AK$2,1,1)","v":0},{"$f":"OFFSET('Tabla Concentrados'!$A$1,$C19,$AL$2,1,1)","v":0},{"$f":"OFFSET('Tabla Concentrados'!$A$1,$C19,$AM$2,1,1)","v":0},{"$f":"IF('II_Plantear Ración'!$E20>0,IF(CálculosEV!E19>=0,1,\"No\"),\"\")","v":""},{"$f":"IF('II_Plantear Ración'!$E20>0,IF(CálculosEV!F19>0,1,\"No\"),\"\")","v":""},{"$f":"IF('II_Plantear Ración'!$E20>0,IF(CálculosEV!G19>0,1,\"No\"),\"\")","v":""},{"$f":"IF('II_Plantear Ración'!$E20>0,IF(CálculosEV!H19=0,\"No\",1),\"\")","v":""},{"$f":"IF('II_Plantear Ración'!$E20>0,IF(CálculosEV!I19>0,1,\"No\"),\"\")","v":""},{"$f":"IF('II_Plantear Ración'!$E20>0,IF(CálculosEV!J19>0,1,\"No\"),\"\")","v":""},{"$f":"IF('II_Plantear Ración'!$E20>0,IF(CálculosEV!K19>0,1,\"No\"),\"\")","v":""},{"$f":"IF('II_Plantear Ración'!$E20>0,IF(CálculosEV!L19>0,1,\"No\"),\"\")","v":""},{"$f":"IF('II_Plantear Ración'!$E20>0,IF(CálculosEV!M19>0,1,\"No\"),\"\")","v":""},{"$f":"IF('II_Plantear Ración'!$E20>0,IF(CálculosEV!N19>0,1,\"No\"),\"\")","v":""},{"$f":"IF('II_Plantear Ración'!$E20>0,IF(CálculosEV!O19>0,1,\"No\"),\"\")","v":""},{"$f":"IF('II_Plantear Ración'!$E20>0,IF(CálculosEV!P19>0,1,\"No\"),\"\")","v":""},{"$f":"IF('II_Plantear Ración'!$E20>0,IF(CálculosEV!Q19>0,1,\"No\"),\"\")","v":""},{"$f":"IF('II_Plantear Ración'!$E20>0,IF(CálculosEV!R19>0,1,\"No\"),\"\")","v":""},{"$f":"IF('II_Plantear Ración'!$E20>0,IF(CálculosEV!S19>0,1,\"No\"),\"\")","v":""},{"$f":"IF('II_Plantear Ración'!$E20>0,IF(CálculosEV!T19>0,1,\"No\"),\"\")","v":""},{"$f":"IF('II_Plantear Ración'!$E20>0,IF(CálculosEV!U19>0,1,\"No\"),\"\")","v":""},{"$f":"IF('II_Plantear Ración'!$E20>0,IF(CálculosEV!V19>0,1,\"No\"),\"\")","v":""},{"$f":"IF('II_Plantear Ración'!$E20>0,IF(CálculosEV!W19>0,1,\"No\"),\"\")","v":""},{"$f":"IF('II_Plantear Ración'!$E20>0,IF(CálculosEV!X19>0,1,\"No\"),\"\")","v":""},{"$f":"IF('II_Plantear Ración'!$E20>0,IF(CálculosEV!Y19>0,1,\"No\"),\"\")","v":""},{"$f":"IF('II_Plantear Ración'!$E20>0,IF(CálculosEV!Z19>0,1,\"No\"),\"\")","v":""},{"$f":"IF('II_Plantear Ración'!$E20>0,IF(CálculosEV!AA19>0,1,\"No\"),\"\")","v":""},{"$f":"IF('II_Plantear Ración'!$E20>0,IF(CálculosEV!AB19>0,1,\"No\"),\"\")","v":""},{"$f":"IF('II_Plantear Ración'!$E20>0,IF(CálculosEV!AC19>0,1,\"No\"),\"\")","v":""},{"$f":"IF('II_Plantear Ración'!$E20>0,IF(CálculosEV!AD19>0,1,\"No\"),\"\")","v":""},{"$f":"IF('II_Plantear Ración'!$E20>0,IF(CálculosEV!AE19>0,1,\"No\"),\"\")","v":""},{"$f":"IF('II_Plantear Ración'!$E20>0,IF(CálculosEV!AF19>0,1,\"No\"),\"\")","v":""},{"$f":"IF('II_Plantear Ración'!$E20>0,IF(CálculosEV!AG19>0,1,\"No\"),\"\")","v":""},{"$f":"IF('II_Plantear Ración'!$E20>0,IF(CálculosEV!AH19>0,1,\"No\"),\"\")","v":""},{"$f":"IF('II_Plantear Ración'!$E20>0,IF(CálculosEV!AI19>0,1,\"No\"),\"\")","v":""},{"$f":"IF('II_Plantear Ración'!$E20>0,IF(CálculosEV!AJ19>0,1,\"No\"),\"\")","v":""},{"$f":"IF('II_Plantear Ración'!$E20>0,IF(CálculosEV!AK19>0,1,\"No\"),\"\")","v":""},{"$f":"IF('II_Plantear Ración'!$E20>0,IF(CálculosEV!AL19>0,1,\"No\"),\"\")","v":""},{"$f":"IF('II_Plantear Ración'!$E20>0,IF(CálculosEV!AM19>0,1,\"No\"),\"\")","v":""},0,0,0,0,0,0,0,0,0,0,0,0,0,0,0,0,0,0,0,0,0,0,0,0,0,0,0,0,0,0,0,0,0,0,0]
["MINERALS",{"$f":"IF(OFFSET('Tabla Minerales-aa'!$A$1,C20,0,1,1)=0,\"\",OFFSET('Tabla Minerales-aa'!$A$1,C20,0,1,1))","v":"Carbonato de cobalto"},10,{"$f":"OFFSET('Tabla Minerales-aa'!$A$1,$C20,D2,1,1)","v":100},{"$f":"OFFSET('Tabla Minerales-aa'!$A$1,$C20,E2,1,1)","v":0},{"$f":"OFFSET('Tabla Minerales-aa'!$A$1,$C20,F2,1,1)","v":0},{"$f":"OFFSET('Tabla Minerales-aa'!$A$1,$C20,G2,1,1)","v":0},{"$f":"OFFSET('Tabla Minerales-aa'!$A$1,$C20,H2,1,1)","v":0},{"$f":"OFFSET('Tabla Minerales-aa'!$A$1,$C20,I2,1,1)","v":0},{"$f":"OFFSET('Tabla Minerales-aa'!$A$1,$C20,J2,1,1)","v":0},{"$f":"OFFSET('Tabla Minerales-aa'!$A$1,$C20,K2,1,1)","v":0},{"$f":"OFFSET('Tabla Minerales-aa'!$A$1,$C20,L$2,1,1)","v":0},{"$f":"OFFSET('Tabla Minerales-aa'!$A$1,$C20,M$2,1,1)","v":0},{"$f":"OFFSET('Tabla Minerales-aa'!$A$1,$C20,N$2,1,1)","v":0},{"$f":"OFFSET('Tabla Minerales-aa'!$A$1,$C20,O$2,1,1)","v":0},{"$f":"OFFSET('Tabla Minerales-aa'!$A$1,$C20,P$2,1,1)","v":0},{"$f":"OFFSET('Tabla Minerales-aa'!$A$1,$C20,Q$2,1,1)","v":49},{"$f":"OFFSET('Tabla Minerales-aa'!$A$1,$C20,R$2,1,1)","v":0},{"$f":"OFFSET('Tabla Minerales-aa'!$A$1,$C20,S$2,1,1)","v":0},{"$f":"OFFSET('Tabla Minerales-aa'!$A$1,$C20,T$2,1,1)","v":0},{"$f":"OFFSET('Tabla Minerales-aa'!$A$1,$C20,U$2,1,1)","v":0},{"$f":"OFFSET('Tabla Minerales-aa'!$A$1,$C20,V$2,1,1)","v":0},{"$f":"OFFSET('Tabla Minerales-aa'!$A$1,$C20,W$2,1,1)","v":0},{"$f":"OFFSET('Tabla Minerales-aa'!$A$1,$C20,X$2,1,1)","v":0},{"$f":"OFFSET('Tabla Minerales-aa'!$A$1,$C20,Y$2,1,1)","v":0},{"$f":"OFFSET('Tabla Minerales-aa'!$A$1,$C20,Z$2,1,1)","v":0},{"$f":"OFFSET('Tabla Minerales-aa'!$A$1,$C20,AA$2,1,1)","v":0},{"$f":"OFFSET('Tabla Minerales-aa'!$A$1,$C20,AB$2,1,1)","v":0},{"$f":"OFFSET('Tabla Minerales-aa'!$A$1,$C20,AC$2,1,1)","v":0},{"$f":"OFFSET('Tabla Minerales-aa'!$A$1,$C20,AD$2,1,1)","v":0},{"$f":"OFFSET('Tabla Minerales-aa'!$A$1,$C20,AE$2,1,1)","v":0},{"$f":"OFFSET('Tabla Minerales-aa'!$A$1,$C20,AF$2,1,1)","v":0},{"$f":"OFFSET('Tabla Minerales-aa'!$A$1,$C20,AG$2,1,1)","v":0},{"$f":"OFFSET('Tabla Minerales-aa'!$A$1,$C20,AH$2,1,1)","v":0},{"$f":"OFFSET('Tabla Minerales-aa'!$A$1,$C20,AI$2,1,1)","v":0},{"$f":"OFFSET('Tabla Minerales-aa'!$A$1,$C20,AJ$2,1,1)","v":0},{"$f":"OFFSET('Tabla Minerales-aa'!$A$1,$C20,AK$2,1,1)","v":0},{"$f":"OFFSET('Tabla Minerales-aa'!$A$1,$C20,AL$2,1,1)","v":0},{"$f":"OFFSET('Tabla Minerales-aa'!$A$1,$C20,AM$2,1,1)","v":0},{"$f":"SUM(AN3:AN19)","v":4},4,4,4,4,4,4,3,3,3,1,1,3,3,3,3,0,3,3,2,4,4,4,4,4,4,4,4,4,4,3,4,3,3,3,{"$f":"SUM(BW3:BW19)","v":4},4,4,4,4,4,4,4,4,4,4,4,4,4,4,4,4,4,4,4,4,4,4,4,4,4,4,4,4,{"$f":"SUM(CZ3:CZ19)","v":4},4,4,4,4,4]
[null,{"$f":"IF(OFFSET('Tabla Minerales-aa'!$A$1,C21,0,1,1)=0,\"\",OFFSET('Tabla Minerales-aa'!$A$1,C21,0,1,1))","v":"Fosfato bicálcico"},3,{"$f":"OFFSET('Tabla Minerales-aa'!$A$1,$C21,D2,1,1)","v":98.8},{"$f":"OFFSET('Tabla Minerales-aa'!$A$1,$C21,E2,1,1)","v":0},{"$f":"OFFSET('Tabla Minerales-aa'!$A$1,$C21,F2,1,1)","v":0},{"$f":"OFFSET('Tabla Minerales-aa'!$A$1,$C21,G2,1,1)","v":0},{"$f":"OFFSET('Tabla Minerales-aa'!$A$1,$C21,H2,1,1)","v":0},{"$f":"OFFSET('Tabla Minerales-aa'!$A$1,$C21,I2,1,1)","v":0},{"$f":"OFFSET('Tabla Minerales-aa'!$A$1,$C21,J2,1,1)","v":244},{"$f":"OFFSET('Tabla Minerales-aa'!$A$1,$C21,K2,1,1)","v":122.4},{"$f":"OFFSET('Tabla Minerales-aa'!$A$1,$C21,L$2,1,1)","v":5},{"$f":"OFFSET('Tabla Minerales-aa'!$A$1,$C21,M$2,1,1)","v":1.2},{"$f":"OFFSET('Tabla Minerales-aa'!$A$1,$C21,N$2,1,1)","v":0.8},{"$f":"OFFSET('Tabla Minerales-aa'!$A$1,$C21,O$2,1,1)","v":11},{"$f":"OFFSET('Tabla Minerales-aa'!$A$1,$C21,P$2,1,1)","v":0.4},{"$f":"OFFSET('Tabla Minerales-aa'!$A$1,$C21,Q$2,1,1)","v":0},{"$f":"OFFSET('Tabla Minerales-aa'!$A$1,$C21,R$2,1,1)","v":15},{"$f":"OFFSET('Tabla Minerales-aa'!$A$1,$C21,S$2,1,1)","v":0},{"$f":"OFFSET('Tabla Minerales-aa'!$A$1,$C21,T$2,1,1)","v":0},{"$f":"OFFSET('Tabla Minerales-aa'!$A$1,$C21,U$2,1,1)","v":0},{"$f":"OFFSET('Tabla Minerales-aa'!$A$1,$C21,V$2,1,1)","v":0},{"$f":"OFFSET('Tabla Minerales-aa'!$A$1,$C21,W$2,1,1)","v":0},{"$f":"OFFSET('Tabla Minerales-aa'!$A$1,$C21,X$2,1,1)","v":0},{"$f":"OFFSET('Tabla Minerales-aa'!$A$1,$C21,Y$2,1,1)","v":0},{"$f":"OFFSET('Tabla Minerales-aa'!$A$1,$C21,Z$2,1,1)","v":0},{"$f":"OFFSET('Tabla Minerales-aa'!$A$1,$C21,AA$2,1,1)","v":0},{"$f":"OFFSET('Tabla Minerales-aa'!$A$1,$C21,AB$2,1,1)","v":0},{"$f":"OFFSET('Tabla Minerales-aa'!$A$1,$C21,AC$2,1,1)","v":0},{"$f":"OFFSET('Tabla Minerales-aa'!$A$1,$C21,AD$2,1,1)","v":0},{"$f":"OFFSET('Tabla Minerales-aa'!$A$1,$C21,AE$2,1,1)","v":0},{"$f":"OFFSET('Tabla Minerales-aa'!$A$1,$C21,AF$2,1,1)","v":0},{"$f":"OFFSET('Tabla Minerales-aa'!$A$1,$C21,AG$2,1,1)","v":0},{"$f":"OFFSET('Tabla Minerales-aa'!$A$1,$C21,AH$2,1,1)","v":0},{"$f":"OFFSET('Tabla Minerales-aa'!$A$1,$C21,AI$2,1,1)","v":0},{"$f":"OFFSET('Tabla Minerales-aa'!$A$1,$C21,AJ$2,1,1)","v":836},{"$f":"OFFSET('Tabla Minerales-aa'!$A$1,$C21,AK$2,1,1)","v":0},{"$f":"OFFSET('Tabla Minerales-aa'!$A$1,$C21,AL$2,1,1)","v":0},{"$f":"OFFSET('Tabla Minerales-aa'!$A$1,$C21,AM$2,1,1)","v":0},{"$f":"IF(AN20/BW20=1,\"\",AN2)","v":""},"","","","","","",{"$f":"IF(AU20/CD20=1,\"\", AU2)","v":"Mg"},"K","Na","S","Cl","Co","Cu","Mn","Zn","Iodo","Se","Vit A","Vit D","","","","","","","","","","","Lignina","","Mo","DT_N","MOF"]
[null,{"$f":"IF(OFFSET('Tabla Minerales-aa'!$A$1,C22,0,1,1)=0,\"\",OFFSET('Tabla Minerales-aa'!$A$1,C22,0,1,1))","v":"Carbonato cálcico"},2,{"$f":"OFFSET('Tabla Minerales-aa'!$A$1,$C22,D2,1,1)","v":98},{"$f":"OFFSET('Tabla Minerales-aa'!$A$1,$C22,E2,1,1)","v":0},{"$f":"OFFSET('Tabla Minerales-aa'!$A$1,$C22,F2,1,1)","v":0},{"$f":"OFFSET('Tabla Minerales-aa'!$A$1,$C22,G2,1,1)","v":0},{"$f":"OFFSET('Tabla Minerales-aa'!$A$1,$C22,H2,1,1)","v":0},{"$f":"OFFSET('Tabla Minerales-aa'!$A$1,$C22,I2,1,1)","v":0},{"$f":"OFFSET('Tabla Minerales-aa'!$A$1,$C22,J2,1,1)","v":145.54},{"$f":"OFFSET('Tabla Minerales-aa'!$A$1,$C22,K2,1,1)","v":0},{"$f":"OFFSET('Tabla Minerales-aa'!$A$1,$C22,L$2,1,1)","v":14},{"$f":"OFFSET('Tabla Minerales-aa'!$A$1,$C22,M$2,1,1)","v":0.7},{"$f":"OFFSET('Tabla Minerales-aa'!$A$1,$C22,N$2,1,1)","v":0.7},{"$f":"OFFSET('Tabla Minerales-aa'!$A$1,$C22,O$2,1,1)","v":0.7},{"$f":"OFFSET('Tabla Minerales-aa'!$A$1,$C22,P$2,1,1)","v":0.2},{"$f":"OFFSET('Tabla Minerales-aa'!$A$1,$C22,Q$2,1,1)","v":0},{"$f":"OFFSET('Tabla Minerales-aa'!$A$1,$C22,R$2,1,1)","v":12},{"$f":"OFFSET('Tabla Minerales-aa'!$A$1,$C22,S$2,1,1)","v":0},{"$f":"OFFSET('Tabla Minerales-aa'!$A$1,$C22,T$2,1,1)","v":0},{"$f":"OFFSET('Tabla Minerales-aa'!$A$1,$C22,U$2,1,1)","v":0},{"$f":"OFFSET('Tabla Minerales-aa'!$A$1,$C22,V$2,1,1)","v":0},{"$f":"OFFSET('Tabla Minerales-aa'!$A$1,$C22,W$2,1,1)","v":0},{"$f":"OFFSET('Tabla Minerales-aa'!$A$1,$C22,X$2,1,1)","v":0},{"$f":"OFFSET('Tabla Minerales-aa'!$A$1,$C22,Y$2,1,1)","v":0},{"$f":"OFFSET('Tabla Minerales-aa'!$A$1,$C22,Z$2,1,1)","v":0},{"$f":"OFFSET('Tabla Minerales-aa'!$A$1,$C22,AA$2,1,1)","v":0},{"$f":"OFFSET('Tabla Minerales-aa'!$A$1,$C22,AB$2,1,1)","v":0},{"$f":"OFFSET('Tabla Minerales-aa'!$A$1,$C22,AC$2,1,1)","v":0},{"$f":"OFFSET('Tabla Minerales-aa'!$A$1,$C22,AD$2,1,1)","v":0},{"$f":"OFFSET('Tabla Minerales-aa'!$A$1,$C22,AE$2,1,1)","v":0},{"$f":"OFFSET('Tabla Minerales-aa'!$A$1,$C22,AF$2,1,1)","v":0},{"$f":"OFFSET('Tabla Minerales-aa'!$A$1,$C22,AG$2,1,1)","v":0},{"$f":"OFFSET('Tabla Minerales-aa'!$A$1,$C22,AH$2,1,1)","v":0},{"$f":"OFFSET('Tabla Minerales-aa'!$A$1,$C22,AI$2,1,1)","v":0},{"$f":"OFFSET('Tabla Minerales-aa'!$A$1,$C22,AJ$2,1,1)","v":955},{"$f":"OFFSET('Tabla Minerales-aa'!$A$1,$C22,AK$2,1,1)","v":0},{"$f":"OFFSET('Tabla Minerales-aa'!$A$1,$C22,AL$2,1,1)","v":0},{"$f":"OFFSET('Tabla Minerales-aa'!$A$1,$C22,AM$2,1,1)","v":0}]
[null,{"$f":"IF(OFFSET('Tabla Minerales-aa'!$A$1,C23,0,1,1)=0,\"\",OFFSET('Tabla Minerales-aa'!$A$1,C23,0,1,1))","v":"Fosfato sódico"},7,{"$f":"OFFSET('Tabla Minerales-aa'!$A$1,$C23,D2,1,1)","v":100},{"$f":"OFFSET('Tabla Minerales-aa'!$A$1,$C23,E2,1,1)","v":0},{"$f":"OFFSET('Tabla Minerales-aa'!$A$1,$C23,F2,1,1)","v":0},{"$f":"OFFSET('Tabla Minerales-aa'!$A$1,$C23,G2,1,1)","v":0},{"$f":"OFFSET('Tabla Minerales-aa'!$A$1,$C23,H2,1,1)","v":0},{"$f":"OFFSET('Tabla Minerales-aa'!$A$1,$C23,I2,1,1)","v":0},{"$f":"OFFSET('Tabla Minerales-aa'!$A$1,$C23,J2,1,1)","v":0},{"$f":"OFFSET('Tabla Minerales-aa'!$A$1,$C23,K2,1,1)","v":13.600000000000001},{"$f":"OFFSET('Tabla Minerales-aa'!$A$1,$C23,L$2,1,1)","v":0},{"$f":"OFFSET('Tabla Minerales-aa'!$A$1,$C23,M$2,1,1)","v":0},{"$f":"OFFSET('Tabla Minerales-aa'!$A$1,$C23,N$2,1,1)","v":19},{"$f":"OFFSET('Tabla Minerales-aa'!$A$1,$C23,O$2,1,1)","v":0},{"$f":"OFFSET('Tabla Minerales-aa'!$A$1,$C23,P$2,1,1)","v":0},{"$f":"OFFSET('Tabla Minerales-aa'!$A$1,$C23,Q$2,1,1)","v":0},{"$f":"OFFSET('Tabla Minerales-aa'!$A$1,$C23,R$2,1,1)","v":0},{"$f":"OFFSET('Tabla Minerales-aa'!$A$1,$C23,S$2,1,1)","v":0},{"$f":"OFFSET('Tabla Minerales-aa'!$A$1,$C23,T$2,1,1)","v":0},{"$f":"OFFSET('Tabla Minerales-aa'!$A$1,$C23,U$2,1,1)","v":0},{"$f":"OFFSET('Tabla Minerales-aa'!$A$1,$C23,V$2,1,1)","v":0},{"$f":"OFFSET('Tabla Minerales-aa'!$A$1,$C23,W$2,1,1)","v":0},{"$f":"OFFSET('Tabla Minerales-aa'!$A$1,$C23,X$2,1,1)","v":0},{"$f":"OFFSET('Tabla Minerales-aa'!$A$1,$C23,Y$2,1,1)","v":0},{"$f":"OFFSET('Tabla Minerales-aa'!$A$1,$C23,Z$2,1,1)","v":0},{"$f":"OFFSET('Tabla Minerales-aa'!$A$1,$C23,AA$2,1,1)","v":0},{"$f":"OFFSET('Tabla Minerales-aa'!$A$1,$C23,AB$2,1,1)","v":0},{"$f":"OFFSET('Tabla Minerales-aa'!$A$1,$C23,AC$2,1,1)","v":0},{"$f":"OFFSET('Tabla Minerales-aa'!$A$1,$C23,AD$2,1,1)","v":0},{"$f":"OFFSET('Tabla Minerales-aa'!$A$1,$C23,AE$2,1,1)","v":0},{"$f":"OFFSET('Tabla Minerales-aa'!$A$1,$C23,AF$2,1,1)","v":0},{"$f":"OFFSET('Tabla Minerales-aa'!$A$1,$C23,AG$2,1,1)","v":0},{"$f":"OFFSET('Tabla Minerales-aa'!$A$1,$C23,AH$2,1,1)","v":0},{"$f":"OFFSET('Tabla Minerales-aa'!$A$1,$C23,AI$2,1,1)","v":0},{"$f":"OFFSET('Tabla Minerales-aa'!$A$1,$C23,AJ$2,1,1)","v":0},{"$f":"OFFSET('Tabla Minerales-aa'!$A$1,$C23,AK$2,1,1)","v":0},{"$f":"OFFSET('Tabla Minerales-aa'!$A$1,$C23,AL$2,1,1)","v":0},{"$f":"OFFSET('Tabla Minerales-aa'!$A$1,$C23,AM$2,1,1)","v":0}]
[null,{"$f":"IF(OFFSET('Tabla Minerales-aa'!$A$1,C24,0,1,1)=0,\"\",OFFSET('Tabla Minerales-aa'!$A$1,C24,0,1,1))","v":""},1,{"$f":"OFFSET('Tabla Minerales-aa'!$A$1,$C24,D2,1,1)","v":0},{"$f":"OFFSET('Tabla Minerales-aa'!$A$1,$C24,E2,1,1)","v":0},{"$f":"OFFSET('Tabla Minerales-aa'!$A$1,$C24,F2,1,1)","v":0},{"$f":"OFFSET('Tabla Minerales-aa'!$A$1,$C24,G2,1,1)","v":0},{"$f":"OFFSET('Tabla Minerales-aa'!$A$1,$C24,H2,1,1)","v":0},{"$f":"OFFSET('Tabla Minerales-aa'!$A$1,$C24,I2,1,1)","v":0},{"$f":"OFFSET('Tabla Minerales-aa'!$A$1,$C24,J2,1,1)","v":0},{"$f":"OFFSET('Tabla Minerales-aa'!$A$1,$C24,K2,1,1)","v":0},{"$f":"OFFSET('Tabla Minerales-aa'!$A$1,$C24,L$2,1,1)","v":0},{"$f":"OFFSET('Tabla Minerales-aa'!$A$1,$C24,M$2,1,1)","v":0},{"$f":"OFFSET('Tabla Minerales-aa'!$A$1,$C24,N$2,1,1)","v":0},{"$f":"OFFSET('Tabla Minerales-aa'!$A$1,$C24,O$2,1,1)","v":0},{"$f":"OFFSET('Tabla Minerales-aa'!$A$1,$C24,P$2,1,1)","v":0},{"$f":"OFFSET('Tabla Minerales-aa'!$A$1,$C24,Q$2,1,1)","v":0},{"$f":"OFFSET('Tabla Minerales-aa'!$A$1,$C24,R$2,1,1)","v":0},{"$f":"OFFSET('Tabla Minerales-aa'!$A$1,$C24,S$2,1,1)","v":0},{"$f":"OFFSET('Tabla Minerales-aa'!$A$1,$C24,T$2,1,1)","v":0},{"$f":"OFFSET('Tabla Minerales-aa'!$A$1,$C24,U$2,1,1)","v":0},{"$f":"OFFSET('Tabla Minerales-aa'!$A$1,$C24,V$2,1,1)","v":0},{"$f":"OFFSET('Tabla Minerales-aa'!$A$1,$C24,W$2,1,1)","v":0},{"$f":"OFFSET('Tabla Minerales-aa'!$A$1,$C24,X$2,1,1)","v":0},{"$f":"OFFSET('Tabla Minerales-aa'!$A$1,$C24,Y$2,1,1)","v":0},{"$f":"OFFSET('Tabla Minerales-aa'!$A$1,$C24,Z$2,1,1)","v":0},{"$f":"OFFSET('Tabla Minerales-aa'!$A$1,$C24,AA$2,1,1)","v":0},{"$f":"OFFSET('Tabla Minerales-aa'!$A$1,$C24,AB$2,1,1)","v":0},{"$f":"OFFSET('Tabla Minerales-aa'!$A$1,$C24,AC$2,1,1)","v":0},{"$f":"OFFSET('Tabla Minerales-aa'!$A$1,$C24,AD$2,1,1)","v":0},{"$f":"OFFSET('Tabla Minerales-aa'!$A$1,$C24,AE$2,1,1)","v":0},{"$f":"OFFSET('Tabla Minerales-aa'!$A$1,$C24,AF$2,1,1)","v":0},{"$f":"OFFSET('Tabla Minerales-aa'!$A$1,$C24,AG$2,1,1)","v":0},{"$f":"OFFSET('Tabla Minerales-aa'!$A$1,$C24,AH$2,1,1)","v":0},{"$f":"OFFSET('Tabla Minerales-aa'!$A$1,$C24,AI$2,1,1)","v":0},{"$f":"OFFSET('Tabla Minerales-aa'!$A$1,$C24,AJ$2,1,1)","v":0},{"$f":"OFFSET('Tabla Minerales-aa'!$A$1,$C24,AK$2,1,1)","v":0},{"$f":"OFFSET('Tabla Minerales-aa'!$A$1,$C24,AL$2,1,1)","v":0},{"$f":"OFFSET('Tabla Minerales-aa'!$A$1,$C24,AM$2,1,1)","v":0}]
[null,{"$f":"IF(OFFSET('Tabla Minerales-aa'!$A$1,C25,0,1,1)=0,\"\",OFFSET('Tabla Minerales-aa'!$A$1,C25,0,1,1))","v":""},1,{"$f":"OFFSET('Tabla Minerales-aa'!$A$1,$C25,D2,1,1)","v":0},{"$f":"OFFSET('Tabla Minerales-aa'!$A$1,$C25,E2,1,1)","v":0},{"$f":"OFFSET('Tabla Minerales-aa'!$A$1,$C25,F2,1,1)","v":0},{"$f":"OFFSET('Tabla Minerales-aa'!$A$1,$C25,G2,1,1)","v":0},{"$f":"OFFSET('Tabla Minerales-aa'!$A$1,$C25,H2,1,1)","v":0},{"$f":"OFFSET('Tabla Minerales-aa'!$A$1,$C25,I2,1,1)","v":0},{"$f":"OFFSET('Tabla Minerales-aa'!$A$1,$C25,J2,1,1)","v":0},{"$f":"OFFSET('Tabla Minerales-aa'!$A$1,$C25,K2,1,1)","v":0},{"$f":"OFFSET('Tabla Minerales-aa'!$A$1,$C25,L$2,1,1)","v":0},{"$f":"OFFSET('Tabla Minerales-aa'!$A$1,$C25,M$2,1,1)","v":0},{"$f":"OFFSET('Tabla Minerales-aa'!$A$1,$C25,N$2,1,1)","v":0},{"$f":"OFFSET('Tabla Minerales-aa'!$A$1,$C25,O$2,1,1)","v":0},{"$f":"OFFSET('Tabla Minerales-aa'!$A$1,$C25,P$2,1,1)","v":0},{"$f":"OFFSET('Tabla Minerales-aa'!$A$1,$C25,Q$2,1,1)","v":0},{"$f":"OFFSET('Tabla Minerales-aa'!$A$1,$C25,R$2,1,1)","v":0},{"$f":"OFFSET('Tabla Minerales-aa'!$A$1,$C25,S$2,1,1)","v":0},{"$f":"OFFSET('Tabla Minerales-aa'!$A$1,$C25,T$2,1,1)","v":0},{"$f":"OFFSET('Tabla Minerales-aa'!$A$1,$C25,U$2,1,1)","v":0},{"$f":"OFFSET('Tabla Minerales-aa'!$A$1,$C25,V$2,1,1)","v":0},{"$f":"OFFSET('Tabla Minerales-aa'!$A$1,$C25,W$2,1,1)","v":0},{"$f":"OFFSET('Tabla Minerales-aa'!$A$1,$C25,X$2,1,1)","v":0},{"$f":"OFFSET('Tabla Minerales-aa'!$A$1,$C25,Y$2,1,1)","v":0},{"$f":"OFFSET('Tabla Minerales-aa'!$A$1,$C25,Z$2,1,1)","v":0},{"$f":"OFFSET('Tabla Minerales-aa'!$A$1,$C25,AA$2,1,1)","v":0},{"$f":"OFFSET('Tabla Minerales-aa'!$A$1,$C25,AB$2,1,1)","v":0},{"$f":"OFFSET('Tabla Minerales-aa'!$A$1,$C25,AC$2,1,1)","v":0},{"$f":"OFFSET('Tabla Minerales-aa'!$A$1,$C25,AD$2,1,1)","v":0},{"$f":"OFFSET('Tabla Minerales-aa'!$A$1,$C25,AE$2,1,1)","v":0},{"$f":"OFFSET('Tabla Minerales-aa'!$A$1,$C25,AF$2,1,1)","v":0},{"$f":"OFFSET('Tabla Minerales-aa'!$A$1,$C25,AG$2,1,1)","v":0},{"$f":"OFFSET('Tabla Minerales-aa'!$A$1,$C25,AH$2,1,1)","v":0},{"$f":"OFFSET('Tabla Minerales-aa'!$A$1,$C25,AI$2,1,1)","v":0},{"$f":"OFFSET('Tabla Minerales-aa'!$A$1,$C25,AJ$2,1,1)","v":0},{"$f":"OFFSET('Tabla Minerales-aa'!$A$1,$C25,AK$2,1,1)","v":0},{"$f":"OFFSET('Tabla Minerales-aa'!$A$1,$C25,AL$2,1,1)","v":0},{"$f":"OFFSET('Tabla Minerales-aa'!$A$1,$C25,AM$2,1,1)","v":0}]
[null,null,null,null,{"$f":"SUMPRODUCT(E3:E25,'II_Plantear Ración'!$E$4:$E$26)","v":3.7159987516493778},{"$f":"SUMPRODUCT(F3:F25,'II_Plantear Ración'!$E$4:$E$26)","v":6.6596982335759476},{"$f":"SUMPRODUCT(G3:G25,'II_Plantear Ración'!$E$4:$E$26)","v":446.66835797996043},{"$f":"SUMPRODUCT(H3:H25,'II_Plantear Ración'!$E$4:$E$26)","v":-37.071293898075801},{"$f":"SUMPRODUCT(I3:I25,'II_Plantear Ración'!$E$4:$E$26)/SUM('II_Plantear Ración'!$E$4:$E$26)","v":1.8155037923812882},{"$f":"SUMPRODUCT(J3:J25,'II_Plantear Ración'!$E$4:$E$26)","v":13.907864586996599},{"$f":"SUMPRODUCT(K3:K25,'II_Plantear Ración'!$E$4:$E$26)","v":15.438687952097629},{"$f":"SUMPRODUCT(L3:L25,'II_Plantear Ración'!$E$4:$E$26)","v":4.1742962314412804},{"$f":"SUMPRODUCT(M3:M25,'II_Plantear Ración'!$E$4:$E$26)","v":20.105825483684097},{"$f":"SUMPRODUCT(N3:N25,'II_Plantear Ración'!$E$4:$E$26)","v":1.4702648516806913},{"$f":"SUMPRODUCT(O3:O25,'II_Plantear Ración'!$E$4:$E$26)","v":7.7353658026923927E-2},{"$f":"SUMPRODUCT(P3:P25,'II_Plantear Ración'!$E$4:$E$26)","v":2.8128795453426884E-3},{"$f":"SUMPRODUCT(Q3:Q25,'II_Plantear Ración'!$E$4:$E$26)","v":1.1585918652616158},{"$f":"SUMPRODUCT(R3:R25,'II_Plantear Ración'!$E$4:$E$26)","v":15.618082747227019},{"$f":"SUMPRODUCT(S3:S25,'II_Plantear Ración'!$E$4:$E$26)","v":58.083993487554316},{"$f":"SUMPRODUCT(T3:T25,'II_Plantear Ración'!$E$4:$E$26)","v":78.811852986390917},{"$f":"SUMPRODUCT(U3:U25,'II_Plantear Ración'!$E$4:$E$26)","v":0},{"$f":"SUMPRODUCT(V3:V25,'II_Plantear Ración'!$E$4:$E$26)","v":0.10905816948672441},{"$f":"SUMPRODUCT(W3:W25,'II_Plantear Ración'!$E$4:$E$26)","v":27026.536386999851},{"$f":"SUMPRODUCT(X3:X25,'II_Plantear Ración'!$E$4:$E$26)","v":604.44052987571126},{"$f":"SUMPRODUCT(Y3:Y25,'II_Plantear Ración'!$E$4:$E$26)","v":100.82600566345423},{"$f":"SUMPRODUCT(Z3:Z25,'II_Plantear Ración'!$E$4:$E$26)","v":296.39715631082981},{"$f":"SUMPRODUCT(AA3:AA25,'II_Plantear Ración'!$E$4:$E$26)","v":775.17551981203974},{"$f":"SUMPRODUCT(AB3:AB25,'II_Plantear Ración'!$E$4:$E$26)","v":160.98166774568728},{"$f":"SUMPRODUCT(AC3:AC25,'II_Plantear Ración'!$E$4:$E$26)/SUM('II_Plantear Ración'!$E$4:$E$26)","v":0.75288082926927136},{"$f":"SUMPRODUCT(AD3:AD25,'II_Plantear Ración'!$E$4:$E$26)","v":4147.7103975835089},{"$f":"SUMPRODUCT(AE3:AE25,'II_Plantear Ración'!$E$4:$E$26)","v":322.18763849827201},{"$f":"SUMPRODUCT(AF3:AF25,'II_Plantear Ración'!$E$4:$E$26)","v":1104.6824963235892},{"$f":"SUMPRODUCT(AG3:AG25,'II_Plantear Ración'!$E$4:$E$26)","v":2368.9222903800692},{"$f":"SUMPRODUCT(AH3:AH25,'II_Plantear Ración'!$E$4:$E$26)","v":1361.6272232610343},{"$f":"SUMPRODUCT(AI3:AI25,'II_Plantear Ración'!$E$4:$E$26)","v":33.361088159279689},{"$f":"SUMPRODUCT(AJ3:AJ25,'II_Plantear Ración'!$E$4:$E$26)","v":408.68630980108611},{"$f":"SUMPRODUCT(AK3:AK25,'II_Plantear Ración'!$E$4:$E$26)","v":1.4354110028012725},{"$f":"SUMPRODUCT(AL3:AL25,'II_Plantear Ración'!$E$4:$E$26)/SUM('II_Plantear Ración'!$E$4:$E$26)","v":0.7273123975983814},{"$f":"SUMPRODUCT(AM3:AM25,'II_Plantear Ración'!$E$4:$E$26)","v":3374.5200902431657}]
[null,null,null,null,{"$f":"SUMPRODUCT(E8:E19,'II_Plantear Ración'!$E$9:$E$20)","v":0},{"$f":"SUMPRODUCT(F8:F19,'II_Plantear Ración'!$E$9:$E$20)","v":3.8487243712627777}]
[null,null,null,null,{"$f":"E26-E27","v":3.7159987516493778},{"$f":"F26-F27","v":2.8109738623131699}]
[null,null,null,null,{"$f":"IF(I_Necesidades!B14=\"UFL\",1,2)","v":1}]
[]
[]
[]
[]
[]
[]
[]
[null,{"$f":"CálculosEV!B3","v":"ENSILADO Prat natural plano, gramíneas en gran parte"}]
[null,{"$f":"CálculosEV!B4","v":"HENO Bromo Final vegetación"}]
[null,{"$f":"CálculosEV!B5","v":""}]
[null,{"$f":"CálculosEV!B6","v":""}]
[null,{"$f":"CálculosEV!B7","v":""}]
[null,{"$f":"CálculosEV!B8","v":""}]
[null,{"$f":"CálculosEV!B9","v":"Cebada grano"}]
[null,{"$f":"CálculosEV!B10","v":"Colza, turtó"}]
[null,{"$f":"CálculosEV!B11","v":"Maíz grano"}]
[null,{"$f":"CálculosEV!B12","v":"Soja torta 44"}]
[null,{"$f":"CálculosEV!B13","v":"Mandioca"}]
[null,{"$f":"CálculosEV!B14","v":"Cebada bagazo cervecería seco"}]
[null,{"$f":"CálculosEV!B15","v":"Algodón, grano"}]
[null,{"$f":"CálculosEV!B16","v":"Levadura cervecería"}]
[null,{"$f":"CálculosEV!B17","v":"Grasa vegetal, manteca de cerdo (todos los tipos)"}]
[null,{"$f":"CálculosEV!B18","v":"Urea"}]
[null,{"$f":"CálculosEV!B19","v":""}]

{"sheet":"Apuntes Cria","index":5,"n_rows":31,"n_cols":17,"rows_kept":31,"cut":false,"hidden":false,"merged":[[28,11,28,12],[29,11,29,12],[30,11,30,16],[7,1,7,5],[0,1,0,19],[1,1,5,19],[11,11,11,13],[11,15,11,16],[12,11,13,11],[12,12,12,14],[12,15,13,15],[12,16,13,16],[8,11,10,16],[7,11,7,16],[7,7,7,9],[9,7,9,8],[10,7,10,8],[11,7,11,8],[14,1,14,7],[16,1,16,7],[17,4,17,5],[18,12,18,16],[18,4,18,5],[25,3,25,7],[26,3,26,7],[19,4,19,5],[21,3,21,6],[22,3,22,5],[20,1,20,6]]}
[null,"Cría terneros para engorde o reposición (Guía)"]
[null,"Del nacimiento al destete (6 meses lecheras; 8,5 meses otros). Objetivo: peso final de la cría tres veces el peso al nacimiento. Después de la cría: machos en engorde, hembras en reposición (crecimiento de 700 a 1.000 g/día, potencial elevado crecimiento esqueleto y músculos). Objetivo reposición: si parto precoz, crecimiento alto. Objetivo engorde: si edad sacrificio precoz, crecimiento alto. Incremento volumen rumen: más forrajes que concentrados. Concentrado rico en energía asegura un aumento de peso alto después del destete. La cría tiene tres periodos: 1) Calostro; 2) Hasta destete; 3) pos destete"]
[]
[]
[]
[]
[]
[null,"1.- Período CALOSTRO. Ejemplo o recomendación INRA\n",null,null,null,null,null,"Datos para la cría",null,null,null,"2.- Período hasta destete"]
[null,null,null,null,null,null,null,"Peso al nacer, kg",null,45,null,"Semana destete 8ª. Objetivo: doblar peso al nacer"]
[null,null,null,null,null,null,null,"Tiempo, meses",null,4]
[null,null,null,null,null,null,null,"Peso final, kg",null,{"$f":"J9*3","v":135}]
[null,null,null,null,null,null,null,"Crecimiento medio, g/día",null,{"$f":"1000*(J11-J9)/(J10*30.5)","v":737.70491803278685},null,"Peso objetivo al destete",null,null,{"$f":"2*J9","v":90},"kg"]
[null,null,null,null,null,null,null,null,null,null,null,"Tipo alimento","Composición %",null,null,"Sum. al día","Tª ºC"]
[null,null,null,null,null,null,null,null,null,null,null,null,"Leche entera","Alimento destete","Agua"]
[null,"3.- Período posdestete",null,null,null,null,null,null,null,null,null,"A",100,0,0,2,40]
[null,"Tiempo, días",{"$f":"J10*30.5-8*7","v":66},{"$f":"C16/30.5","v":2.1639344262295084},"meses",null,null,null,null,null,null,"B",0,13,87,2,40]
[null,"Cálculo aportaciones diarias de forrajes y concentrado",null,null,null,null,null,null,null,null,null,"C",0,22,78,1,40]
[null,"Forrajes (buena calidad)","MS %","UE","Composición en la ración",null,"kg MS/día","Kg fresco/día",null,null,null,"D",75,12.5,12.5,1,40]
[null,"Heno",0.85,1.1000000000000001,0.32,null,{"$f":"(C26-C27)*E19","v":0.54349058745574996},{"$f":"G19/C19","v":0.63940069112441178},null,null,null,null,"Cantidad (kg) tipo alimento"]
[null,"Ensilado",0.33,1.2,{"$f":"1-E19","v":0.67999999999999994},null,{"$f":"(C26-C27)*E20","v":1.1549174983434687},{"$f":"G20/C20","v":3.499749994980208},null,null,null,"Semana","Nº días","A","B","C","D"]
[null,"kg mezcla concentrados (75 a 80% cereales; resto turtó) 1,16 UFL i 120 PDI ",null,null,null,null,null,{"$f":"IF(J12<901,1.5,3)","v":1.5},null,null,null,1,1,6,6,3,3]
[null,"CI inicio período, UE",{"$f":"0.039*(J11-8*7*J12/1000)^0.9","v":2.3205042425704452},"0,039 x (Peso final - Δ kg/día x 7 x 8)0,9",null,null,null,null,null,null,null,2,7,8,8,4,4]
[null,"CI, final período, UE",{"$f":"0.039*J11^0.9","v":3.2237770458565289},"0,039 x Peso final0,9",null,null,null,null,null,null,null,"3*",7,8,8,5,5]
[null,"CI, media",{"$f":"AVERAGE(C22:C23)","v":2.7721406442134873},null,null,null,null,null,null,null,null,4,7,8,8,5,5]
[null,"UE mezcla forrajera",{"$f":"D19*E19+D20*E20","v":1.1679999999999999},null,null,null,null,null,null,null,null,5,7,8,8,5,5]
[null,"Kg MS forrajera",{"$f":"C24/C25","v":2.3734080857992188},"kg MS mezcla forrajera = CI/(UE mezcla forrajera)",null,null,null,null,null,null,null,6,7,8,8,5,5]
[null,null,{"$f":"0.45*H21","v":0.67500000000000004},"kg MS mezcla forrajera que deja de comer si incorporamos concentrado Sg= 0,45",null,null,null,null,null,null,null,7,7,6,6,3.5,3.5]
[null,"HENO, kg",{"$f":"H19","v":0.63940069112441178},null,null,null,null,null,null,null,null,8,7,3,3,2,2]
[null,"ENSILADO, kg",{"$f":"H20","v":3.499749994980208},null,null,null,null,null,null,null,null,"kg leche entera",null,{"$f":"SUMPRODUCT(M21:M28,N21:N28)","v":349},0,0,{"$f":"SUMPRODUCT(M21:M28,Q21:Q28)*M18/100","v":157.125}]
[null,"MEZCLA CONCENTRADO, kg",{"$f":"H21","v":1.5},null,null,null,null,null,null,null,null,"kg alimento destete",null,0,{"$f":"N29*N16/100","v":45.37},{"$f":"SUMPRODUCT(M21:M28,P21:P28)*N17/100","v":46.09},{"$f":"SUMPRODUCT(M21:M28,Q21:Q28)*N18/100","v":26.1875}]
[null,null,null,null,null,null,null,null,null,null,null,"*  A la tercera semana se introduce heno bien conservado"]

{"sheet":"NR","index":6,"n_rows":52,"n_cols":77,"rows_kept":52,"cut":false,"hidden":true,"merged":[[28,0,28,6],[29,0,29,6],[22,0,22,6],[23,0,23,6],[24,0,24,6],[25,0,25,6],[26,0,26,6],[27,0,27,6]]}
[null,null,null,null,null,null,null,null,null,null,null,null,null,null,null,null,null,null,null,null,null,null,null,null,null,null,null,null,null,null,null,null,null,null,null,null,null,null,"ok","ok"]
[null,"Pvinicial","Pvfinal","d1","d2","CDinicial %PV","CDfinal %Pv","Lipinicial %Pvvacio","Lipfinal %Pvvacio","recEN_mant Kcla/KgPV0,75","Pv adult","Pv t","GMD","Peso v t","ΔPv t","Pvvacio inicial","Pv vacio final","c1","c0","Pvvacio t1","Pv vacio t2","Dif pv vacio","Lip_corp_i","Lip_corp_t","b1","b0","Lip_corp t1","Lip_corp t2","Dif Lip_corp","Mdel t1","Mdel t2","Dif Mdel","Prot_corp_t1","Prot_corp_t2","Dif Prot_corp ","q","km","EN mant","NecEN_guany","Ep","kpf","kf","kmf","NecUFL_mant","NecUFLguany","EfPDI","BPR máx","BPR mín","MOND g/kg MS","CI MSI","NecPDI_PEF","NecPDI_Uendo","NecPDI_epidèrmiques","NecPDI_guany","Itip","c","UFV","PDI","CI UEB","Pabs","Caabs","Mg","Cl","K","Na","S","Co","Cu","Mo","Iode","Fe","Mn","Se","Zn","Vit A","Vit D","Vit E"]
["1.-Terneros Engorde (finalización) gran formato tardíos (Charolés, p.e)",300,800,1.1028,3.7000000000000002E-3,16,11,8,16,102,{"$f":"B3*EXP(D3)","v":903.77684284297129},{"$f":"IF(I_Necesidades!$C$6=1,I_Necesidades!$C$10,\"\")","v":""},{"$f":"IF(I_Necesidades!$C$6=1,I_Necesidades!$C$11,\"\")","v":""},{"$f":"IF(L3=\"\",\"\",L3+M3)","v":""},{"$f":"IF(L3=\"\",\"\",E3*L3*LN(K3/L3))","v":""},{"$f":"B3*(100-F3)/100","v":252},{"$f":"C3*(100-G3)/100","v":712},{"$f":"LN(Q3/P3)/LN(C3/B3)","v":1.0589496802947975},{"$f":"EXP(LN(P3)-R3*LN(B3))","v":0.60014166668340529},{"$f":"IF(L3=\"\",\"\",S3*L3^R3)","v":""},{"$f":"IF(M3=\"\",\"\",S3*N3^R3)","v":""},{"$f":"IF(L3=\"\",\"\",U3-T3)","v":""},{"$f":"H3*P3/100","v":20.16},{"$f":"I3*Q3/100","v":113.92},{"$f":"LN(X3/W3)/LN(Q3/P3)","v":1.66735470604674},{"$f":"EXP(LN(X3)-Y3*LN(Q3))","v":1.9975793277195834E-3},{"$f":"IF(L3=\"\",\"\",Z3*T3^Y3)","v":""},{"$f":"IF(M3=\"\",\"\",Z3*U3^Y3)","v":""},{"$f":"IF(L3=\"\",\"\",AB3-AA3)","v":""},{"$f":"IF(L3=\"\",\"\",T3-AA3)","v":""},{"$f":"IF(L3=\"\",\"\",U3-AB3)","v":""},{"$f":"IF(L3=\"\",\"\",AE3-AD3)","v":""},{"$f":"IF(L3=\"\",\"\",0.1436*AD3^1.0723)","v":""},{"$f":"IF(L3=\"\",\"\",0.1436*AE3^1.0723)","v":""},{"$f":"IF(L3=\"\",\"\",AH3-AG3)","v":""},{"$f":"IF(M3=\"\",\"\",IF(M3>1,0.6,0.62-0.262*EXP(-3.175*M3)))","v":""},{"$f":"IF(L3=\"\",\"\",0.287*AJ3+0.554)","v":""},{"$f":"IF(L3=\"\",\"\",(J3*L3^0.75)/1000)","v":""},{"$f":"IF(L3=\"\",\"\",5.48*AI3+9.39*AC3)","v":""},{"$f":"IF(L3=\"\",\"\",5.48*AI3/(5.48*AI3+9.39*AC3))","v":""},{"$f":"IF(L3=\"\",\"\",0.35+0.25*(1-AN3)^2)","v":""},{"$f":"IF(L3=\"\",\"\",0.78*0.6+0.006)","v":""},{"$f":"IF(L3=\"\",\"\",(AK3*AP3*1.5)/(AP3+0.5*AK3))","v":""},{"$f":"IF(L3=\"\",\"\",AM3/AO3*AQ3/1.76)","v":""},{"$f":"IF(L3=\"\",\"\",AL3/AK3*AQ3/1.76)","v":""},{"$f":"IF(L3=\"\",\"\",IF(L3<550,0.64,0.47))","v":""},{"$f":"IF(L3=\"\",\"\",IF(L3<550,-2,-6.6))","v":""},{"$f":"IF(L3=\"\",\"\",IF(L3<550,-7.5,-13.3))","v":""},{"$f":"IF(L3=\"\",\"\",IF(L3<550,262,240))","v":""},{"$f":"IF(L3=\"\",\"\",95*L3^0.75/1000)","v":""},{"$f":"IF(AX3=\"\",\"\",(AX3*(0.5*(5.7+0.074*AW3)))/AT3)","v":""},{"$f":"IF(L3=\"\",\"\",0.312*L3)","v":""},{"$f":"IF(L3=\"\",\"\",(0.2*L3^0.6)/AT3)","v":""},{"$f":"IF(AI3=\"\",\"\",AI3*1000/AT3)","v":""},0.28399999999999997,0.54,{"$f":"IF(L3=\"\",\"\",AR3+AS3)","v":""},{"$f":"IF(L3=\"\",\"\",AY3+AZ3+BA3+BB3)","v":""},{"$f":"IF(L3=\"\",\"\",BC3*L3^BD3)","v":""},{"$f":"IF(L3=\"\",\"\",0.025*L3+(((1.2+((4.655*K3^0.22)*(L3^-0.22)))*M3)))","v":""},{"$f":"IF(L3=\"\",\"\",0.015*L3+(((9.83*(K3^0.22)*(L3^-0.22)*M3))))","v":""},{"$f":"IF(L3=\"\",\"\",(0.003*L3+0.45*M3)/0.16)","v":""},{"$f":"IF(L3=\"\",\"\",(0.003*L3+0.45*M3)/0.16)","v":""},{"$f":"IF(L3=\"\",\"\",((2.6*AX3)+0.038*L3+1.6*M3)/0.9)","v":""},{"$f":"IF(L3=\"\",\"\",(0.015*L3+1.4*M3)/0.99)","v":""},{"$f":"IF(BP3=\"\",\"\",2*AX3)","v":""},{"$f":"IF(BP3=\"\",\"\",0.11*AX3)","v":""},{"$f":"IF(L3=\"\",\"\",(0.0071*L3+1.15*M3)/0.04)","v":""},null,{"$f":"IF(L3=\"\",\"\",0.006*L3)","v":""},{"$f":"IF(M3=\"\",\"\",34*M3/0.1)","v":""},{"$f":"IF(M3=\"\",\"\",(0.002*L3+0.7*M3)/0.0075)","v":""},{"$f":"IF(BP3=\"\",\"\",0.3*AX3)","v":""},{"$f":"IF(L3=\"\",\"\",(0.045*L3+24*M3)/0.15)","v":""},{"$f":"IF(L3=\"\",\"\",110*L3)","v":""},{"$f":"IF(L3=\"\",\"\",16*L3)","v":""},{"$f":"IF(L3=\"\",\"\",2.6*L3)","v":""}]
["2.-Terneros Engorde (finalización) tardíos (Limousines, p.e)",330,730,1.1028,3.7000000000000002E-3,15,10.8,8,15,98,{"$f":"B4*EXP(D4)","v":994.15452712726835},{"$f":"IF(I_Necesidades!$C$6=2,I_Necesidades!$C$10,\"\")","v":""},{"$f":"IF(I_Necesidades!$C$6=2,I_Necesidades!$C$11,\"\")","v":""},{"$f":"IF(L4=\"\",\"\",L4+M4)","v":""},{"$f":"IF(L4=\"\",\"\",E4*L4*LN(K4/L4))","v":""},{"$f":"B4*(100-F4)/100","v":280.5},651.16,{"$f":"LN(Q4/P4)/LN(C4/B4)","v":1.0607464814051075},{"$f":"EXP(LN(P4)-R4*LN(B4))","v":0.59762404884316622},{"$f":"IF(L4=\"\",\"\",S4*L4^R4)","v":""},{"$f":"IF(M4=\"\",\"\",S4*N4^R4)","v":""},{"$f":"IF(L4=\"\",\"\",U4-T4)","v":""},{"$f":"H4*P4/100","v":22.44},97.673999999999992,{"$f":"LN(X4/W4)/LN(Q4/P4)","v":1.7464050658015879},{"$f":"EXP(LN(X4)-Y4*LN(Q4))","v":1.1910788018160768E-3},{"$f":"IF(L4=\"\",\"\",Z4*T4^Y4)","v":""},{"$f":"IF(M4=\"\",\"\",Z4*U4^Y4)","v":""},{"$f":"IF(L4=\"\",\"\",AB4-AA4)","v":""},{"$f":"IF(L4=\"\",\"\",T4-AA4)","v":""},{"$f":"IF(L4=\"\",\"\",U4-AB4)","v":""},{"$f":"IF(L4=\"\",\"\",AE4-AD4)","v":""},{"$f":"IF(L4=\"\",\"\",0.1436*AD4^1.0723)","v":""},{"$f":"IF(L4=\"\",\"\",0.1436*AE4^1.0723)","v":""},{"$f":"IF(L4=\"\",\"\",AH4-AG4)","v":""},{"$f":"IF(M4=\"\",\"\",IF(M4>1,0.6,0.62-0.262*EXP(-3.175*M4)))","v":""},{"$f":"IF(L4=\"\",\"\",0.287*AJ4+0.554)","v":""},{"$f":"IF(L4=\"\",\"\",(J4*L4^0.75)/1000)","v":""},{"$f":"IF(L4=\"\",\"\",5.48*AI4+9.39*AC4)","v":""},{"$f":"IF(L4=\"\",\"\",5.48*AI4/(5.48*AI4+9.39*AC4))","v":""},{"$f":"IF(L4=\"\",\"\",0.35+0.25*(1-AN4)^2)","v":""},{"$f":"IF(L4=\"\",\"\",0.78*0.6+0.006)","v":""},{"$f":"IF(L4=\"\",\"\",(AK4*AP4*1.5)/(AP4+0.5*AK4))","v":""},{"$f":"IF(L4=\"\",\"\",AM4/AO4*AQ4/1.76)","v":""},{"$f":"IF(L4=\"\",\"\",AL4/AK4*AQ4/1.76)","v":""},{"$f":"IF(L4=\"\",\"\",IF(L4<550,0.64,0.47))","v":""},{"$f":"IF(L4=\"\",\"\",IF(L4<550,-2,-6.6))","v":""},{"$f":"IF(L4=\"\",\"\",IF(L4<550,-7.5,-13.3))","v":""},{"$f":"IF(L4=\"\",\"\",IF(L4<550,262,240))","v":""},"",{"$f":"IF(AX4=\"\",\"\",(AX4*(0.5*(5.7+0.074*AW4)))/AT4)","v":""},"","","",0.22,0.56999999999999995,"","","",{"$f":"IF(L4=\"\",\"\",0.025*L4+(((1.2+((4.655*K4^0.22)*(L4^-0.22))))*M4))","v":""},"","","","","",{"$f":"IF(BP4=\"\",\"\",2*AX4)","v":""},{"$f":"IF(BP4=\"\",\"\",0.11*AX4)","v":""},"",null,"","","",{"$f":"IF(BP4=\"\",\"\",0.3*AX4)","v":""},"","","",""]
["3.-Terneros Engorde (finalización) precocidad media (vacas rústicas)",250,680,1.4077999999999999,3.7629999999999999E-3,18,12,10,19.5,100,1021.7385517823345,{"$f":"IF(I_Necesidades!$C$6=3,I_Necesidades!$C$10,\"\")","v":""},{"$f":"IF(I_Necesidades!$C$6=3,I_Necesidades!$C$11,\"\")","v":""},"","",205,598.4,1.070572973541702,0.55537214745381425,"","","",20.5,116.68799999999999,1.6234116378034613,3.6209767752185414E-3,"","","","","","","","","","","","","","","","","","","","","","","","","","","","",0.23300000000000001,0.57499999999999996,"","","",{"$f":"IF(L5=\"\",\"\",0.025*L5+(((1.2+((4.655*K5^0.22)*(L5^-0.22)))*M5)))","v":""},"","","","","","","","",null,"","","","","","","",""]
["4.-Terneros Engorde (finalización) precocidad alta (vacas lecheras)",200,550,1.4077999999999999,3.7629999999999999E-3,20,12,7.5,21,95,{"$f":"B6*EXP(D6)","v":817.39084142586762},{"$f":"IF(I_Necesidades!$C$6=4,I_Necesidades!$C$10,\"\")","v":""},{"$f":"IF(I_Necesidades!$C$6=4,I_Necesidades!$C$11,\"\")","v":""},"","",{"$f":"B6*(100-F6)/100","v":160},{"$f":"C6*(100-G6)/100","v":484},{"$f":"LN(Q6/P6)/LN(C6/B6)","v":1.0942171746822404},{"$f":"EXP(LN(P6)-R6*LN(B6))","v":0.48561650828981223},"","","",{"$f":"H6*P6/100","v":12},{"$f":"I6*Q6/100","v":101.64},{"$f":"LN(X6/W6)/LN(Q6/P6)","v":1.9301735479060855},{"$f":"EXP(LN(X6)-Y6*LN(Q6))","v":6.6810874924829323E-4},"","","","","","","","","","","","","","","","","","","","","","","","","","","","",0.157,0.65200000000000002,"","","","","","","","","","","","",null,"","","","","","","",""]
["5.-Toros tardíos Engorde (finalización) de 20 a 33 meses",500,750,0.629,3.5000000000000001E-3,12,10,11,16.5,106,{"$f":"B7*EXP(D7)","v":937.86695358875579},{"$f":"IF(I_Necesidades!$C$6=5,I_Necesidades!$C$10,\"\")","v":""},{"$f":"IF(I_Necesidades!$C$6=5,I_Necesidades!$C$11,\"\")","v":""},"","",{"$f":"B7*(100-F7)/100","v":440},675,{"$f":"LN(Q7/P7)/LN(C7/B7)","v":1.0554248821974188},{"$f":"EXP(LN(P7)-R7*LN(B7))","v":0.62358057424616431},"","","",{"$f":"H7*P7/100","v":48.4},111.375,{"$f":"LN(X7/W7)/LN(Q7/P7)","v":1.9474857158171002},{"$f":"EXP(LN(X7)-Y7*LN(Q7))","v":3.4415892281846515E-4},"","","","","","","","","","","","","","","","","","","","","","","","","","","","",0.2205,0.6,"","","","","","","","","","","","",null,"","","","","","","",""]
["6.-Toros precoces Engorde (finalización) de 24 a 28 meses",540,660,0.629,3.5000000000000001E-3,13,11,16,21.2,108,1012.8963098758563,{"$f":"IF(I_Necesidades!$C$6=6,I_Necesidades!$C$10,\"\")","v":""},{"$f":"IF(I_Necesidades!$C$6=6,I_Necesidades!$C$11,\"\")","v":""},"","",469.8,587.4,1.1132614357328656,0.426623144468049,"","","",75.168000000000006,124.52879999999999,2.2596857048659671,6.8920648659404643E-5,"","","","","","","","","","","","","","","","","","","","","","","","","","","","",0.24249999999999999,0.6,"","","","","","","","","","","","",null,"","","","","","","",""]
["7.-Terneras tardías Engorde (finalización) de 15 a 30 meses",450,700,0.61739999999999995,3.5000000000000001E-3,13,10,13,18,106,834.34549800259833,{"$f":"IF(I_Necesidades!$C$6=7,I_Necesidades!$C$10,\"\")","v":""},{"$f":"IF(I_Necesidades!$C$6=7,I_Necesidades!$C$11,\"\")","v":""},"","",391.5,630,1.0767293766720827,0.54442731971748293,"","","",50.895000000000003,113.4,1.6840423272600518,2.1898031737106927E-3,"","","","","","","","","","","","","","","","","","","","","","","","","","","","",0.2205,0.6,"","","","","","","","","","","","",null,"","","","","","","",""]
["8.-Terneros tardíos Crecimiento de 8 a 24 meses",300,540,1.1140000000000001,2.5000000000000001E-3,16,12,8,11,94,913.95604058383685,{"$f":"IF(I_Necesidades!$C$6=8,I_Necesidades!$C$10,\"\")","v":""},{"$f":"IF(I_Necesidades!$C$6=8,I_Necesidades!$C$11,\"\")","v":""},"","",252,475.2,1.0791443876030082,0.53484635613701059,"","","",20.16,52.271999999999998,1.5020500979887643,4.9827214589203243E-3,"","","","","","","","","","","","","","","","","","","","","","","","","","","","",3.4590000000000003E-2,0.9,"","","","","","","","","","","","",null,"","","","","","","",""]
["9.-Terneros precoces Crecimiento de 6 a 24 meses",200,520,1.5013000000000001,2.5000000000000001E-3,20,13,7.5,18,94,897.50381095966964,{"$f":"IF(I_Necesidades!$C$6=9,I_Necesidades!$C$10,\"\")","v":400},{"$f":"IF(I_Necesidades!$C$6=9,I_Necesidades!$C$11,\"\")","v":1.03},401.03,0.80815281944005479,160,452.4,1.0877870007912813,0.50244608307753336,340.07640327564548,341.02908238527829,0.95267910963281111,12,81.432000000000002,1.8422885252734345,1.0436534033345067E-3,48.133853103922434,48.382561480843293,0.24870837692085956,291.94255017172304,292.64652090443496,0.70397073271192312,63.196472727754234,63.359892341283462,0.16341961352922851,0.6,0.72620000000000007,8.4076155953992089,3.2309111414270442,0.27717861709580355,0.48061768789588377,0.47399999999999998,0.6168058774339984,2.355923041242733,4.0574430992338515,0.64,-2,-7.5,262,8.4970583144992009,166.54234296418431,124.8,11.378526268912999,255.34314613941956,3.1150000000000001E-2,0.9,6.4133661404765849,558.06401537251691,6.8440321847971122,16.963587046644442,18.094990476587512,10.396875,10.396875,43.267057352997689,7.5171717171717178,16.994116628998402,0.93467641459491213,100.6125,null,2.4,350.2,202.79999999999998,2.5491174943497601,284.8,44000,6400,1040]
["10.-Terneras tardías Crecimiento de 8 a 28 meses",300,600,1.1140000000000001,2.5000000000000001E-3,18,13,9,14,94,913.95604058383685,{"$f":"IF(I_Necesidades!$C$6=10,I_Necesidades!$C$10,\"\")","v":""},{"$f":"IF(I_Necesidades!$C$6=10,I_Necesidades!$C$11,\"\")","v":""},"","",246,522,1.0853914912306448,0.50383551168200769,"","","",22.14,73.08,1.5872811107930809,3.5488813836110746E-3,"","","","","","","","","","","","","","","","","","","","","","","","","","","","",3.4590000000000003E-2,0.9,"","","","","","","","","","","","",null,"","","","","","","",""]
["11.-Terneras lecheras Crecimiento de 6 a 24 meses",150,600,1.5013000000000001,2.5000000000000001E-3,20,13,9,21,94,673.12785821975217,{"$f":"IF(I_Necesidades!$C$6=11,I_Necesidades!$C$10,\"\")","v":""},{"$f":"IF(I_Necesidades!$C$6=11,I_Necesidades!$C$11,\"\")","v":""},"","",120,522,1.0605077004806829,0.59077173527844518,"","","",10.8,109.62,1.5763241609572423,5.7011192121906463E-3,"","","","","","","","","","","","","","","","","","","","","","","","","","","","",3.9149999999999997E-2,0.9,"","","","","","","","","","","","",null,"","","","","","","",""]
[]
[{"$f":"I_Necesidades!C6","v":9}]
[{"$f":"IF($A$15=1,A3,IF($A$15=2,A4,IF($A$15=3,A5,IF($A$15=4,A6,IF($A$15=5,A7,IF($A$15=6,A8,IF($A$15=7,A9,IF($A$15=8,A10,IF($A$15=9,A11,IF($A$15=10,A12,A13))))))))))","v":"9.-Terneros precoces Crecimiento de 6 a 24 meses"},{"$f":"IF($A$15=1,B3,IF($A$15=2,B4,IF($A$15=3,B5,IF($A$15=4,B6,IF($A$15=5,B7,IF($A$15=6,B8,IF($A$15=7,B9,IF($A$15=8,B10,IF($A$15=9,B11,IF($A$15=10,B12,B13))))))))))","v":200},{"$f":"IF($A$15=1,C3,IF($A$15=2,C4,IF($A$15=3,C5,IF($A$15=4,C6,IF($A$15=5,C7,IF($A$15=6,C8,IF($A$15=7,C9,IF($A$15=8,C10,IF($A$15=9,C11,IF($A$15=10,C12,C13))))))))))","v":520},null,null,null,null,null,null,null,{"$f":"IF($A$15=1,K3,IF($A$15=2,K4,IF($A$15=3,K5,IF($A$15=4,K6,IF($A$15=5,K7,IF($A$15=6,K8,IF($A$15=7,K9,IF($A$15=8,K10,IF($A$15=9,K11,IF($A$15=10,K12,K13))))))))))","v":897.50381095966964},{"$f":"SUM(L3:L13)","v":400},{"$f":"SUM(M3:M13)","v":1.03},401.03,0.80815281944005479,2976.8,6309.5599999999995,11.842732584631831,5.965285095876891,340.07640327564548,341.02908238527829,0.95267910963281111,314.66300000000001,1095.6298000000002,19.366502600513517,2.535700185724761E-2,{"$f":"SUM(AA3:AA13)","v":48.133853103922434},{"$f":"SUM(AB3:AB13)","v":48.382561480843293},0.24870837692085956,291.94255017172304,292.64652090443496,0.70397073271192312,63.196472727754234,63.359892341283462,0.16341961352922851,0.6,0.72620000000000007,8.4076155953992089,3.2309111414270442,0.27717861709580355,0.48061768789588377,0.47399999999999998,0.6168058774339984,2.355923041242733,4.0574430992338515,0.64,-2,-7.5,262,8.4970583144992009,166.54234296418431,124.8,11.378526268912999,255.34314613941956,1.7169799999999997,7.737000000000001,6.4133661404765849,558.06401537251691,6.8440321847971122,16.963587046644442,18.094990476587512,10.396875,10.396875,43.267057352997689,7.5171717171717178,16.994116628998402,0.93467641459491213,100.6125,0,2.4,350.2,202.79999999999998,2.5491174943497601,284.8,44000,6400,1040]
[null,null,null,null,null,null,null,null,null,null,null,null,null,null,null,null,null,null,null,null,null,null,null,null,null,null,null,null,null,null,null,null,null,null,null,null,null,null,null,null,null,null,null,null,null,null,null,null,null,null,null,{"$f":"AZ16/AY16","v":0.74935897849617017}]
[]
[]
["Farratge i complementació"]
["Pinso i palla"]
[]
["Dades orientatives: Vedelles precoces de 350 a 600 kg; GPV de 0,8 a 1,2 kg; Pv adult = 700 kg"]
["Dades orientatives: Vedelles carn gran format (Llemosina, Blonda) de 450 a 600 kg; GPV de 0,8 a 1,2 kg.; Pv adult = 850 kg"]
["Dades orientatives: Vedelles carn tardanes (Xarolés i creuaments) de 450 a 600 kg; GPV de 0,8 a 1,2 kg; Pv adult = 850 kg\n"]
["Dades orientatives: Vedells frisons de 150 a 650 kg; GPV de 0,8 a 1,6 kg. Pv adult = 750 kg\n"]
["Dades orientatives: Vedells altres lleteres i creuaments Xarolés de 200 a 550 kg; GPV d'1 a 1,6 kg; Pv adult = 750 kg\n"]
["Dades orientatives: Vedells rústiques de 250 a 800 kg; GPV d'1 a 2 kg; Pv adult = 750 kg",null,null,null,null,null,null,"Padult",{"$f":"450*EXP(I9*(1-EXP(-J9*B9)))","v":29546986111.798729},{"$f":"J9*I28*LN((D9*EXP(I9))/I28)","v":-20644405017598.027},null,{"$f":"(I28-D9)/B9","v":65659969.135958508}]
["Dades orientatives: Vedells carn gran format (Llemosina, Blonda) de 300 a 650 kg; GPV d'1 a 2 kg; Pv adult = 900 kg\n\n"]
["Dades orientatives: Vedells carn tardanes  (Xarolés i creuaments alletants) de 300 a 700 kg; GPV d'1 a 2 kg; Pv adult = 900 kg\n"]
[]
[]
[]
["Peso nacimiento 47 kg. Destete a 6-8 meses. Ternero de 15 meses Pv = 550 kg. Ganancia media diaria 1.400 g. IC (4,6) Rendimiento a la canal 65-70%. Rendimiento carnicero 79-85% carne.",null,null,null,null,null,null,null,null,null,null,null,null,null,null,null,null,null,null,null,null,null,"Charolais"]
["Peso nacimiento 42 kg. Destete a 7-8 meses. Ternero de 15 meses Pv = 550 kg Ganancia media diario 1.500 g. Rendimiento canal 70%. Rendimiento carnicero 73% carne.",null,null,null,null,null,null,null,null,null,null,null,null,null,null,null,null,null,null,null,null,null,"Limousin"]
["Ganancia media diaria 1.500 a 1.700 g. Aprovechamiento de los terneros en matadero de 65 hasta 68%. Aprovechamiento de carne neta 75% hasta 80%.",null,null,null,null,null,null,null,null,null,null,null,null,null,null,null,null,null,null,null,null,null,"Blonde d’Aquitaine"]
["Ganancia media diaria: 1.400 g. Ternero a 12 meses (480 kg); Ternero 15-16 meses (650 kg); precoz; Edad al primer parto 32 meses; Rendimiento canal 66%.",null,null,null,null,null,null,null,null,null,null,null,null,null,null,null,null,null,null,null,null,null,"Blanco azul belga"]
["Peso nacimiento 47 kg. Ganancia media diaria: 1.300 a 1.400 g. Ternero a 12 meses (510 kg); Rendimientos canal de 57 a 60%.",null,null,null,null,null,null,null,null,null,null,null,null,null,null,null,null,null,null,null,null,null,"Fleckvieh-Simmenthal"]
["Ganancia media diaria: 1.560 g. IC (4,1) hasta 460 kg .; Ganancia media diaria: 1.580 g. IC (4,3) hasta 550 kg. Rendimiento canal: 60%. Rendimiento carnicero 73% carne, 8,8% grasa, 18,1% hueso. Producción de añojo (añojo): ciclo corto (14 meses y 500 kg), ciclo medio (18 meses y 600 kg). Ganancia media diaria: 1.400 g. IC (4,2) hasta 460 kg .; Ganancia media diaria: 1.530 g. IC (4,3) hasta 550 kg .; Rendimiento canal: 64%. Rendimiento carnicero 76,9% carne, 7,1% grasa, 16% hueso.",null,null,null,null,null,null,null,null,null,null,null,null,null,null,null,null,null,null,null,null,null,"Rubia Gallega"]
["Terneros 9-10 meses (300-350 kg), Terneros 12 meses (430 kg). Añojo pesado (550-600 kg). Ganancia media diaria: 1.540 g. IC (4,3) hasta 300 kg .; Ganancia media diaria: 1.670 g. IC (4,1) hasta 460 kg .; Ganancia media diaria: 1.750 g. IC (4,3) hasta 550 kg.",null,null,null,null,null,null,null,null,null,null,null,null,null,null,null,null,null,null,null,null,null,"Pirenaica"]
["Terneros \"pastero\" 5-6 meses (120-130 kg).",null,null,null,null,null,null,null,null,null,null,null,null,null,null,null,null,null,null,null,null,null,"Tudanca"]
["Ternero 12 meses (323 kg), Ganancia media diario: 1.940 g. IC (3,6) hasta 300 kg .; Ganancia media diaria: 1.350 g. IC (4,4) hasta 460 kg .; Ganancia media diaria: 1.590 g. IC (4,6) hasta 550 kg.",null,null,null,null,null,null,null,null,null,null,null,null,null,null,null,null,null,null,null,null,null,"Avileña-Negra Iberica"]
["Ternero 12 meses (393 kg). Ganancia media diaria: 1.360 g. IC (5,1) hasta 300 kg .; Ganancia media diaria: 1.510 g. IC (4,8) hasta 460 kg .; Ganancia media diaria: 1.400 g. IC (5,1) hasta 550 kg.",null,null,null,null,null,null,null,null,null,null,null,null,null,null,null,null,null,null,null,null,null,"Retinto"]
["Ternero pastero 5-9 meses (pesos escasos y variables). Ganancia media diaria: 1.200 g. IC (4,1) hasta 300 kg .; Ganancia media diaria: 1.240 g. IC (4,6) hasta 460 kg .; Ganancia media diaria: 1.280 g. IC (4,9) hasta 550 kg. Rendimiento canal: 56%.",null,null,null,null,null,null,null,null,null,null,null,null,null,null,null,null,null,null,null,null,null,"Morucha"]
["Peso medio vacas 600-700 kg, machos 800 a 1100 kg. Peso vivo sacrificio 550 kg. Ganancia media diaria: 1.850 g. IC (3,9) hasta 300 kg .; Ganancia media diaria: 1.690 g. IC (4,1) hasta 460 kg .; Ganancia media diaria: 1.740 g. IC (4,2) hasta 550 kg. Rendimiento canal: 60,9%. Rendimiento carnicero: 71,7% carne, 10% grasa, 18,3% hueso.",null,null,null,null,null,null,null,null,null,null,null,null,null,null,null,null,null,null,null,null,null,"Parda"]
[]
["Frisona-Holstein; Pardo-Suiza; Jersey; Ayshire;  Guernsey; Menorquina; Shorthorn; Tarentaise;  Normanda; Montbeliarda; Abondance; Danesa  vermella; Bretona; Simental o Fleckvieh, etc."]
["Blonde d’Aquitaine; Charolaise; Blanco azul belga;  Limousin; Hereford; Aberdeen angus;  Shorthorn  Durhan; Piamontesa; Rubia Gallega;  Asturiana de los  Valles; Retinta; Parda; etc.",null,null,null,null,null,null,null,null,null,null,null,null,null,null,null,null,null,null,null,null,null,"Leche"]
["Pardas Aubrac, Salers, Retinta, Avileña,  Morucha, Cachena, Tudanca, Asturiana de los Montes, etc.",null,null,null,null,null,null,null,null,null,null,null,null,null,null,null,null,null,null,null,null,null,"Carne"]
[null,null,null,null,null,null,null,null,null,null,null,null,null,null,null,null,null,null,null,null,null,null,"Rústicas"]
[]
["Fase d’engreix (del deslletament endavant): En el punt d’inflexió el creixement és màxim, el pes a la pubertat és 2/3 del pes adult. Si l’alimentació és adequada les vedelles de raça lletera arriben a la pubertat entre 9 i 11 mesos, i els vedells entre 11 i 12 mesos. A les races de carn el període és més llarg. "]

{"sheet":"I_Necesidades","index":7,"n_rows":39,"n_cols":15,"rows_kept":39,"cut":false,"hidden":false,"merged":[[3,14,9,16],[10,9,13,16],[0,9,0,16],[2,0,3,8],[4,1,4,6],[1,9,1,13],[1,14,1,16],[0,0,1,8],[10,3,10,5],[11,3,11,4],[11,5,11,6],[11,1,11,2],[12,1,12,2],[7,1,7,2],[8,1,8,2],[9,3,9,5],[3,9,9,13],[41,0,62,5],[41,6,51,9],[52,6,62,9],[46,10,56,13],[17,4,17,5],[18,4,18,5],[14,4,14,6],[13,4,13,6]]}
["Producción de carne: Engorde y finalización",null,null,null,null,null,null,null,null,"Guías"]
[null,null,null,null,null,null,null,null,null,"Características de algunas razas",null,null,null,null,"Razas de leche, carne, rústicas"]
[null,null,null,null,null,null,null,null,null,7,null,null,null,null,1]
[null,null,null,null,null,null,null,null,null,{"$f":"IF(J3=1,NR!A34,IF(J3=2,NR!A35,IF(J3=3,NR!A36,IF(J3=4,NR!A37,IF(J3=5,NR!A38,IF(J3=6,NR!A39,IF(J3=7,NR!A40,IF(J3=8,NR!A41,IF(J3=9,NR!A42,IF(J3=10,NR!A43,IF(J3=11,NR!A44,IF(J3=12,NR!A45))))))))))))","v":"Terneros 9-10 meses (300-350 kg), Terneros 12 meses (430 kg). Añojo pesado (550-600 kg). Ganancia media diaria: 1.540 g. IC (4,3) hasta 300 kg .; Ganancia media diaria: 1.670 g. IC (4,1) hasta 460 kg .; Ganancia media diaria: 1.750 g. IC (4,3) hasta 550 kg."},null,null,null,null,{"$f":"IF(O3=1,NR!A47,IF(O3=2,NR!A48,IF(O3=3,NR!A49)))","v":"Frisona-Holstein; Pardo-Suiza; Jersey; Ayshire;  Guernsey; Menorquina; Shorthorn; Tarentaise;  Normanda; Montbeliarda; Abondance; Danesa  vermella; Bretona; Simental o Fleckvieh, etc."}]
[null,"Elegir tipo de bovíno"]
[null,null,9]
[null,"Datos orientativos"]
[null,"Peso vivo inicial a partir de",null,{"$f":"NR!B16","v":200}]
[null,"Peso vivo final hasta ",null,{"$f":"NR!C16","v":520}]
[null,"Peso inicio",400,"Para el peso inicial: GMD, kg/día alrededor de ...",null,null,{"$f":"NR!O16","v":0.80815281944005479}]
[null,"GMD, kg/día",1.03,"Período racionamiento, tiempo en días",null,null,30,null,null,"Fase de engorde (del destete en adelante): En el punto de inflexión el crecimiento es máximo, el peso a la pubertad es 2/3 del peso adulto. Si la alimentación es adecuada las terneras de raza lechera llegan a la pubertad entre 9 y 11 meses, y los terneros entre 11 y 12 meses. En las razas de carne el período es más largo."]
[null,{"$f":"IF(C11>1.15*G10,\"GMD excessiu\",IF(C11<0.85*G10,\"GMD tan baix?\",\"GMD normal\"))","v":"GMD excessiu"},null,"Posible peso final ",null,{"$f":"IF(C10+C11*G11>D9*1.2,\"Temps excessiu\",C10+C11*G11)","v":430.9}]
[null,"Necesidades Totales"]
[null,{"$f":"IF(C6>=8,\"UFL\",\"UFV\")","v":"UFL"},{"$f":"NR!BE16","v":6.4133661404765849},null,"Datos para el racionamiento"]
[null,"PDI",{"$f":"NR!BF16","v":558.06401537251691},null,"Elegir modalidad racionamiento"]
[null,"Ca",{"$f":"NR!BI16/0.4","v":45.23747619146878},null,1]
[null,"P",{"$f":"NR!BH16/0.65","v":26.097826225606834}]
[null,"CI, UEB",{"$f":"NR!BG16","v":6.8440321847971122},null,"Tolerancia cálculos (%)",null,12.5,null,{"$f":"E16","v":1}]
[null,"Mg",{"$f":"NR!BJ16","v":10.396875},null,"Mínimo % MS Forraje",null,50]
[null,"Cl",{"$f":"NR!BK16","v":10.396875},null,null,null,"                                                                                                                                 "]
[null,"K",{"$f":"NR!BL16","v":43.267057352997689}]
[null,"Na",{"$f":"NR!BM16","v":7.5171717171717178}]
[null,"S",{"$f":"NR!BN16","v":16.994116628998402}]
[null,"Co",{"$f":"NR!BO16","v":0.93467641459491213}]
[null,"Cu",{"$f":"NR!BP16","v":100.6125}]
[null,"Mo",{"$f":"NR!BQ16","v":0}]
[null,"Iodo",{"$f":"NR!BR16","v":2.4}]
[null,"Fe",{"$f":"NR!BS16","v":350.2}]
[null,"Mn",{"$f":"NR!BT16","v":202.79999999999998}]
[null,"Se",{"$f":"NR!BU16","v":2.5491174943497601}]
[null,"Zn",{"$f":"NR!BV16","v":284.8}]
[null,"Vit A",{"$f":"NR!BW16","v":44000}]
[null,"Vit D",{"$f":"NR!BX16","v":6400}]
[null,"Vit E",{"$f":"NR!BY16","v":1040}]
[null,"Gproteínas/EfPDI",{"$f":"NR!AI16*1000/NR!AT16","v":255.34314613941956}]
[null,"CI, MSI",{"$f":"NR!AX16","v":8.4970583144992009}]
[null,"EfPDI",{"$f":"NR!AT16","v":0.64}]
[null,"BPR máximo",{"$f":"NR!AU16","v":-2}]
[null,"BPR mínimo",{"$f":"NR!AV16","v":-7.5}]

{"sheet":"II_Plantear Ración","index":8,"n_rows":81,"n_cols":15,"rows_kept":81,"cut":false,"hidden":false,"merged":[[12,7,12,9],[13,7,13,9],[4,7,4,9],[5,7,5,9],[6,7,6,9],[7,7,7,9],[8,7,8,9],[0,0,0,6],[1,0,2,0],[1,1,1,2],[1,3,1,5],[2,7,3,9],[0,7,1,14],[27,4,27,6],[32,4,32,5],[9,12,9,13],[7,13,7,14],[8,12,8,13],[9,7,9,9],[16,7,16,9],[17,7,17,9],[15,7,15,9],[19,11,21,11],[19,12,21,12],[10,7,10,9],[18,7,18,11],[14,7,14,9],[10,11,10,12],[11,7,11,9]]}
["Selección d'ingredients, límites d'incorporació i preu",null,null,null,null,null,null,"Hoja no protegida. Sólo se deben seleccionar los ingredientes, y para cada uno de ellos añadir las cantidades mínimas y máximas, que nunca deben ser negativas, y el precio de cada uno de ellos"]
[null,"Límites d'incorporació",null,"Cálculos",null,null,"Precio Ingrediente"]
[null,"kg mín","kg máx.","kg fresco","kg MS","% fresco ración","€/kg fresco","kg fresco total"]
[null,0,100,6.2962555193305345,{"$f":"D4*CálculosEV!D3/100","v":3.0222026492786562},{"$f":"(D4*100)/$K$4","v":64.452150102754572},0.04,null,null,null,{"$f":"SUM(D4:D26)","v":9.7688835970445673},{"$f":"K22","v":62.708764838073854},"%MS"]
[0,0,5,0,{"$f":"D5*CálculosEV!D4/100","v":0},0,0.03,"kg forraje fresco total",null,null,{"$f":"SUM(D4:D8)","v":6.2962555193305345}]
[0,0,0,0,{"$f":"D6*CálculosEV!D5/100","v":0},0,0.03,"kg concentrat fresco total",null,null,{"$f":"K4-K5","v":3.4726280777140328}]
[0,0,0,0,{"$f":"D7*CálculosEV!D6/100","v":0},0,0.01,"Aportaciones totales UE",null,null,{"$f":"SUMPRODUCT($E$4:$E$8,CálculosEV!E3:E7)","v":3.7159987516493778},{"$f":"L23","v":0.72266884316998248},"UE/kg MS"]
[0,0,0,0,{"$f":"D8*CálculosEV!D7/100","v":0},0,0.03,"kg MS total",null,null,{"$f":"SUM(E4:E26)","v":6.1259462421758473},{"$f":"I_Necesidades!C36","v":8.4970583144992009},{"$f":"K8-L8","v":-2.3711120723233536}," Diferencia MSI real y calculada"]
[0,0,0,0,{"$f":"D9*CálculosEV!D8/100","v":0},0,0.21,"kg MS total forraje",null,null,{"$f":"SUM(E4:E8)","v":3.0222026492786562},null,{"$f":"I_Necesidades!E18","v":"Tolerancia cálculos (%)"},null,{"$f":"I_Necesidades!G18","v":12.5}]
[0,0,4,2.9157378296966212,{"$f":"D10*CálculosEV!D9/100","v":2.5891751927705995},29.84719595367822,0.21,"kg MS total concentrado",null,null,{"$f":"K8-K9","v":3.103743592897191},{"$f":"K7/K9","v":1.2295663735641016},{"$f":"I_Necesidades!E19","v":"Mínimo % MS Forraje"},null,{"$f":"I_Necesidades!G19","v":50}]
[0,0,6,0,{"$f":"D11*CálculosEV!D10/100","v":0},0,0.3,"% MS forraje en la ración",null,null,{"$f":"(K9*100)/K8","v":49.334462461838612}]
[0,0,8,0,{"$f":"D12*CálculosEV!D11/100","v":0},0,0.64300000000000002,"PCO",null,null,{"$f":"(K10)/K8","v":0.50665537538161387},"Auxiliar cálculo Sg","A",{"$f":"IF(N17-0.85<0,1,1-(1.26*(N17-0.85)^0.84))","v":0.44156550295573738}]
[0,0,2,0.32840966543183725,{"$f":"D13*CálculosEV!D12/100","v":0.28637322825656208},3.3617932097296439,0.15,"Relación UF/UEB forraje",null,null,{"$f":"SUMPRODUCT($E$4:$E$8,CálculosEV!$F$3:$F$7)/SUMPRODUCT($E$4:$E$8,CálculosEV!$E$3:$E$7)","v":0.75645177788757201},null,"D",{"$f":"(1/N17)-N12","v":0.37172934757057829}]
[0,0,0,0,{"$f":"D14*CálculosEV!D13/100","v":0},0,0.12,"Tasa de sustitución global",null,null,{"$f":"(0.86/N17)*(1-N15*EXP(-N14/(1-K12)))","v":0.57827844660740058},null,"B",{"$f":"N17/(2.04*N13)","v":1.621417890277737}]
[0,0,0,0,{"$f":"D15*CálculosEV!D14/100","v":0},0,0.312,null,null,null,null,null,"K",{"$f":"N17*N13*EXP(N14/0.7)","v":4.6338292931675094}]
[0,0,0,0,{"$f":"D16*CálculosEV!D15/100","v":0},0,0.215,"VALOR FUNCIÓN OBJETIVO €/ración",null,null,{"$f":"SUMPRODUCT(D4:D26,G4:G26)","v":0.94728876797685879},null,"UEc",{"$f":"0.86*(1-N15*EXP(-N14/(1-K12)))","v":0.71103173250534357},{"$f":"N16/N17","v":0.57827844660740069}]
[0,0,0.5,0,{"$f":"D17*CálculosEV!D16/100","v":0},0,0.14599999999999999,"COSTE PARTE FORRAJERA",null,null,{"$f":"SUMPRODUCT(D4:D8,G4:G8)","v":0.25185022077322139},null,"UEf",{"$f":"K7/K9","v":1.2295663735641016}]
[null,0,0.2,0.2,{"$f":"D18*CálculosEV!D17/100","v":0.19980000000000003},2.0473168506225941,0.13600000000000001,"COSTE PARTE CONCENTRADA",null,null,{"$f":"K16-K17","v":0.6954385472036374}]
[0,0,0.3,0,{"$f":"D19*CálculosEV!D18/100","v":0},0,0.438,"Parámetros nutritivos, límites, valores finales"]
[0,0,0,0,{"$f":"D20*CálculosEV!D19/100","v":0},0,0.6,"Parámetros","Mínimo","Máximo","Valor","Valor/kg MS o %","En algunos ingredientes de la ración no constan los nutrientes ..."]
[0,0,1,2.1363022956672275E-2,{"$f":"D21*CálculosEV!D20/100","v":2.1363022956672272E-2},0.21868438439716226,0.28999999999999998,"MSI (kg/día)",0,999,{"$f":"K8","v":6.1259462421758473}]
[0,0,1,7.1175596289035636E-3,{"$f":"D22*CálculosEV!D21/100","v":7.0321489133567203E-3},7.2859498817826815E-2,6.7000000000000004E-2,"%MS ración",0,999,{"$f":"SUMPRODUCT(F4:F26,CálculosEV!D3:D25)/100","v":62.708764838073854}]
[null,0,0,0,{"$f":"D23*CálculosEV!D22/100","v":0},0,0.28499999999999998,"UEB",{"$f":"0.7*I_Necesidades!C18","v":4.7908225293579783},{"$f":"I_Necesidades!C18","v":6.8440321847971122},{"$f":"CálculosEV!E26+0.86*(1-'II_Plantear Ración'!N15*EXP(-'II_Plantear Ración'!N14/(1-'II_Plantear Ración'!K12)))","v":4.427030484154721},{"$f":"K23/$K$8","v":0.72266884316998248},{"$f":"CálculosEV!AN$21","v":""}]
[null,0,0,0,{"$f":"D24*CálculosEV!D23/100","v":0},0,0.01,{"$f":"I_Necesidades!B14","v":"UFL"},{"$f":"IF(I_Necesidades!E16=2,I_Necesidades!C14,I_Necesidades!C14*B47/B48)","v":6.7933185968370333},{"$f":"IF(I_Necesidades!E16=2,I_Necesidades!C14,I_Necesidades!C14*B47/B48)","v":6.7933185968370333},{"$f":"CálculosEV!F26","v":6.6596982335759476},{"$f":"K24/$K$8","v":1.0871297217277767},{"$f":"CálculosEV!AO$21","v":""}]
[null,0,0,0,{"$f":"D25*CálculosEV!D24/100","v":0},0,0.01,"PDI",{"$f":"IF(I_Necesidades!E16=2,((100-$O$9)/100)*G31,((100-$O$9)/100)*(G32+(G33+M8*0.5*(5.7+0.074*B57)/B79)*G34/B79))","v":463.48149992405661},{"$f":"IF(I_Necesidades!E16=2,(100+$O$9)/100*G31,(100+$O$9)/100*(G32+(G33+M8*0.5*(5.7+0.074*B57)/B79)*G34/B79))","v":595.90478561664418},{"$f":"CálculosEV!G26","v":446.66835797996043},{"$f":"K25/$K$8","v":72.914181796886012},{"$f":"CálculosEV!AP$21","v":""}]
[null,0,0,0,{"$f":"D26*CálculosEV!D25/100","v":0},0,0.01,"BPR",{"$f":"ABS(I_Necesidades!C39)","v":7.5},{"$f":"ABS(I_Necesidades!C38)","v":2},{"$f":"CálculosEV!H26","v":-37.071293898075801},{"$f":"ABS(K26/K21)","v":6.0515212560710649},{"$f":"CálculosEV!AQ$21","v":""}]
[null,null,null,null,null,{"$f":"SUM(F4:F26)","v":100.00000000000001},null,"NI",{"$f":"CálculosEV!I26","v":1.8155037923812882},{"$f":"CálculosEV!I26","v":1.8155037923812882},{"$f":"K21*100/I_Necesidades!C10","v":1.5314865605439618},{"$f":"K27","v":1.5314865605439618},{"$f":"CálculosEV!AR$21","v":""}]
["Efecto NI",null,null,null,{"$f":"I_Necesidades!B7","v":"Datos orientativos"},null,null,"Ca",{"$f":"((100-$O$9)/100)*I_Necesidades!C16","v":39.582791667535183},{"$f":"(100+$O$9)/100*I_Necesidades!C16","v":50.892160715402376},{"$f":"CálculosEV!J26","v":13.907864586996599},{"$f":"K28/$K$8","v":2.2703210307729909},{"$f":"CálculosEV!AS$21","v":""}]
["NIref",{"$f":"J27","v":1.8155037923812882},null,null,null,"CI",{"$f":"I_Necesidades!C18","v":6.8440321847971122},"P",{"$f":"((100-$O$9)/100)*I_Necesidades!C17","v":22.835597947405979},{"$f":"(100+$O$9)/100*I_Necesidades!C17","v":29.360054503807689},{"$f":"CálculosEV!K26","v":15.438687952097629},2.5202127706909212,{"$f":"CálculosEV!AT21","v":""}]
["NI % PV",{"$f":"K27","v":1.5314865605439618},null,null,null,"UFV",{"$f":"I_Necesidades!C14","v":6.4133661404765849},"Mg",{"$f":"((100-$O$9)/100)*I_Necesidades!C19","v":9.0972656250000004},{"$f":"(100+$O$9)/100*I_Necesidades!C19","v":11.696484374999999},{"$f":"CálculosEV!L26","v":4.1742962314412804},0.68141248166726176,{"$f":"CálculosEV!AU21","v":"Mg"}]
["dMOm",{"$f":"76-2.74*B30","v":71.803726824109546},null,null,null,"PDI",{"$f":"I_Necesidades!C15","v":558.06401537251691},"K",{"$f":"((100-$O$9)/100)*I_Necesidades!C21","v":37.858675183872975},{"$f":"(100+$O$9)/100*I_Necesidades!C21","v":48.675439522122403},{"$f":"CálculosEV!M26","v":20.105825483684097},3.2820767092697829,{"$f":"CálculosEV!AV21","v":"K"}]
["Δ dMO_NI ",{"$f":"-2.74*(B30-B29)/100","v":7.7820721523427436E-3},null,null,null,"NecPDI_PUendo",{"$f":"B68","v":124.8},"Na",{"$f":"((100-$O$9)/100)*I_Necesidades!C22","v":6.5775252525252528},{"$f":"(100+$O$9)/100*I_Necesidades!C22","v":8.456818181818182},{"$f":"CálculosEV!N26","v":1.4702648516806913},0.24000616289418736,{"$f":"CálculosEV!AW21","v":"Na"}]
["Efecto %Co (PCO)",null,null,null,"PDI - NecPDI_PUendo",null,{"$f":"G31-G32","v":433.26401537251689},"S",{"$f":"((100-$O$9)/100)*I_Necesidades!C23","v":14.869852050373602},{"$f":"(100+$O$9)/100*I_Necesidades!C23","v":19.118381207623202},{"$f":"CálculosEV!O26","v":7.7353658026923927E-2},1.262721789727117E-2,{"$f":"CálculosEV!AX21","v":"S"}]
["PCO",{"$f":"K12","v":0.50665537538161387},null,null,null,"EfPDI",{"$f":"I_Necesidades!C37","v":0.64},"Cl",{"$f":"((100-$O$9)/100)*I_Necesidades!C20","v":9.0972656250000004},{"$f":"(100+$O$9)/100*I_Necesidades!C20","v":11.696484374999999},{"$f":"CálculosEV!P26","v":2.8128795453426884E-3},4.5917470283637267E-4,{"$f":"CálculosEV!AY21","v":"Cl"}]
["Δ dMO_CO ",{"$f":"IF(B34=0,0,(-6.5/(1+(0.35/B34)^3))/100)","v":-4.8884679665652818E-2},null,null,null,null,null,"Co",{"$f":"((100-$O$9)/100)*I_Necesidades!C24","v":0.81784186277054816},{"$f":"(100+$O$9)/100*I_Necesidades!C24","v":1.0515109664192761},{"$f":"CálculosEV!Q26","v":1.1585918652616158},0.18912863734992569,{"$f":"CálculosEV!AZ21","v":"Co"}]
["Efecto balance proteico rumen",null,null,null,null,null,null,"Cu",{"$f":"((100-$O$9)/100)*I_Necesidades!C25","v":88.035937500000003},{"$f":"(100+$O$9)/100*I_Necesidades!C25","v":113.18906249999999},{"$f":"CálculosEV!R26","v":15.618082747227019},2.5494971927275194,{"$f":"CálculosEV!AN$21","v":""}]
["MNT ingerida",{"$f":"L45","v":126.53971960692698},null,null,null,null,null,"Mn",{"$f":"((100-$O$9)/100)*I_Necesidades!C29","v":177.45},{"$f":"(100+$O$9)/100*I_Necesidades!C29","v":228.14999999999998},{"$f":"CálculosEV!S26","v":58.083993487554316},9.4816361736344135,{"$f":"CálculosEV!BB21","v":"Mn"}]
["MOrD o MOF",{"$f":"L57","v":550.8569544750992},null,null,null,null,null,"Zn",{"$f":"((100-$O$9)/100)*I_Necesidades!C31","v":249.20000000000002},{"$f":"(100+$O$9)/100*I_Necesidades!C27","v":2.6999999999999997},{"$f":"CálculosEV!T26","v":78.811852986390917},12.865253769905445,{"$f":"CálculosEV!BC21","v":"Zn"}]
["MNrD_rumen (MNF) fermentadas rumen",{"$f":"B37*L56","v":92.033906858740977},null,null,null,null,null,"Iodo",{"$f":"((100-$O$9)/100)*I_Necesidades!C27","v":2.1},{"$f":"(100+$O$9)/100*I_Necesidades!C27","v":2.6999999999999997},{"$f":"CálculosEV!U26","v":0},0,{"$f":"CálculosEV!BD21","v":"Iodo"}]
["MN alim_duodeno (PIA) no ferm en rumen",{"$f":"B37*(1-L56)","v":34.505812748186003},null,null,null,null,null,"Se",{"$f":"((100-$O$9)/100)*I_Necesidades!C30","v":2.2304778075560403},{"$f":"(100+$O$9)/100*I_Necesidades!C30","v":2.8677571811434799},{"$f":"CálculosEV!V26","v":0.10905816948672441},1.7802665119044291E-2,{"$f":"CálculosEV!BE21","v":"Se"}]
["MN microbiana intestíno ( 41,7 + 71,9 x 10^-3 x MOrD_rumen + 8,40 x PCO)",{"$f":"41.7+(B38*71.9*10^-3)+8.4*B34","v":85.562520179965205},null,null,null,null,null,"Vit A",{"$f":"((100-$O$9)/100)*I_Necesidades!C32","v":38500},{"$f":"(100+$O$9)/100*I_Necesidades!C32","v":49500},{"$f":"CálculosEV!W26","v":27026.536386999851},4411.8141620192246,{"$f":"CálculosEV!BF21","v":"Vit A"}]
["MN endógena",14.2,null,null,null,null,null,"Vit D",{"$f":"((100-$O$9)/100)*I_Necesidades!C33","v":5600},{"$f":"(100+$O$9)/100*I_Necesidades!C33","v":7200},{"$f":"CálculosEV!X26","v":604.44052987571126},98.668924926938757,{"$f":"CálculosEV!BG21","v":"Vit D"}]
["BPR ración",{"$f":"B37-(B40+B41+B42)","v":-7.7286133212242305},null,null,null,null,null,"Vit E",{"$f":"((100-$O$9)/100)*I_Necesidades!C34","v":910},{"$f":"(100+$O$9)/100*I_Necesidades!C34","v":1170},{"$f":"CálculosEV!Y26","v":100.82600566345423},16.458845977016328,{"$f":"CálculosEV!BH21","v":""}]
["BPR ref",{"$f":"-L26","v":-6.0515212560710649},null,null,null,null,null,"AG",null,null,{"$f":"CálculosEV!Z26","v":296.39715631082981},48.383897702235444,{"$f":"CálculosEV!BI21","v":""}]
["Δ dMO_BPR",{"$f":"(0.06*(B43-B44))/100","v":-1.0062552390918992E-3},null,null,null,null,null,"MNT_PB",null,null,{"$f":"CálculosEV!AA26","v":775.17551981203974},126.53971960692698,{"$f":"CálculosEV!BJ21","v":""}]
[null,null,null,null,null,null,null,"PDIA",null,null,{"$f":"CálculosEV!AB26","v":160.98166774568728},26.278661513116532,{"$f":"CálculosEV!BK21","v":""}]
["∑ dMO x PMO",{"$f":"K47","v":0.75288082926927136},null,null,null,null,null,"dMO",null,{"$f":"B48","v":0.71077196651686936},{"$f":"CálculosEV!AC26","v":0.75288082926927136},{"$f":"J47","v":0.71077196651686936},{"$f":"CálculosEV!BL21","v":""}]
["Efecto total interacciones",{"$f":"B47+(B32+B35+B45)","v":0.71077196651686936},null,null,null,null,null,"MOD",null,null,{"$f":"CálculosEV!AD26","v":4147.7103975835089},{"$f":"K48/$K$8","v":677.07260782463254},{"$f":"CálculosEV!BM21","v":""}]
[null,null,null,null,null,null,null,"EE",null,null,{"$f":"CálculosEV!AE26","v":322.18763849827201},{"$f":"K49/($K$8*10)","v":5.2593938268683802},{"$f":"CálculosEV!BN21","v":""}]
["MODc_rumen (MOF corregida)",{"$f":"B38*B48/B47","v":520.04735089585597},null,null,null,null,null,"FB",null,null,{"$f":"CálculosEV!AF26","v":1104.6824963235892},{"$f":"K50/$K$8","v":180.32846725263167},{"$f":"CálculosEV!BO21","v":""}]
["PANDI",{"$f":"0.193*B40","v":6.6596218603998985},null,null,null,null,null,"NDF",null,null,{"$f":"CálculosEV!AG26","v":2368.9222903800692},386.70308173299645,{"$f":"CálculosEV!BP21","v":""}]
["dr",{"$f":"(B40-B51)/B40","v":0.80700000000000005},null,null,null,null,null,"ADF",null,null,{"$f":"CálculosEV!AH26","v":1361.6272232610343},222.27214693568777,{"$f":"CálculosEV!BQ21","v":""}]
["PDIA",{"$f":"B37*(1-L56)*B52","v":27.846190887786104},null,null,null,null,null,"Lignina",null,null,{"$f":"CálculosEV!AI26","v":33.361088159279689},5.4458669469861878,{"$f":"CálculosEV!BR21","v":"Lignina"}]
["MN microbianas_duodeno (corregida)",{"$f":"40.7+75.6*10^-3*B50+8.07*B34-0.0114*B43","v":84.192394798918301},null,null,null,null,null,"cendres",null,null,{"$f":"CálculosEV!AJ26","v":408.68630980108611},66.713988932414566,{"$f":"CálculosEV!BS21","v":""}]
["PDI = PDIA + MN microbianas_duodeno x 0,8 x 0,8",{"$f":"B53+B54*0.8*0.8","v":81.729323559093828},null,null,null,null,null,"Mo",null,null,{"$f":"CálculosEV!AK26","v":1.4354110028012725},0.23431661755677363,{"$f":"CálculosEV!BT21","v":"Mo"}]
["flux de N duodenal endógeno (Actualización)",null,null,null,null,null,null,"DT_N",null,null,{"$f":"CálculosEV!AL26","v":0.7273123975983814},{"$f":"K56","v":0.7273123975983814},{"$f":"CálculosEV!BU21","v":"DT_N"}]
["MOND = MO - MODc_rumen",{"$f":"L58-B50","v":379.26178476348002},null,null,null,null,null,"MOF",null,null,{"$f":"CálculosEV!AM26","v":3374.5200902431657},{"$f":"K57/K21","v":550.8569544750992},{"$f":"CálculosEV!BV21","v":"MOF"}]
["N duodenal endo, g MNT/kg MSI = 14,2 x MSI",{"$f":"14.2*K8","v":86.988436638897028},null,null,null,null,null,"MO",null,null,{"$f":"K48/K47","v":5509.1194201467188},{"$f":"K58/K21","v":899.30913565933599},{"$f":"CálculosEV!AN$21","v":""}]
["PÉRDIDAS FECALES ENDÓGENAS (PEF)  i (NEC_PDI Actualización)",null,null,null,null,null,null,"PDI/UFL",{"$f":"((100-$O$9)/100)*I_Necesidades!C15/I_Necesidades!C14","v":76.13880180161766},{"$f":"((100+$O$9)/100)*I_Necesidades!C15/I_Necesidades!C14","v":97.892745173508416},{"$f":"K25/K24","v":67.070359994392774},{"$f":"K59","v":67.070359994392774}]
["MNND = 0,163 x MN alim_duodeno + 0,20 x MN mic_duodeno + 5,7 + 0,074 x MOND",{"$f":"0.163*B40+0.2*B54+5.7+0.074*B57","v":56.228298510235504}]
["PEF (proteínas endógenas fecales) = 5,7 + 0,074 x MOND",{"$f":"5.7+0.074*B57","v":33.76537207249752}]
["Nec PDI_PEF = MSI x [0,5 x (5,7 + 0,074 x MOND)]/EfPDI",{"$f":"K8*(0.5*(5.7+0.074*B57))/B79","v":179.94208284658305}]
["PÉRDIDAS ENDÓGENAS URINÁRIAS Y (NEC_PDI Actualización)"]
["log10 NU (N urinario g/día) log10 NU = - 1,17 + 1,00 x log10 Pv",{"$f":"-1.17+LOG10(I_Necesidades!C10)","v":1.4320599913279626}]
["NU",{"$f":"10^B64","v":27.043319015679291}]
["NUNP microbiano/NU =  0,3325/(1 + (NU/0,203))",{"$f":"0.3325/(1+(B65/0.203))","v":2.4773071166478522E-3}]
["NU endo",{"$f":"0.05*I_Necesidades!C10","v":20}]
["Nec PDI_NU endo",{"$f":"0.312*I_Necesidades!C10","v":124.8}]
["PÉRDIDAS NITROGENADES POR LA EPIDERMIS Y (Nec_PDI Actualización)"]
["P epidérmicas (0,2 g PDI/kg Pv0,60)",{"$f":"0.2*I_Necesidades!C10^0.6","v":7.2822568121043192}]
["Nec PDI_P epidérmicas = 0,2 x Pv0,60/EffPDI",{"$f":"B70/B79","v":12.670215692772048}]
["Nec_PDI no productivas",{"$f":"B62+B68+B71","v":317.41229853935511}]
["Eficacia de la síntesis proteica en lactación"]
["PDI disponible = PDI ingerida - Nec PDI_NU endógenas",{"$f":"K25-B68","v":321.86835797996042}]
["EfPDI = ∑ usos prot/PDI disponible = 0,67xEXP(-0,007x(PDI-100)",{"$f":"0.67*EXP(-0.007*(L25-100))","v":0.8098738054649689}]
["Bal EN",{"$f":"K24-G30","v":0.24633209309936266}]
["bal Proteína ",{"$f":"K25-G31","v":-111.39565739255647}]
["Incremento o ganancia Proteína",{"$f":"I_Necesidades!C35","v":255.34314613941956}]
["EfPDI = (PEF + P epid + MP + bal Prote)/(PDI disponible)",{"$f":"IF(B76>0,(B61+B70+B78+B77)/B74,(B61+B70+B78)/(B74+ABS(B77)))","v":0.57475397330912159}]
[]
["NUcal=0,79xBPR/6,25 + (PDI/6,25) x (1-E·fPDI)+Nuendo + NUNPmic + 0,47X bal N",{"$f":"(0.79*B43/6.25+(K25/6.25)*(1-B79)+B67/6.25+(B41/6.25)+0.47*ABS(B77)/6.25)/I_Necesidades!C10","v":0.1367027276440867}]

{"sheet":"III_Resultado Ración","index":9,"n_rows":59,"n_cols":10,"rows_kept":59,"cut":false,"hidden":false,"merged":[[1,6,1,8],[0,5,0,6],[8,9,10,9]]}
["Explotación:","Fecha",{"$f":"TODAY()","v":"2023-10-19"},"Peso inicial",{"$f":"I_Necesidades!C10","v":400},"Tiempo en días",null,{"$f":"I_Necesidades!G11","v":30}]
[{"$f":"NR!A16","v":"9.-Terneros precoces Crecimiento de 6 a 24 meses"},"GMD, kg/día",{"$f":"I_Necesidades!C11","v":1.03},"Peso final",{"$f":"I_Necesidades!F12","v":430.9}]
[]
["INGREDIENTES","kg/día","% MF","kg/tonelada ","COSTE",null,"NUTRIENTES","ANÁLISIS"]
[{"$f":"IF(B5=\"\",\"\",CálculosEV!B3)","v":"ENSILADO Prat natural plano, gramíneas en gran parte"},{"$f":"IF('II_Plantear Ración'!D4=0,\"\",'II_Plantear Ración'!D4)","v":6.2962555193305345},{"$f":"IF('II_Plantear Ración'!D4=0,\"\",'II_Plantear Ración'!F4)","v":64.452150102754572},{"$f":"IF('II_Plantear Ración'!D4=0,\"\",('II_Plantear Ración'!D4*1000)/('II_Plantear Ración'!$K$4))","v":644.5215010275457},{"$f":"IF('II_Plantear Ración'!D4=0,\"\",'II_Plantear Ración'!G4*B5)","v":0.25185022077322139},null,"MSI (kg/día)",{"$f":"'II_Plantear Ración'!K21","v":6.1259462421758473},"Kg"]
[{"$f":"IF(B6=\"\",\"\",CálculosEV!B4)","v":""},{"$f":"IF('II_Plantear Ración'!D5=0,\"\",'II_Plantear Ración'!D5)","v":""},{"$f":"IF('II_Plantear Ración'!D5=0,\"\",'II_Plantear Ración'!F5)","v":""},{"$f":"IF('II_Plantear Ración'!D5=0,\"\",('II_Plantear Ración'!D5*1000)/('II_Plantear Ración'!$K$4))","v":""},{"$f":"IF('II_Plantear Ración'!D5=0,\"\",'II_Plantear Ración'!G5*B6)","v":""},null,"%MS ración",{"$f":"'II_Plantear Ración'!K22","v":62.708764838073854},{"$f":"IF('II_Plantear Ración'!L23=1,\"g\",\"%\")","v":"%"}]
[{"$f":"IF(B7=\"\",\"\",CálculosEV!B5)","v":""},{"$f":"IF('II_Plantear Ración'!D6=0,\"\",'II_Plantear Ración'!D6)","v":""},{"$f":"IF('II_Plantear Ración'!D6=0,\"\",'II_Plantear Ración'!F6)","v":""},{"$f":"IF('II_Plantear Ración'!D6=0,\"\",('II_Plantear Ración'!D6*1000)/('II_Plantear Ración'!$K$4))","v":""},{"$f":"IF('II_Plantear Ración'!D6=0,\"\",'II_Plantear Ración'!G6*B7)","v":""},null,"UEB",{"$f":"'II_Plantear Ración'!L23","v":0.72266884316998248},"UEB/kg MS"]
[{"$f":"IF(B8=\"\",\"\",CálculosEV!B6)","v":""},{"$f":"IF('II_Plantear Ración'!D7=0,\"\",'II_Plantear Ración'!D7)","v":""},{"$f":"IF('II_Plantear Ración'!D7=0,\"\",'II_Plantear Ración'!F7)","v":""},{"$f":"IF('II_Plantear Ración'!D7=0,\"\",('II_Plantear Ración'!D7*1000)/('II_Plantear Ración'!$K$4))","v":""},{"$f":"IF('II_Plantear Ración'!D7=0,\"\",'II_Plantear Ración'!G7*B8)","v":""},null,"UFV",{"$f":"'II_Plantear Ración'!L24","v":1.0871297217277767},"UFV/kg MS"]
[{"$f":"IF(B9=\"\",\"\",CálculosEV!B7)","v":""},{"$f":"IF('II_Plantear Ración'!D8=0,\"\",'II_Plantear Ración'!D8)","v":""},{"$f":"IF('II_Plantear Ración'!D8=0,\"\",'II_Plantear Ración'!F8)","v":""},{"$f":"IF('II_Plantear Ración'!D8=0,\"\",('II_Plantear Ración'!D8*1000)/('II_Plantear Ración'!$K$4))","v":""},{"$f":"IF('II_Plantear Ración'!D8=0,\"\",'II_Plantear Ración'!G8*B9)","v":""},null,"PDI",{"$f":"'II_Plantear Ración'!L25","v":72.914181796886012},"g/kg MS",{"$f":"'II_Plantear Ración'!M20","v":"En algunos ingredientes de la ración no constan los nutrientes ..."}]
[{"$f":"IF(B10=\"\",\"\",CálculosEV!B8)","v":""},{"$f":"IF('II_Plantear Ración'!D9=0,\"\",'II_Plantear Ración'!D9)","v":""},{"$f":"IF('II_Plantear Ración'!D9=0,\"\",'II_Plantear Ración'!F9)","v":""},{"$f":"IF('II_Plantear Ración'!D9=0,\"\",('II_Plantear Ración'!D9*1000)/('II_Plantear Ración'!$K$4))","v":""},{"$f":"IF('II_Plantear Ración'!D9=0,\"\",'II_Plantear Ración'!G9*B10)","v":""},null,"BPR",{"$f":"'II_Plantear Ración'!L26","v":6.0515212560710649},"g PDI/kg MS"]
[{"$f":"IF(B11=\"\",\"\",CálculosEV!B9)","v":"Cebada grano"},{"$f":"IF('II_Plantear Ración'!D10=0,\"\",'II_Plantear Ración'!D10)","v":2.9157378296966212},{"$f":"IF('II_Plantear Ración'!D10=0,\"\",'II_Plantear Ración'!F10)","v":29.84719595367822},{"$f":"IF('II_Plantear Ración'!D10=0,\"\",('II_Plantear Ración'!D10*1000)/('II_Plantear Ración'!$K$4))","v":298.47195953678215},{"$f":"IF('II_Plantear Ración'!D10=0,\"\",'II_Plantear Ración'!G10*B11)","v":0.61230494423629045},null,"NI",{"$f":"'II_Plantear Ración'!L27","v":1.5314865605439618},"% Pv"]
[{"$f":"IF(B12=\"\",\"\",CálculosEV!B10)","v":""},{"$f":"IF('II_Plantear Ración'!D11=0,\"\",'II_Plantear Ración'!D11)","v":""},{"$f":"IF('II_Plantear Ración'!D11=0,\"\",'II_Plantear Ración'!F11)","v":""},{"$f":"IF('II_Plantear Ración'!D11=0,\"\",('II_Plantear Ración'!D11*1000)/('II_Plantear Ración'!$K$4))","v":""},{"$f":"IF('II_Plantear Ración'!D11=0,\"\",'II_Plantear Ración'!G11*B12)","v":""},null,"Ca",{"$f":"'II_Plantear Ración'!L28","v":2.2703210307729909},"g/kg MS",{"$f":"'II_Plantear Ración'!M28","v":""}]
[{"$f":"IF(B13=\"\",\"\",CálculosEV!B11)","v":""},{"$f":"IF('II_Plantear Ración'!D12=0,\"\",'II_Plantear Ración'!D12)","v":""},{"$f":"IF('II_Plantear Ración'!D12=0,\"\",'II_Plantear Ración'!F12)","v":""},{"$f":"IF('II_Plantear Ración'!D12=0,\"\",('II_Plantear Ración'!D12*1000)/('II_Plantear Ración'!$K$4))","v":""},{"$f":"IF('II_Plantear Ración'!D12=0,\"\",'II_Plantear Ración'!G12*B13)","v":""},null,"P",{"$f":"'II_Plantear Ración'!L29","v":2.5202127706909212},"g/kg MS",{"$f":"'II_Plantear Ración'!M29","v":""}]
[{"$f":"IF(B14=\"\",\"\",CálculosEV!B12)","v":"Soja torta 44"},{"$f":"IF('II_Plantear Ración'!D13=0,\"\",'II_Plantear Ración'!D13)","v":0.32840966543183725},{"$f":"IF('II_Plantear Ración'!D13=0,\"\",'II_Plantear Ración'!F13)","v":3.3617932097296439},{"$f":"IF('II_Plantear Ración'!D13=0,\"\",('II_Plantear Ración'!D13*1000)/('II_Plantear Ración'!$K$4))","v":33.617932097296439},{"$f":"IF('II_Plantear Ración'!D13=0,\"\",'II_Plantear Ración'!G13*B14)","v":4.9261449814775586E-2},null,"Mg",{"$f":"'II_Plantear Ración'!L30","v":0.68141248166726176},"g/kg MS",{"$f":"'II_Plantear Ración'!M30","v":"Mg"}]
[{"$f":"IF(B15=\"\",\"\",CálculosEV!B13)","v":""},{"$f":"IF('II_Plantear Ración'!D14=0,\"\",'II_Plantear Ración'!D14)","v":""},{"$f":"IF('II_Plantear Ración'!D14=0,\"\",'II_Plantear Ración'!F14)","v":""},{"$f":"IF('II_Plantear Ración'!D14=0,\"\",('II_Plantear Ración'!D14*1000)/('II_Plantear Ración'!$K$4))","v":""},{"$f":"IF('II_Plantear Ración'!D14=0,\"\",'II_Plantear Ración'!G14*B15)","v":""},null,"K",{"$f":"'II_Plantear Ración'!L31","v":3.2820767092697829},"g/kg MS",{"$f":"'II_Plantear Ración'!M31","v":"K"}]
[{"$f":"IF(B16=\"\",\"\",CálculosEV!B14)","v":""},{"$f":"IF('II_Plantear Ración'!D15=0,\"\",'II_Plantear Ración'!D15)","v":""},{"$f":"IF('II_Plantear Ración'!D15=0,\"\",'II_Plantear Ración'!F15)","v":""},{"$f":"IF('II_Plantear Ración'!D15=0,\"\",('II_Plantear Ración'!D15*1000)/('II_Plantear Ración'!$K$4))","v":""},{"$f":"IF('II_Plantear Ración'!D15=0,\"\",'II_Plantear Ración'!G15*B16)","v":""},null,"Na",{"$f":"'II_Plantear Ración'!L32","v":0.24000616289418736},"g/kg MS",{"$f":"'II_Plantear Ración'!M32","v":"Na"}]
[{"$f":"IF(B17=\"\",\"\",CálculosEV!B15)","v":""},{"$f":"IF('II_Plantear Ración'!D16=0,\"\",'II_Plantear Ración'!D16)","v":""},{"$f":"IF('II_Plantear Ración'!D16=0,\"\",'II_Plantear Ración'!F16)","v":""},{"$f":"IF('II_Plantear Ración'!D16=0,\"\",('II_Plantear Ración'!D16*1000)/('II_Plantear Ración'!$K$4))","v":""},{"$f":"IF('II_Plantear Ración'!D16=0,\"\",'II_Plantear Ración'!G16*B17)","v":""},null,"S",{"$f":"'II_Plantear Ración'!L33","v":1.262721789727117E-2},"g/kg MS",{"$f":"'II_Plantear Ración'!M33","v":"S"}]
[{"$f":"IF(B18=\"\",\"\",CálculosEV!B16)","v":""},{"$f":"IF('II_Plantear Ración'!D17=0,\"\",'II_Plantear Ración'!D17)","v":""},{"$f":"IF('II_Plantear Ración'!D17=0,\"\",'II_Plantear Ración'!F17)","v":""},{"$f":"IF('II_Plantear Ración'!D17=0,\"\",('II_Plantear Ración'!D17*1000)/('II_Plantear Ración'!$K$4))","v":""},{"$f":"IF('II_Plantear Ración'!D17=0,\"\",'II_Plantear Ración'!G17*B18)","v":""},null,"Cl",{"$f":"'II_Plantear Ración'!L34","v":4.5917470283637267E-4},"g/kg MS",{"$f":"'II_Plantear Ración'!M34","v":"Cl"}]
[{"$f":"IF(B19=\"\",\"\",CálculosEV!B17)","v":"Grasa vegetal, manteca de cerdo (todos los tipos)"},{"$f":"IF('II_Plantear Ración'!D18=0,\"\",'II_Plantear Ración'!D18)","v":0.2},{"$f":"IF('II_Plantear Ración'!D18=0,\"\",'II_Plantear Ración'!F18)","v":2.0473168506225941},{"$f":"IF('II_Plantear Ración'!D18=0,\"\",('II_Plantear Ración'!D18*1000)/('II_Plantear Ración'!$K$4))","v":20.473168506225939},{"$f":"IF('II_Plantear Ración'!D18=0,\"\",'II_Plantear Ración'!G18*B19)","v":2.7200000000000002E-2},null,"Co",{"$f":"'II_Plantear Ración'!L35","v":0.18912863734992569},"mg/kg MS",{"$f":"'II_Plantear Ración'!M35","v":"Co"}]
[{"$f":"IF(B20=\"\",\"\",CálculosEV!B18)","v":""},{"$f":"IF('II_Plantear Ración'!D19=0,\"\",'II_Plantear Ración'!D19)","v":""},{"$f":"IF('II_Plantear Ración'!D19=0,\"\",'II_Plantear Ración'!F19)","v":""},{"$f":"IF('II_Plantear Ración'!D19=0,\"\",('II_Plantear Ración'!D19*1000)/('II_Plantear Ración'!$K$4))","v":""},{"$f":"IF('II_Plantear Ración'!D19=0,\"\",'II_Plantear Ración'!G19*B20)","v":""},null,"Cu",{"$f":"'II_Plantear Ración'!L36","v":2.5494971927275194},"mg/kg MS",{"$f":"'II_Plantear Ración'!M36","v":""}]
[{"$f":"IF(B21=\"\",\"\",CálculosEV!B19)","v":""},{"$f":"IF('II_Plantear Ración'!D20=0,\"\",'II_Plantear Ración'!D20)","v":""},{"$f":"IF('II_Plantear Ración'!D20=0,\"\",'II_Plantear Ración'!F20)","v":""},{"$f":"IF('II_Plantear Ración'!D20=0,\"\",('II_Plantear Ración'!D20*1000)/('II_Plantear Ración'!$K$4))","v":""},{"$f":"IF('II_Plantear Ración'!D20=0,\"\",'II_Plantear Ración'!G20*B21)","v":""},null,"Mn",{"$f":"'II_Plantear Ración'!L37","v":9.4816361736344135},"mg/kg MS",{"$f":"'II_Plantear Ración'!M37","v":"Mn"}]
[{"$f":"IF(B22=\"\",\"\",CálculosEV!B20)","v":"Carbonato de cobalto"},{"$f":"IF('II_Plantear Ración'!D21=0,\"\",'II_Plantear Ración'!D21)","v":2.1363022956672275E-2},{"$f":"IF('II_Plantear Ración'!D21=0,\"\",'II_Plantear Ración'!F21)","v":0.21868438439716226},{"$f":"IF('II_Plantear Ración'!D21=0,\"\",('II_Plantear Ración'!D21*1000)/('II_Plantear Ración'!$K$4))","v":2.1868438439716229},{"$f":"IF('II_Plantear Ración'!D21=0,\"\",'II_Plantear Ración'!G21*B22)","v":6.1952766574349593E-3},null,"Zn",{"$f":"'II_Plantear Ración'!L38","v":12.865253769905445},"mg/kg MS",{"$f":"'II_Plantear Ración'!M38","v":"Zn"}]
[{"$f":"IF(B23=\"\",\"\",CálculosEV!B21)","v":"Fosfato bicálcico"},{"$f":"IF('II_Plantear Ración'!D22=0,\"\",'II_Plantear Ración'!D22)","v":7.1175596289035636E-3},{"$f":"IF('II_Plantear Ración'!D22=0,\"\",'II_Plantear Ración'!F22)","v":7.2859498817826815E-2},{"$f":"IF('II_Plantear Ración'!D22=0,\"\",('II_Plantear Ración'!D22*1000)/('II_Plantear Ración'!$K$4))","v":0.72859498817826807},{"$f":"IF('II_Plantear Ración'!D22=0,\"\",'II_Plantear Ración'!G22*B23)","v":4.768764951365388E-4},null,"Iodo",{"$f":"'II_Plantear Ración'!L39","v":0},"mg/kg MS",{"$f":"'II_Plantear Ración'!M39","v":"Iodo"}]
[{"$f":"IF(B24=\"\",\"\",CálculosEV!B22)","v":""},{"$f":"IF('II_Plantear Ración'!D23=0,\"\",'II_Plantear Ración'!D23)","v":""},{"$f":"IF('II_Plantear Ración'!D23=0,\"\",'II_Plantear Ración'!F23)","v":""},{"$f":"IF('II_Plantear Ración'!D23=0,\"\",('II_Plantear Ración'!D23*1000)/('II_Plantear Ración'!$K$4))","v":""},{"$f":"IF('II_Plantear Ración'!D23=0,\"\",'II_Plantear Ración'!G23*B24)","v":""},null,"Se",{"$f":"'II_Plantear Ración'!L40","v":1.7802665119044291E-2},"mg/kg MS",{"$f":"'II_Plantear Ración'!M40","v":"Se"}]
[{"$f":"IF(B25=\"\",\"\",CálculosEV!B23)","v":""},{"$f":"IF('II_Plantear Ración'!D24=0,\"\",'II_Plantear Ración'!D24)","v":""},{"$f":"IF('II_Plantear Ración'!D24=0,\"\",'II_Plantear Ración'!F24)","v":""},{"$f":"IF('II_Plantear Ración'!D24=0,\"\",('II_Plantear Ración'!D24*1000)/('II_Plantear Ración'!$K$4))","v":""},{"$f":"IF('II_Plantear Ración'!D24=0,\"\",'II_Plantear Ración'!G24*B25)","v":""},null,"Vit A",{"$f":"'II_Plantear Ración'!L41","v":4411.8141620192246},"UI",{"$f":"'II_Plantear Ración'!M41","v":"Vit A"}]
[{"$f":"IF(B26=\"\",\"\",CálculosEV!B24)","v":""},{"$f":"IF('II_Plantear Ración'!D25=0,\"\",'II_Plantear Ración'!D25)","v":""},{"$f":"IF('II_Plantear Ración'!D25=0,\"\",'II_Plantear Ración'!F25)","v":""},{"$f":"IF('II_Plantear Ración'!D25=0,\"\",('II_Plantear Ración'!D25*1000)/('II_Plantear Ración'!$K$4))","v":""},{"$f":"IF('II_Plantear Ración'!D25=0,\"\",'II_Plantear Ración'!G25*B26)","v":""},null,"Vit D",{"$f":"'II_Plantear Ración'!L42","v":98.668924926938757},"UI",{"$f":"'II_Plantear Ración'!M42","v":"Vit D"}]
[{"$f":"IF(B27=\"\",\"\",CálculosEV!B25)","v":""},{"$f":"IF('II_Plantear Ración'!D26=0,\"\",'II_Plantear Ración'!D26)","v":""},{"$f":"IF('II_Plantear Ración'!D26=0,\"\",'II_Plantear Ración'!F26)","v":""},{"$f":"IF('II_Plantear Ración'!D26=0,\"\",('II_Plantear Ración'!D26*1000)/('II_Plantear Ración'!$K$4))","v":""},{"$f":"IF('II_Plantear Ración'!D26=0,\"\",'II_Plantear Ración'!G26*B27)","v":""},null,"Vit E",{"$f":"'II_Plantear Ración'!L43","v":16.458845977016328},"UI",{"$f":"'II_Plantear Ración'!M43","v":""}]
["TOTAL",{"$f":"SUM(B5:B27)","v":9.7688835970445673},{"$f":"SUM(C5:C27)","v":100.00000000000001},{"$f":"SUM(D5:D27)","v":1000.0000000000002},{"$f":"'II_Plantear Ración'!K16","v":0.94728876797685879},null,"AG",{"$f":"'II_Plantear Ración'!L44","v":48.383897702235444},"g/kg MS",{"$f":"'II_Plantear Ración'!M44","v":""}]
[null,null,null,null,null,null,"MNT_PB",{"$f":"'II_Plantear Ración'!L45","v":126.53971960692698},"g/kg MS",{"$f":"'II_Plantear Ración'!M45","v":""}]
[null,"F %",{"$f":"'II_Plantear Ración'!K11","v":49.334462461838612},"% grasa s/MS",{"$f":"'II_Plantear Ración'!L49","v":5.2593938268683802},null,"PDIA",{"$f":"'II_Plantear Ración'!L46","v":26.278661513116532},"g/kg MS",{"$f":"'II_Plantear Ración'!M46","v":""}]
[null,"C %",{"$f":"'II_Plantear Ración'!K12*100","v":50.665537538161388},null,null,null,"dMO",{"$f":"'II_Plantear Ración'!L47","v":0.71077196651686936},null,{"$f":"'II_Plantear Ración'!M47","v":""}]
[null,null,null,null,null,null,"MOD",{"$f":"'II_Plantear Ración'!L48","v":677.07260782463254},"g/kg MS",{"$f":"'II_Plantear Ración'!M48","v":""}]
[null,null,null,null,null,null,"EE",{"$f":"'II_Plantear Ración'!L49","v":5.2593938268683802},"%",{"$f":"'II_Plantear Ración'!M49","v":""}]
[null,null,null,null,null,null,"FB",{"$f":"'II_Plantear Ración'!L50","v":180.32846725263167},"g/kg MS",{"$f":"'II_Plantear Ración'!M50","v":""}]
[null,null,null,null,null,null,"NDF",{"$f":"'II_Plantear Ración'!L51","v":386.70308173299645},"g/kg MS",{"$f":"'II_Plantear Ración'!M51","v":""}]
[null,null,null,null,null,null,"ADF",{"$f":"'II_Plantear Ración'!L52","v":222.27214693568777},"g/kg MS",{"$f":"'II_Plantear Ración'!M52","v":""}]
[null,null,null,null,null,null,"Lignina",{"$f":"'II_Plantear Ración'!L53","v":5.4458669469861878},"g/kg MS",{"$f":"'II_Plantear Ración'!M53","v":"Lignina"}]
[null,null,null,null,null,null,"Cenizas",{"$f":"'II_Plantear Ración'!L54","v":66.713988932414566},"g/kg MS",{"$f":"'II_Plantear Ración'!M54","v":""}]
[null,null,null,null,null,null,"Mo",{"$f":"'II_Plantear Ración'!L55","v":0.23431661755677363},"mg/kg MS",{"$f":"'II_Plantear Ración'!M55","v":"Mo"}]
[null,null,null,null,null,null,"DT_N",{"$f":"'II_Plantear Ración'!L56","v":0.7273123975983814},null,{"$f":"'II_Plantear Ración'!M56","v":"DT_N"}]
[null,null,null,null,null,null,"MOF",{"$f":"'II_Plantear Ración'!L57","v":550.8569544750992},"g/kg MS",{"$f":"'II_Plantear Ración'!M57","v":"MOF"}]
[null,null,null,null,null,null,"MO",{"$f":"'II_Plantear Ración'!L58","v":899.30913565933599},"g/kg MS",{"$f":"'II_Plantear Ración'!M58","v":""}]
[null,null,null,null,null,null,"PDI/UFL",{"$f":"'II_Plantear Ración'!L59","v":67.070359994392774},"g",{"$f":"'II_Plantear Ración'!M58","v":""}]
[]
[]
[]
[]
[]
[]
[]
[]
[]
[]
[]
[]
[]
[]
[]
[{"$f":"IF(B59=\"\",\"\",CálculosEV!B26)","v":""},{"$f":"IF('II_Plantear Ración'!D27=0,\"\",'II_Plantear Ración'!D27)","v":""}]