{"text_format":"1","workbook":"xlsx","n_sheets":10,"sheets":["Paràmetres","Taula Farratges","Taula Concentrats","Taula Minerals-aa","CàlculsEV","Apunts Cria","NR","I_Necessitats","II_Plantejar Ració","III_Resultat Ració"],"not_rendered":{"charts":0,"images":7,"macros":1,"external_links":0,"defined_names":283,"comments":0,"pivot_tables":0},"unopened":[],"bounds":{"document_bytes":16777216,"sheet_cells":100000,"rows_first":2000,"rows_last":500,"rows_between":2000,"halvings":0,"cell_chars":16384,"cell_head_chars":4096},"cells_cut":0,"cells_raw":0,"read":"whole","date_system":"1900"}

{"sheet":"Paràmetres","index":0,"n_rows":42,"n_cols":3,"rows_kept":42,"cut":false,"hidden":true,"merged":[]}
["COMPONENTS","POSICIÓ","PARÀMETRES DE CÀLCUL"]
[{"$f":"'Taula Farratges'!B$1","v":"MS"},1,2]
[{"$f":"'Taula Farratges'!C$1","v":"UFL"},{"$f":"1+B2","v":2},1]
[{"$f":"'Taula Farratges'!D$1","v":"UFV"},3,1]
[{"$f":"'Taula Farratges'!E1","v":"MNT_PB"},4,1]
[{"$f":"'Taula Farratges'!F1","v":"PDIA"},5,1]
[{"$f":"'Taula Farratges'!G1","v":"PDI"},6,1]
[{"$f":"'Taula Farratges'!H1","v":"BPR"},7,1]
[{"$f":"'Taula Farratges'!I1","v":"UEL"},8,1]
[{"$f":"'Taula Farratges'!J1","v":"UEB"},9,1]
[{"$f":"'Taula Farratges'!K1","v":"UEM"},10,1]
[{"$f":"'Taula Farratges'!L1","v":"NI ref"},11,1]
[{"$f":"'Taula Farratges'!M1","v":"dMO"},12,1]
[{"$f":"'Taula Farratges'!N1","v":"MOD_TDN"},13,1]
[{"$f":"'Taula Farratges'!O1","v":"EE"},14,1]
[{"$f":"'Taula Farratges'!P1","v":"FB"},15,1]
[{"$f":"'Taula Farratges'!Q1","v":"NDF"},16,1]
[{"$f":"'Taula Farratges'!R1","v":"ADF"},17,1]
[{"$f":"'Taula Farratges'!S1","v":"Lignina"},18,1]
[{"$f":"'Taula Farratges'!T1","v":"cendres"},19,1]
[{"$f":"'Taula Farratges'!U1","v":"Ca"},20,1]
[{"$f":"'Taula Farratges'!V1","v":"P"},21,1]
[{"$f":"'Taula Farratges'!W1","v":"Mg"},22,1]
[{"$f":"'Taula Farratges'!X1","v":"Cl"},23,1]
[{"$f":"'Taula Farratges'!Y1","v":"K"},24,1]
[{"$f":"'Taula Farratges'!Z1","v":"Na"},25,1]
[{"$f":"'Taula Farratges'!AA1","v":"S"},26,1]
[{"$f":"'Taula Farratges'!AB1","v":"Co"},27,1]
[{"$f":"'Taula Farratges'!AC1","v":"Cu"},28,1]
[{"$f":"'Taula Farratges'!AD1","v":"Mo"},29,1]
[{"$f":"'Taula Farratges'!AE1","v":"Iode"},30,1]
[{"$f":"'Taula Farratges'!AF1","v":"Fe"},31,1]
[{"$f":"'Taula Farratges'!AG1","v":"Mn"},32,1]
[{"$f":"'Taula Farratges'!AH1","v":"Se"},33,1]
[{"$f":"'Taula Farratges'!AI1","v":"Zn"},34,1]
[{"$f":"'Taula Farratges'!AJ1","v":"Vit A"},35,1]
[{"$f":"'Taula Farratges'!AK1","v":"Vit D"},36,1]
[{"$f":"'Taula Farratges'!AL1","v":"Vit E"},37,1]
[{"$f":"'Taula Farratges'!AM1","v":"AG"},38,1]
[{"$f":"'Taula Farratges'!AN1","v":"DT_N"},39,1]
[{"$f":"'Taula Farratges'!AO1","v":"dr"},40,1]
[{"$f":"'Taula Farratges'!AP1","v":"MOF"},41,1]

{"sheet":"Taula Farratges","index":1,"n_rows":198,"n_cols":42,"rows_kept":198,"cut":false,"hidden":false,"merged":[]}
["Concentrats","MS","UFL","UFV","MNT_PB","PDIA","PDI","BPR","UEL","UEB","UEM","NI ref","dMO","MOD_TDN","EE","FB","NDF","ADF","Lignina","cendres","Ca","P","Mg","Cl","K","Na","S","Co","Cu","Mo","Iode","Fe","Mn","Se","Zn","Vit A","Vit D","Vit E","AG","DT_N","dr","MOF"]
[]
["Ordi gra",88.8,1.0789699893040996,1.0677525561217629,112,27.595082457151996,89.462201893951999,-31.347374120000008,0.2046,null,null,2,0.83732799999999996,816.39479999999992,19,54,215,65,12,25,0.44000000000000006,2.964,1.3,null,5.55,0.35,null,0.01,4.0999999999999996,0.3,null,90,17.600000000000001,0.02,24.4,1000,null,25,14.25,0.73492599485689536,0.92949387723999977,596.08337706731925]
["Blat de moro gra",86,1.2447554097468898,1.26,89,43,94,-53,0.3291,null,null,2,0.88284600000000013,870.48615600000005,43,26,125,31,60,14,0.27500000000000002,2.1749999999999998,1.4,null,3.6,0.33,null,0.02,2.2999999999999998,0.3,null,80,10.8,0.02,21.4,null,null,null,36.549999999999997,0.44657089748905021,0.87300444668280008,780.90364228385977]
["Blat gra",87,1.1915137972087206,1.2050625767281833,157,33.001449423599993,96.505827343600004,5.8944094999999983,0.1714,null,null,2,0.87875000000000003,861.17500000000007,23,29,146,38,12,20,0.27500000000000002,2.8079999999999998,null,null,null,null,null,0.02,4.4000000000000004,0.3,null,null,33.700000000000003,0.04,32.5,null,null,12,17.25,0.77712043387736873,0.94311164749999987,740.17749341536637]
["Civada",87.4,1.002754803542979,0.95481461893995845,111,20.397543993710997,75.333047872111024,-14.566724810000022,0.32080000000000003,null,null,2,0.72867000000000004,706.80990000000008,67,135,336,162,27,30,0.55000000000000004,3,1.75,null,4.3,0.5,null,0.02,3.5,0.7,null,null,38.4,0.04,25.2,null,null,15,60.300000000000004,0.79800315384488929,0.90972537986999991,747.51705647171229]
["Fajol gra",88,1.0007757853016814,0.96615921016994921,125,34.099887237024994,90.969890410784984,-20.559379958999994,0.21290000000000009,null,null,2,0.74392999999999987,726.8196099999999,28,118,301,158.9,33.4,23,0.60500000000000009,2.7750000000000004,1.2,0.5,5.0999999999999996,0.6,1.6,0.06,11,null,null,50,38,null,10,null,null,null,21,0.69938671959743504,0.90747520379299995,668.26674668380406]
["Mill gra",88,1.009546490666007,0.97767630563404173,131,35.907645941378647,91.778122786690659,-15.037620070799999,0.21290000000000009,null,null,2,0.75275400000000003,721.13833199999999,42,106,284.5,143.85999999999999,29.700000000000003,42,0.22000000000000003,2.4000000000000004,1.7,0.34,4.66,0.45,null,null,null,null,null,null,null,null,null,null,null,null,37.800000000000004,0.69974811478529253,0.91291405979160001,460.62199712073908]
["Segol gra",86.5,1.19,1.21,97,20,81,-34.72904868000002,0.21290000000000009,null,null,2,0.88214000000000015,864.49720000000013,16.200000000000003,26,132,42,14,20,0.38500000000000001,3,1.35,null,5.25,0.3,null,0.03,4.5,0.2,null,null,55,0.03,30,null,null,17,12.150000000000002,0.77696513771484987,0.92445443235999991,415.48628942197058]
["Sorgo gra",86,1.21,1.23,105,47,97.130963149263465,-48,0.21290000000000009,null,null,2,0.88468600000000008,869.64633800000001,37,25,107,49,4,17,0.16500000000000001,2.4000000000000004,1.75,null,3.6,0.4,null,null,10,null,null,160,14,null,14,14000,null,12,33.300000000000004,0.52263422916095392,0.93768568037939981,581.76287563553399]
["Triticale gra",87.1,1.1917933324586927,1.2103621408310392,130,38.225488002259986,101.29653785185999,-26.948515390000008,0.21290000000000009,null,null,2,0.87145000000000006,852.27809999999999,17,33,148,40,13,22,0.27500000000000002,3.4499999999999997,null,null,null,null,null,null,null,null,null,null,null,null,null,null,null,null,12.75,0.68538622981633202,0.93461330452999991,618.06043466382971]
["Blat segó blat dur",87.7,1.0176943686522057,0.977907847095282,167,34.631141078796077,88.47767852596408,25.244785238800009,0.30577720000000003,null,null,2,0.73153799999999991,692.03494799999987,58,118,481,148,38,54,0.93500000000000005,7.8000000000000007,null,null,null,null,null,null,10,null,null,200,90,null,80,1000,null,21,46.400000000000006,0.77274508423544552,0.91250876387239999,677.34170324293109]
["Blat de moro flocs",89,1.2854594416716449,1.3156335468620108,100,41.498506498559998,103.94646933760002,-59.774941936000019,0.231567,null,null,2,0.88266,868.53744000000006,43,26,90,30,10,16,0.16500000000000001,2.1749999999999998,1.4,0.5,3.7,0.3,1.2,0.05,4,null,null,30,5,0.08,14,1000,null,25,36.549999999999997,0.55366202283859689,0.92975522187199999,841.62366180892877]
["Blat de moro bagàs",88.1,1.2034638734603806,1.2055011502513313,151,56.283786721918673,116.77481847795069,-22.647237118800017,0.28759999999999997,null,null,2,0.85009200000000007,833.94025199999999,34,68,272,78,11,19,0.5,3.7,1.8,null,3.5,9.5,null,null,null,null,null,null,null,null,null,null,null,null,25.5,0.60422014182361838,0.94178695988759986,567.57273372494842]
["Blat de moro hominyfeed (mescla segó, germèn i midó)",90,1.1533551355658935,1.1579668052179757,114,46.524159785375986,107.37452349097599,-49.998693289999991,0.25357849999999998,null,null,2,0.83747599999999989,816.53909999999985,19,54,215,65,12,25,0.27500000000000002,4.2750000000000004,2.6,0.6,6.5,0.9,0.3,0.06,15,null,null,75,16,0.11,3,null,null,null,16.149999999999999,0.56121014448870521,0.93007315382999989,380.32730660831726]
["Blat de moro gluten feed",87.7,1.0563074392437739,1.0298938534891089,216,53.864651595352321,111.00304612616833,49.881258545599977,0.3125,null,null,2,0.82507200000000003,769.79217599999993,45,88,343,100,13,67,1.6500000000000001,5.3040000000000003,3.5,null,10.25,7,null,null,null,null,null,null,null,null,null,3000,null,14,40.5,0.73830819761020405,0.9529277751088,400.00631345146428]
["Blat de moro gluten meal",89.3,1.6477477819813739,1.7039593019383183,661,427.85021155354741,474.69275818906743,117.51852088199998,0.48679999999999995,null,null,2,0.94365200000000005,929.49722000000008,35,21,107,28,6,15,0.11000000000000001,2.72,null,null,null,null,null,null,null,null,null,null,null,null,null,14000,null,26,28,0.34360783225527836,0.98611349298600004,749.4135604827793]
["Blat de moro espigots ",90,0.52319139706798212,0.41152989548810526,44,14.398539143577599,59.977382422937616,-62.536942624000005,0.46929120000000002,null,null,2,0.45527600000000007,437.0649600000001,5,302,822,408,38,40,0.66,0.52499999999999991,null,null,null,null,null,null,null,null,null,null,null,null,null,null,null,null,2,0.62321203231751077,0.86849781324800002,521.78626923253478]
["Blat de moro segó",88.3,1.1129736772157073,1.1007866196572278,101,43.238359333239842,96.344289691511847,-50.718016184800007,0.37059999999999998,null,null,2,0.70725199999999999,669.06039199999998,40,150,557,164,19,54,0.16500000000000001,1.875,null,null,null,null,null,null,null,null,null,null,null,null,null,null,null,null,34,0.53170775876766296,0.91417822026959994,556.40507382107603]
["Blat de moro tortó de gèrmens a pressió",88.1,1.1789597500931865,1.171602179305957,146,59.101547199313913,113.88478174088193,-23.878803971200011,0.2642698,null,null,2,0.80152400000000001,763.05084800000009,82,72,285,82,11,48,0.33,3.5250000000000004,4.5,null,1.8,8.5,null,null,null,null,null,null,null,null,null,null,null,null,65.600000000000009,0.56855881276595621,0.9382625715424,625.96116811755815]
["Blat de moro tortó de gèrmens amb dissolvent",87.9,1.0419900226719216,1.0235383932445659,135,54.171907268543997,111.696577773504,-33.882297663999992,0.26867210000000002,null,null,2,0.79027999999999987,752.34655999999984,17,79,310,89,12,48,0.49500000000000005,3.75,4.5,null,1.8,8.5,null,null,null,null,null,null,null,null,null,1000,null,94,12.75,0.57033439439208355,0.93392019732799991,543.53611917872161]
["Blat de moro extrussionat",90.3,1.2659242795142109,1.3059451410330718,96.35,55.422778448670854,120.6512296608667,-82.396955019056023,0.21464959,null,null,2,0.91813040000000012,904.90932224000017,4.32,2.5499999999999998,12.18,3.1,0.55000000000000004,14.399999999999999,0.16500000000000001,2.1749999999999998,1.4,0.5,3.7,0.3,1.2,0.05,4,null,null,30,5,0.08,14,1000,null,25,3.6720000000000002,0.3880056000926686,0.93991618246111197,296.37371505240276]
["Fajol segones",89,1.1855213154544,1.1685861892728744,335,98.398382182629987,150.65027895702997,125.25641129000003,0.21290000000000009,null,null,2,0.79561999999999999,751.8608999999999,82,83,251.39,114.99000000000001,22.61,55,0.27500000000000002,2.9249999999999998,null,null,null,null,null,null,null,null,null,null,null,null,null,null,null,null,65.600000000000009,0.69466219022372699,0.96197229616999991,273.37371505240276]
["Ordi bagàs cerveseria fresc",20.5,0.86409217991914111,0.77037029419231517,300,129.948715875,172.97965507500001,53.564157499999993,0.49509999999999998,null,null,2,0.63849999999999996,606.57500000000005,86,150,525,206,47,50,1.8149999999999999,4.4460000000000006,1.6,null,0.7,1.6,null,0.08,22.2,0.5,null,null,38.5,0.06,85,null,null,29,38.700000000000003,0.5325076886943908,0.9265657974999999,565.20525205850993]
["Ordi bagàs cerveseria sec",91.9,0.87119356499561229,0.78054262949459352,262.39999999999998,107.61563282559231,151.63839868082431,35.094428351199994,0.49509999999999998,null,null,2,0.62731999999999999,601.34895199999994,79.900000000000006,161.6,643.29999999999995,236.4,78.899999999999991,41.4,1.2649999999999999,4.9139999999999997,null,null,null,null,null,0.08,22.2,0.5,null,null,38.5,0.06,85,null,null,29,35.955000000000005,0.53718506650710496,0.88614373099759991,529.6572153518573]
["Ordi malta, gra germinat i eixugat",89.6,0.82318564868563615,0.75819659606944634,255,66.3550213595625,127.25276543956251,71.697274874999977,0.29589999999999994,null,null,2,0.89924999999999988,840.79874999999993,23,10,94,10,6,65,1.4850000000000003,5.625,null,null,null,null,null,null,null,null,null,null,null,null,null,null,null,16,10.35,0.73182278620697816,0.97031275087500002,363.39002791261066]
["Ordi segó",89,0.76049500367747369,0.68300071501306703,118,25.132764616152489,75.567175445336488,-8.0437669206000031,0.36300710000000003,null,null,2,0.62060199999999999,581.50407399999995,32,187,539,239,28,63,0.44000000000000006,2.9249999999999998,null,null,null,null,null,0.03,11.7,0.6,null,null,123,0.05,59,null,null,null,25.6,0.76510334942826175,0.90673719751619997,563.51936347377296]
["Cacau tortó",86.6,0.92152562915630509,0.87946946177744068,232,88.670879085753597,140.27091297407361,25.814947049499995,0.34659280999999997,null,null,2,0.74546499999999993,673.15489500000001,20,161,363.86,212.89999999999998,47.29,97,1.4300000000000002,0.88400000000000012,null,null,null,null,null,null,null,null,null,null,null,null,null,null,null,null,15,0.58297490871153479,0.91649656821350012,268.23245904637008]
["Cacauet, tortó 48",88.6,1.1944335830241395,1.1865160385387328,524,143.30222231441923,198.10149398417923,261.73613801599998,0.28759999999999997,null,null,2,0.84376000000000007,789.75936000000002,16,77,150,101,26,64,0.9900000000000001,4.29,3,null,null,null,null,0.3,14.5,1.7,null,450,47.5,0.11,61.5,null,null,null,12,0.71794238190373694,0.96958034796799997,807.19479236353993]
["Coco tortó",90,0.97095956734287703,0.93399951412527582,239,87.269035447756792,138.20984342983681,30.484987527999994,0.28759999999999997,null,null,2,0.7160399999999999,660.18887999999993,18,178,580,316,78,78,1.1000000000000001,4.4880000000000004,4,null,null,0.6,null,null,20,null,null,500,60,null,70,null,null,null,16.2,0.58722694217038374,0.88460814194399984,201.61933674532895]
["Colza, gra",89.9,1.9687535898800934,2.0261645054875959,217,41.884822356221591,81.980608908541598,90.240333511999992,0.29589999999999994,null,null,2,0.84608000000000005,798.69952000000012,457,68,199,116,41,56,1.8149999999999999,3.7629999999999999,null,null,null,null,null,null,null,null,null,null,null,null,null,null,null,null,388.45,0.79112532282213199,0.92408336497600008,581.94544679049329]
["Colza, gra semiesclovellat",90,2.0068243854673327,2.0660563857148828,217,41.884822356221591,80.92224090854161,91.894033511999979,0.29589999999999994,null,null,2,0.84608000000000005,798.69952000000012,480,68,115,84,41,56,1.8149999999999999,3.7629999999999999,null,null,null,null,null,null,null,null,null,null,null,null,null,null,null,null,379.20000000000005,0.79112532282213199,0.92408336497600008,817.11138658398465]
["Colza, turtó ",90,0.95800502495921236,0.90985936028426784,418,103.91199090373202,155.86270835653204,193.04700397999994,0.3125,null,null,2,0.78420000000000001,704.99580000000014,26,120,287,182,74,101,4.620000000000001,8.8040000000000003,5.15,null,12.4,0.75,null,0.1,5.5,0.5,null,300,63.5,7.0000000000000007E-2,64.5,null,null,20,20.8,0.72777380875241571,0.91318648854000006,325.12141598538869]
["Colza, turtó  tanné, curtit",89,1.2403090812927602,1.2532844857689245,391,143.42495357934857,193.47316113966858,118.739675687,0.33739999999999998,null,null,2,0.77349000000000001,713.93126999999993,26,129,302,193,79,77,4.620000000000001,8.8040000000000003,null,null,12.4,0.75,null,0.1,5.5,0.5,null,300,63.5,7.0000000000000007E-2,64.5,null,null,null,17.939999999999998,0.59520702136024917,0.90618107875099996,550.04680574196072]
["Cotó, gra",92,1.1057454642423121,1.0271553531490456,220,48.764449067224007,91.654792821464014,70.583837883999976,0.50340000000000007,null,null,2,0.64651999999999998,618.71964000000003,198,276,456,354,105,43,1.1550000000000002,4.7359999999999998,null,null,null,null,null,null,null,null,null,null,null,null,null,null,null,null,188.1,0.73941085414823005,0.85059792473200002,581.85751744287006]
["Cotó tortó dessoliat",89,1.1501920277402691,1.1259438132783857,466,160.92210943249918,212.64457169579521,184.58365271359997,0.29948819999999998,null,null,2,0.80219600000000002,750.855456,20,127,232,138,32,64,2.5850000000000004,5.9220000000000006,5.2,null,15.2,0.4,null,null,null,null,null,null,null,null,null,null,null,null,15,0.64090967269049992,0.96167005577279996,814.20652128989173]
["Cotó clovella",91,0.36620814217767916,0.23807886329057015,81,16.103086591867196,54.653602301563204,-25.8351807964,0.65129486000000003,null,null,2,0.32318199999999997,309.60835599999996,19,547,900,697.4,184.60000000000002,42,0.77,0.69300000000000006,null,null,null,null,null,null,null,null,null,null,null,null,null,null,null,null,14.25,0.72375435859716208,0.71966217154279999,816.25711636308222]
["Favó gra",86.9,1.2866071181997207,1.3209577887210684,302,51.430279740777983,115.06988487997799,130.98311697000003,0.1714,null,null,2,0.91429999999999989,876.81370000000004,16,90,171,108,24.700000000000003,41,0.71500000000000008,3.2640000000000002,1.6,0.8,12,0.25,null,0.4,13.8,1,null,100,12.7,0.02,43.7,null,null,null,12.8,0.82245394822364193,0.95918178880999994,509.23085716585433]
["Gira-sol, gra",93,1.7084711843203275,1.695156001331616,174,24.647498694691201,60.4191065078112,72.586862791999977,0.26269999999999993,null,null,2,0.74312,714.13832000000002,485,164,294,200,56,39,0.9900000000000001,3.12,null,null,null,null,null,null,null,null,null,null,null,null,null,null,null,null,460.75,0.84184492382372955,0.89565440941600005,566.2107452482353]
["Gira-sol tortó esclovellat",91,0.99107641893319698,0.94397086945962927,417,80.253815077377354,133.12343795232135,220.11121425790003,0.32080000000000003,null,null,2,0.74591699999999994,691.46505899999988,22,176,299,220,70,73,2.09,6.4350000000000005,5.5,1.2,12,0.33,null,null,null,null,null,null,null,null,null,null,null,null,16.5,0.79012083402996014,0.91698092634670014,601.94944148864533]
["Llentia gra",88,1.2927425717054508,1.3306553425464995,281,49.081812964852382,113.1999670179724,113.22538429199999,0.1714,null,null,2,0.91962999999999995,886.52332000000001,19.3,49,160,72,3,36,0.60500000000000009,3.06,null,null,null,null,null,null,null,null,null,null,null,null,null,null,null,null,14.475000000000001,0.82166571738072802,0.97944360991599988,617.48009359721186]
["Llí, gra",90.3,1.6575837469429318,1.6606714982698805,253,51.011948668166198,92.319144300857403,111.00750682392,0.32080000000000003,null,null,2,0.78051800000000005,743.36534319999998,362,101.89999999999999,244.7,148.4,62,47.599999999999994,2.3145071982281284,4.5260243632336659,3.9867109634551494,0.66445182724252494,7.9734219269102988,0.77519379844961245,2.9900332225913622,null,13.289036544850498,0.22148394241417499,null,163.89811738648947,32.115171650055373,null,49.833887043189371,null,null,null,343.9,0.77769198729402633,0.90697700524215985,614.34637074519037]
["Llinosa tortó dessoliat",89,1.1518710540767036,1.1341411667893986,377,129.46711168154192,180.63225981184593,120.74445604639997,0.30640610000000001,null,null,2,0.80390399999999995,752.45414399999981,58,118,236,149,88,64,2.5850000000000004,6.2980000000000009,6.1,null,14,1.3,null,0.6,21,0.6,null,250,59,0.5,73,null,null,9,43.5,0.61695666244551961,0.89654108470719995,595.35825663975595]
["Margalló tortó (palmiste)",90,0.83194750357129577,0.76329964928928062,206,83.768055090368009,136.52083694508801,-3.9262216479999914,0.42869999999999997,null,null,2,0.73055999999999999,699.14591999999993,19,167,632,241,103,43,1.7050000000000003,4.556,null,null,null,null,null,null,null,null,null,null,null,null,null,null,null,null,17.100000000000001,0.52287183224694234,0.85226794729599997,614.34637074519037]
["Mongeta gra",88,1.2694175668129566,1.3060081028573072,257,44.572029681858787,108.56384220537879,93.98279293200001,0.1714,null,null,2,0.91937000000000002,878.91772000000003,19,51,162,74,3,44,0.71500000000000008,3.468,1.6,null,14,0.4,null,null,null,null,null,null,null,null,null,null,null,null,15.200000000000001,0.82213541357934528,0.97507899463600001,689.67844245679078]
["Pèsol gra",85.7,1.2625786176584095,1.2977899538253017,259,44.911731932978391,108.99577708625841,95.458679448000012,0.1714,null,null,2,0.91768000000000005,877.30208000000005,15,64,162,74,3,44,0.49500000000000005,3.1280000000000001,1.45,null,11,0.3,null,7.0000000000000007E-2,7.2,1.1000000000000001,null,null,8,0.2,37,null,null,null,12,0.82222021761807795,0.97538858510400006,696.39586966079742]
["Soja, gra extrussionat",88,1.4854856019534888,1.4973907223657086,402,188.43235510953002,238.04062854249003,109.28707276099998,0.32080000000000003,null,null,2,0.97179000000000004,912.51081000000011,213,74,146,92,7,61,1.54,4.4799999999999995,null,null,null,null,null,null,null,null,null,null,null,null,null,null,null,null,202.35,0.52666678399466216,0.99029010835300013,704.00180849999981]
["Soja, gra torrat",88.6,1.4901857276896577,1.5024458709028436,397.29999999999995,133.30789500662681,185.68918291519,158.22623764286999,0.29589999999999994,null,null,2,0.97577899999999995,918.50077269999986,216.70000000000002,63.2,132,77.78,13.5,58.7,1.9864559819413097,4.187358916478555,2.5959367945823928,0.56433408577878108,20.767494356659142,0.90293453724604977,3.1602708803611739,null,38.37471783295711,4.5146726862302486,null,161.39954853273139,31.602708803611741,0.31602708803611745,45.146726862302486,null,null,null,205.86500000000001,0.65872130014657793,0.98316887688550991,771.75107974145862]
["Soja tortó 44",87.2,1.1656258626018918,1.1597938319839582,488,153.41999795655397,207.06952650471396,219.17261164349998,0.27810560000000001,null,null,2,0.84965499999999994,779.13363500000003,22,84,163,104,8,83,1.87,4.8999999999999995,2.7,null,20,1.95,null,0.3,17.100000000000001,2.2999999999999998,null,200,43.7,0.2,54.6,null,null,7,16.5,0.68199960346033861,0.9886316027755,737.90755524119731]
["Soja tortó 46",87.2,1.2042399719188401,1.2053336060239686,505,160.06920989040626,214.45587978640626,229.07082828750001,0.26867210000000002,null,null,2,0.86389499999999997,799.10287499999993,20,72,143,89,7,75,1.87,5.18,2.7,null,20,1.95,null,0.3,17.100000000000001,2.2999999999999998,null,200,43.7,0.2,54.6,null,null,null,15,0.6799548883113109,0.99038766998750005,751.54208570371975]
["Soja tortó 48",88.3,1.2238106736886152,1.2268716598377332,520,165.08161824536202,219.31515756907405,239.06009480669999,0.26741429999999999,null,null,2,0.86734100000000003,804.02510700000005,23,70,140,87,7,73,1.87,5.46,2.7,null,19.7,1.95,null,0.3,17.100000000000001,2.2999999999999998,null,200,43.7,0.2,54.6,null,null,null,17.25,0.67946396874075055,0.99041798584910001,186.25282507445968]
["Soja tortó 50",87.8,1.225744301238733,1.2255650042406774,544,172.40454338212001,225.71545583172002,256.10169929750003,0.2498051,null,null,2,0.86202699999999988,797.37497499999995,28,77,102,59,6,75,1.6500000000000001,5.46,2.7,null,19.7,1.95,null,0.3,17.100000000000001,2.2999999999999998,null,200,43.7,0.2,54.6,null,null,null,21,0.68011632654366916,0.99073551671750015,299.4175208535824]
["Soja tortó 48 curtit \"tanne\"",88.8,1.2238106736886152,1.2268716598377332,520,165.08161824536202,219.31515756907405,239.06009480669999,0.26741429999999999,null,null,2,0.86734100000000003,804.02510700000005,23,70,140,87,7,73,1.87,5.46,null,null,null,null,null,0.3,17.100000000000001,2.2999999999999998,null,200,43.7,0.2,54.6,null,null,null,15.180000000000001,0.67946396874075055,0.99041798584910001,152.52751727330252]
["Llobí (tramús) gra",86.7,1.4985748501920342,1.5443460916061895,399,69.098815818280471,127.26703342788048,218.10215998500001,0.1714,null,null,2,0.90506999999999993,864.34185000000002,104,161,229,172,17,45,1.1000000000000001,3.1280000000000001,2.5,null,9.5,0.55000000000000004,null,null,null,null,null,null,null,null,null,null,null,null,93.600000000000009,0.82289872796188157,0.97785852990499988,864.52724698655015]
["Llobí (tramús) extrussionat",88,1.5275128795369315,1.5781926650923088,406,69.232090685749569,127.71452533022958,223.28119586800003,0.1714,null,null,2,0.91027000000000002,877.50027999999998,109,121,214,175,34.4,36,1.1000000000000001,3.06,1.7,0.23,10,0.11,null,null,null,null,null,null,null,null,null,null,null,null,83.93,0.82240293019900856,0.96016443876399993,769.79358280934184]
["Polpes (cítrics) ensitjades",21,1.2247648530455373,1.2387634090832353,73,20.576516455389989,79.537256128989995,-58.876155740000002,0.22120000000000006,null,null,2,0.87227999999999994,824.30459999999994,97,156,356.65,206.62,44.65,55,11.22,1.35,1.6,null,6.2,0.9,0.2,0.16,6,null,null,160,7,null,16,null,null,null,58.199999999999996,0.68078367808218965,0.88300650397999969,785.49351337460575]
["Polpes (cítrics)",90,1.0945776496498119,1.1035515879610236,70,20.494530967225,82.579768544825001,-65.708183715000004,0.22120000000000006,null,null,2,0.87930999999999993,822.1548499999999,28,137,223,158,14,65,4.6000000000000005,1.1700000000000002,null,null,null,null,null,null,null,null,null,null,null,null,null,null,null,null,16.8,0.6799461391636954,0.91478044680499992,367.90991842891236]
["Garrofer garrofa",87,0.84349490499888424,0.82739527562045634,58,20.578036751799999,81.081596271800024,-76.256811750000026,0.28817428899999997,null,null,2,0.801456386292835,771.80250000000012,11,87,257.16000000000003,120.00999999999999,23.83,37,0.82500000000000007,0.40800000000000003,null,null,null,null,null,null,null,null,null,null,null,null,null,null,null,null,9.9,0.60525957312408907,0.89880263824999995,645.90878741880897]
["Garrofer polpa deshidratada sense grana, IAMZ",86,0.81755713356327342,0.80100990873229949,56,19.887404593055997,81.023260765855994,-78.364775269999996,0.286199543,null,null,2,0.80349252336448596,773.76329999999996,0.1,84.5,253.55,116.86999999999999,23.07,37,0.82500000000000007,0.40800000000000003,null,null,null,null,null,null,null,null,null,null,null,null,null,null,null,null,8.0000000000000016E-2,0.60497831613785447,0.89901957128999999,332.89631139577602]
["Oliva molinada \"orujo\"",89,0.3555684594003049,0.23152849593807051,111,37.773671789926794,72.196085881446805,-21.365022018000008,0.58639999999999992,null,null,2,0.33429000000000003,306.87822,74,339,620.51,456.32,108.36,82,7.7000000000000011,2.3120000000000003,null,null,null,null,null,null,null,null,null,null,null,null,null,null,null,null,54.76,0.57995139706720433,0.81015231828599998,255.97633316094925]
["Oliva polpa sense extracció, IAMZ ",68.5,0.52852566084554287,0.41188219318965796,114,44.703288467039997,84.482230931040007,-28.474597600000006,0.58639999999999992,null,null,2,0.45799999999999996,425.02399999999994,74,200,341,295,60.21,72,6.5450000000000008,1.0880000000000001,null,null,null,null,null,null,null,null,null,null,null,null,null,null,null,null,54.76,0.54731158643493383,0.86623403119999987,172.26091942057013]
["Oliva polpa d'extracció (\"orujo\"), IAMZ",87.6,0.28358208219027031,0.16307856023765305,66,20.210481566827202,53.349659430507202,-38.259965412,0.58639999999999992,null,null,2,0.26932,252.89148,74,412,725.77,527.95000000000005,134.64000000000001,61,3.08,0.6120000000000001,null,null,null,null,null,null,null,null,null,null,null,null,null,null,null,null,54.76,0.60054601929246265,0.766594983324,731.01164568458989]
["Patata-ITEB",13,1.2240398770980918,1.2703481114883948,100,34.239489082499993,100.58316924249999,-56.862000250000008,0.12159999999999993,null,null,2,0.94450000000000001,901.99749999999995,0.8,30,174.97,48.46,7.2799999999999994,45,0.55000000000000004,1.36,1,22,null,null,null,null,null,null,null,null,null,null,null,null,null,null,0.64000000000000012,0.63329746986550162,0.93371292174999998,746.31817387467254]
["Patata polpa-ITEB",17,1.0475620581342135,1.0403259038381121,50,15.367721216250001,77.369791776250025,-80.57823525000002,0.12159999999999993,null,null,2,0.81010000000000004,789.84750000000008,2.5,150,348,199.08999999999997,43.7,25,2.75,0.34,0.8,6,null,null,null,null,null,null,null,null,null,null,null,null,null,null,2,0.64892165618683528,0.87545822674999996,866.03200000000004]
["Poma deixalles",22,1.1001886495245434,1.1027604333914458,23,8.7955432171043988,71.564699576784406,-100.08680681200001,0.48679999999999995,null,null,2,0.82908000000000004,813.32747999999992,18,68,229.76,96.16,18,19,0.33,0.40800000000000003,null,null,null,null,null,null,null,null,null,null,null,null,null,null,null,null,16.2,0.57243623367851648,0.89440442012400012,695.25000000000011]
["Poma molinada (\"marc\") deshidratada",94.1,0.5535459390511992,0.42986523768137502,79,22.417724090135192,65.611793691415201,-39.820733751999995,0.48679999999999995,null,null,2,0.44367999999999996,435.25007999999991,39,478,354,610.79,121,19,1.0449999999999999,1.0880000000000001,null,null,null,null,null,null,null,null,null,null,null,null,null,null,null,null,35.1,0.64126377758117026,0.79102315750399976,0]
["Poma residu deshidratat, NRC",89,1.0175921929055001,0.98320116886366127,49,17.456201438843994,73.715111672443996,-76.134547240000003,0.48679999999999995,null,null,2,0.73319999999999996,717.06959999999992,51,170,376.83,260,50.24,22,0.71500000000000008,0.74800000000000011,0.7,null,4.5999999999999996,1.2,0.2,null,10,null,null,300,7,null,null,null,null,null,45.9,0.58855484528181679,0.86584810847999993,628.0150685218556]
["Raïm vinassa sense pinyols",67,0.66080505971637316,0.56171561481913768,172,20.015764349395198,59.872981870035204,-4.2369023759999997,0.58639999999999992,null,null,2,0.54432999999999998,483.36503999999996,97,103,777,685,536,112,3.3000000000000003,1.7000000000000002,null,null,null,null,null,null,null,null,null,null,null,null,null,null,null,null,72.75,0.68913529881265156,0.37434524575200001,0]
["Raïm polpa",90,0.30489011965292578,0.18655481578623268,120,11.608508946144001,48.208402918624003,-20.987334332000007,0.58639999999999992,null,null,2,0.30492000000000002,292.41828000000004,7,372,754,653,499,41,4.4000000000000004,2.72,null,null,null,null,null,null,null,null,null,null,null,null,null,null,null,null,5.25,0.75465044300790995,0.39428469216400003,477.34957705641352]
["Raïm tortó de pinyols",89,0.16230419405379379,6.7872305095073068E-2,112,-1.6540106768192107,29.626211898540795,-16.035347774000005,0.58639999999999992,null,null,2,0.18833000000000005,181.17346000000003,16,503,847,751,644,38,3.63,0.88400000000000012,null,null,null,null,null,null,null,null,null,null,null,null,null,null,null,null,12,1.0632808876836617,0.23337144929799986,842.25416431416647]
["Remolatxa polpes ensitjades",22,1.0076659697674053,1.0014902800769032,98,33.631260467481596,93.731943465241613,-53.227317184,0.28759999999999997,null,null,2,0.85377999999999998,778.64736000000005,9,206,428.74,269.38,62.220000000000006,88,2.6,0.68,null,null,null,null,null,0.1,4.5999999999999996,0.3,null,null,52.4,0.03,9.6,null,null,null,4.5,0.60575801718969247,0.87047078236799991,468.17469725161038]
["Remolatxa polpes deshidratades",90,1.0254716288107246,1.0191080235150367,98,34.16981376867458,94.986646944936979,-54.346301837909991,0.28759999999999997,null,null,2,0.85500100000000001,794.2104288999999,9,202.7,507.9,302.10000000000002,55.099999999999994,71.100000000000009,2.12,0.68,2.2333333333333334,0.4,4,2.2333333333333329,2.2000000000000002,9.3333333333333338E-2,7.7333333333333334,0.3,null,243,47.6,0.03,9.7333333333333325,null,0.6,null,4,0.60314025484359779,0.87857630642456985,592.83810019236694]
["Melassa Remolatxa",76,1.184004733191649,1.2070895142316092,146,10.219999999999994,76.740128512000027,17.642299199999986,-0.70840000000000014,null,null,3,0.89,878.25200000000007,2,0,0,0,0,13.200000000000001,1.9250000000000003,0.34,16.5,null,55,12.5,null,null,null,null,null,null,null,null,null,null,null,null,2,0.93,1]
["Melassa canya",75,0.86106390989984793,0.83916162333276656,45,3.1499999999999977,61.811424000000009,-64.008475000000004,-1.5384,null,null,4,0.8,710.40000000000009,12,0,0,0,0,112,5.1150000000000011,0.74800000000000011,4.7,27,33,1.7,null,null,null,null,null,null,null,null,null,null,null,null,12,0.93,1]
["Grassa vegetal, mantega de porc (tots els tipus)",99.9,3.61,3.94,9.9999999999999995E-8,9.9999999999999995E-8,9.9999999999999995E-8,-14,0.25,null,null,2,0.9,9.9999999999999995E-8,999,9.9999999999999995E-8,9.9999999999999995E-8,9.9999999999999995E-8,9.9999999999999995E-8,9.9999999999999995E-8,5.5000000000000003E-8,6.8E-8,9.9999999999999995E-8,9.9999999999999995E-8,9.9999999999999995E-8,9.9999999999999995E-8,9.9999999999999995E-8,9.9999999999999995E-8,9.9999999999999995E-8,9.9999999999999995E-8,null,9.9999999999999995E-8,9.9999999999999995E-8,9.9999999999999995E-8,9.9999999999999995E-8,1300,9.9999999999999995E-8,95,999,0,0]
["Llevat cerveseria",93.3,1.18,1.17,476,87,143,278,0.15,null,null,2,0.84,756,40,21,88,25,7,32,1.6500000000000001,9.1800000000000015,2.4,null,null,null,null,null,null,null,null,null,null,null,null,null,null,null,32,0.81515770697868817,0.98880568000000002]
["Urea",99,0.26,0.2,2870,9.9999999999999995E-7,71,2557,0.23,null,null,2,0.99,9.9999999999999995E-7,9.9999999999999995E-7,9.9999999999999995E-7,9.9999999999999995E-7,9.9999999999999995E-7,9.9999999999999995E-7,9.9999999999999995E-7,null,null,9.9999999999999995E-7,9.9999999999999995E-7,9.9999999999999995E-7,9.9999999999999995E-7,9.9999999999999995E-7,9.9999999999999995E-7,9.9999999999999995E-7,9.9999999999999995E-7,null,9.9999999999999995E-7,9.9999999999999995E-7,9.9999999999999995E-7,9.9999999999999995E-7,9.9999999999999995E-7,9.9999999999999995E-7,9.9999999999999995E-7,0,0,0]
["Residu pa deshidratat, NRC ",92,1.0961415666476575,1.0548754187213749,107,22.016129611689657,70.466557902495424,-10.723794204384003,0.29445700000000002,null,null,2,0.71421800000000002,628.16901535999989,127,130,180,130,10,44,0.77,1.7680000000000002,2.6,16.100000000000001,5.3,12.4,0.2,1.05,5,null,null,31,71,null,16,2000,null,45,null,0.77738842706928668,0.924292560180768]
["Mandioca",85,1.1420974625875657,1.1744543546403801,31,10.1054225265006,75.490022489380621,-97.453437442000009,0.12159999999999993,null,null,2,0.91761999999999999,861.64517999999998,8.1999999999999993,54,118,59,14.01,61,1.375,0.68,0.9,null,7.5,0.35,null,null,2,null,null,50,5,null,30,null,null,null,6.56,0.63899949400537248,0.90299422413399999]
["Alfals deshidratat i aglomerats",90.2,0.73987011742021469,0.6738447078476324,233,68.64631678888,116.14710297768001,51.380021579999976,0.37889999999999996,null,null,2,0.66579999999999995,579.91179999999997,34,237,405,280,76,129,3.84,1.7680000000000002,null,null,null,null,null,null,null,null,null,null,null,null,null,null,null,null,17,0.66636436588674008,0.88305730933999993]
["Graminies deshidratades i aglomerades",91,0.82899594181392655,0.78514605944839444,105,26.822401345057497,80.520582379937494,-29.853407866999998,0.38187409999999999,null,null,2,0.72206999999999999,649.14093000000003,25,238,508,269,73.08,101,2.3650000000000002,1.8360000000000003,null,null,null,null,null,null,null,null,null,null,null,null,null,null,null,null,12.5,0.70187781135587579,0.85686826110900005]
["Concentrat producció1",86.42,1.2147927685546558,null,208.255,75.910999386966182,127.45085795141418,28.916783493049984,0.31215618000000001,null,null,1.9899999999999998,0.86847447,838.72796891999997,36.484999999999999,43.269999999999996,135.77500000000001,52.744999999999997,44.099999999999994,39.404999999999994,1.805375,2.7992200000000005,1.853,1E-3,8.5054999999999996,0.81784999999999985,3.4999999999999996E-3,0.10389999999999999,6.7884999999999991,0.89849999999999997,null,null,20.616,7.3899999999999993E-2,31.252999999999997,0,0,2.1,30.352249999999994,0.51496665479299142,null,764.10029795964169]
["concentrat 2",87.573999999999998,1.0901183722178662,null,189.16000000000003,49.30348820546125,109.20904537215566,24.651966927039989,0.21832400000000002,null,null,1.98,0.83017680000000005,803.17011839999998,18.240000000000002,57.830000000000005,200.5,71.19,14.540000000000003,41.709999999999994,2.6466000000000003,2.9756800000000005,1.75,2E-3,4.4470000000000001,0.28699999999999998,6.9999999999999993E-3,6.5000000000000002E-2,6.1550000000000002,0.56299999999999994,null,null,23.105000000000004,3.6900000000000002E-2,31.204999999999998,800,0,20,13.68,0.72434984844722627,null,630.23371220292802]
["Clovella Soja",88.8,"1,08",null,129,38,95,-32,"0,44",null,null,2,"0,80",null,21,391,652,464,24,53,3.08,1.1560000000000001,2.5,null,null,null,null,null,null,null,null,null,null,null,null,null,null,null,20,"0,56","0,67"]
[]
[]
[]
[]
[]
[]
[]
[]
[]
[]
[]
[]
[]
[]
[]
[]
[]
[]
[]
[]
[]
[]
[]
[]
[]
[]
[]
[]
[]
[]
[]
[]
[]
[]
[]
[]
[]
[]
[]
[]
[]
[]
[]
[]
[]
[]
[]
[]
[]
[]
[]
[]
[]
[]
[]
[]
[]
[]
[]
[]
[]
[]
[]
[]
[]
[]
[]
[]
[]
[]
[]
[]
[]
[]
[]
[]
[]
[]
[]
[]
[]
[]
[]
[]
[]
[]
[]
[]
[]
[]
[]
[]
[]
[]
[]
[]
[]
[]
[]
[]
[]
[]
[]
[]
[]
["","","","","","","","",null,null,null,null,"","","","","","","","","","","","","","","","","","","","","","","","","",""]
["","","","","","","","",null,null,null,null,"","","","","","","","","","","","","","","","","","","","","","","","","",""]
[]
["","","","","","","","",null,null,null,null,"","","","","","","","","","","","","","","","","","","","","","","","","",""]
[]
[]
["","","","","","","","",null,null,null,null,"","","","","","","","","","","","","","","","","","","","","","","","","",""]
[]
["","","","","","","","",null,null,null,null,"","","","","","","","","","","","","","","","","","","","","","","","","",""]

{"sheet":"Taula Concentrats","index":2,"n_rows":198,"n_cols":42,"rows_kept":198,"cut":false,"hidden":false,"merged":[]}
["Concentrats","MS","UFL","UFV","MNT_PB","PDIA","PDI","BPR","UEL","UEB","UEM","NI ref","dMO","MOD_TDN","EE","FB","NDF","ADF","Lignina","cendres","Ca","P","Mg","Cl","K","Na","S","Co","Cu","Mo","Iode","Fe","Mn","Se","Zn","Vit A","Vit D","Vit E","AG","DT_N","dr","MOF"]
[]
["Ordi gra",87.2,1.0789699893040996,1.0677525561217629,112,27.595082457151996,89.462201893951999,-31.347374120000008,0.2046,null,null,2,0.83732799999999996,816.39479999999992,19,54,215,65,12,25,0.8,3.9,1.3,null,5.55,0.35,null,0.01,4.0999999999999996,0.3,null,90,17.600000000000001,0.02,24.4,1000,null,25,{"$f":"0.75*O3","v":14.25},{"$f":"1-(F3/(E3*AO3))","v":0.73492599485689536},{"$f":"(88.3+0.0371*E3-3.7*(10^-5)*(E3^2)-0.107*S3-0.00313*(100-N3))/100","v":0.92949387723999977},{"$f":"N3-E3*(1-AN3)-O3","v":767.70651142397219}]
["Blat de moro gra",86,1.2447554097468898,1.2699211700375517,89,38.129888218376763,100.70571645287278,-70.144731616400009,0.3291,null,null,2,0.88284600000000013,870.48615600000005,43,26,125,31,60,14,0.5,2.9,1.4,null,3.6,0.33,null,0.02,2.2999999999999998,0.3,null,80,10.8,0.02,21.4,null,null,null,{"$f":"0.85*O4","v":36.549999999999997},0.50925139963862587,0.87300444668280008,783.80953056783778]
["Blat gra",87,1.1915137972087206,1.2050625767281833,157,33.001449423599993,96.505827343600004,5.8944094999999983,0.1714,null,null,2,0.87875000000000003,861.17500000000007,23,29,146,38,12,20,0.5,3.9,null,null,null,null,null,0.02,4.4000000000000004,0.3,null,null,33.700000000000003,0.04,32.5,null,null,12,{"$f":"O5*0.75","v":17.25},0.77712043387736873,0.94311164749999987,803.18290811874692]
["Civada",87.4,1.002754803542979,0.95481461893995845,111,20.397543993710997,75.333047872111024,-14.566724810000022,0.32080000000000003,null,null,2,0.72867000000000004,706.80990000000008,67,135,336,162,27,30,1,4,1.75,null,4.3,0.5,null,0.02,3.5,0.7,null,null,38.4,0.04,25.2,null,null,15,{"$f":"O6*0.9","v":60.300000000000004},0.79800315384488929,0.90972537986999991,617.38825007678281]
["Fajol gra",88,1.0007757853016814,0.96615921016994921,125,34.099887237024994,90.969890410784984,-20.559379958999994,0.21290000000000009,null,null,2,0.74392999999999987,726.8196099999999,28,118,301,158.9,33.4,23,1.1000000000000001,3.7,1.2,0.5,5.0999999999999996,0.6,1.6,0.06,11,null,null,50,38,null,10,null,null,null,{"$f":"O7*0.75","v":21},0.69938671959743504,0.90747520379299995,661.24294994967931]
["Mill gra",88,1.009546490666007,0.97767630563404173,131,35.907645941378647,91.778122786690659,-15.037620070799999,0.21290000000000009,null,null,2,0.75275400000000003,721.13833199999999,42,106,284.5,143.85999999999999,29.700000000000003,42,0.4,3.2,1.7,0.34,4.66,0.45,null,null,null,null,null,null,null,null,null,null,null,null,{"$f":"0.9*O8","v":37.800000000000004},0.69974811478529253,0.91291405979160001,639.80533503687332]
["Segol gra",86.5,1.2078146748003231,1.231534718227727,120,35.283824642879999,99.110415798080027,-34.72904868000002,0.21290000000000009,null,null,2,0.88214000000000015,864.49720000000013,16.200000000000003,26,132,42,14,20,0.7,4,1.35,null,5.25,0.3,null,0.03,4.5,0.2,null,null,55,0.03,30,null,null,17,{"$f":"0.75*O9","v":12.150000000000002},0.68422403581734659,0.93114076235999998,810.40408429808167]
["Sorgo gra",86,1.2563624126057522,1.2850946916475117,114,33.93068941985544,97.130963149263465,-37.710427702200008,0.21290000000000009,null,null,2,0.88468600000000008,869.64633800000001,37,25,107,49,4,17,0.3,3.2,1.75,null,3.6,0.4,null,null,10,null,null,160,14,null,14,14000,null,12,{"$f":"O10*0.9","v":33.300000000000004},0.68346370384827659,0.9402954103793999,796.56120023870358]
["Triticale gra",87.1,1.1917933324586927,1.2103621408310392,130,38.225488002259986,101.29653785185999,-26.948515390000008,0.21290000000000009,null,null,2,0.87145000000000006,852.27809999999999,17,33,148,40,13,22,0.5,4.5999999999999996,null,null,null,null,null,null,null,null,null,null,null,null,null,null,null,null,{"$f":"O11*0.75","v":12.75},0.68538622981633202,0.93461330452999991,794.37830987612313]
["Blat segó blat dur",87.7,1.0176943686522057,0.977907847095282,167,34.631141078796077,88.47767852596408,25.244785238800009,0.30577720000000003,null,null,2,0.73153799999999991,692.03494799999987,58,118,481,148,38,54,1.7,10.4,null,null,null,null,null,null,10,null,null,200,90,null,80,1000,null,21,{"$f":"O12*0.8","v":46.400000000000006},0.77274508423544552,0.91250876387239999,596.08337706731925]
["Blat de moro flocs",89,1.2854594416716449,1.3156335468620108,100,41.498506498559998,103.94646933760002,-59.774941936000019,0.231567,null,null,2,0.88266,868.53744000000006,43,26,90,30,10,16,0.3,2.9,1.4,0.5,3.7,0.3,1.2,0.05,4,null,null,30,5,0.08,14,1000,null,25,{"$f":"O13*0.85","v":36.549999999999997},0.55366202283859689,0.92975522187199999,780.90364228385977]
["Blat de moro bagàs",88.1,1.2034638734603806,1.2055011502513313,151,56.283786721918673,116.77481847795069,-22.647237118800017,0.28759999999999997,null,null,2,0.85009200000000007,833.94025199999999,34,68,272,78,11,19,null,null,1.8,null,3.5,9.5,null,null,null,null,null,null,null,null,null,null,null,null,{"$f":"O14*0.75","v":25.5},0.60422014182361838,0.94178695988759986,740.17749341536637]
["Blat de moro hominyfeed (mescla segó, germèn i midó)",90,1.1533551355658935,1.1579668052179757,114,46.524159785375986,107.37452349097599,-49.998693289999991,0.25357849999999998,null,null,2,0.83747599999999989,816.53909999999985,19,54,215,65,12,25,0.5,5.7,2.6,0.6,6.5,0.9,0.3,0.06,15,null,null,75,16,0.11,3,null,null,null,{"$f":"O15*0.85","v":16.149999999999999},0.56121014448870521,0.93007315382999989,747.51705647171229]
["Blat de moro gluten feed",87.7,1.0563074392437739,1.0298938534891089,216,53.864651595352321,111.00304612616833,49.881258545599977,0.3125,null,null,2,0.82507200000000003,769.79217599999993,45,88,343,100,13,67,3,7.8,3.5,null,10.25,7,null,null,null,null,null,null,null,null,null,3000,null,14,{"$f":"O16*0.9","v":40.5},0.73830819761020405,0.9529277751088,668.26674668380406]
["Blat de moro gluten meal",89.3,1.6477477819813739,1.7039593019383183,661,427.85021155354741,474.69275818906743,117.51852088199998,0.48679999999999995,null,null,2,0.94365200000000005,929.49722000000008,35,21,107,28,6,15,0.2,4,null,null,null,null,null,null,null,null,null,null,null,null,null,14000,null,26,{"$f":"O17*0.8","v":28},0.34360783225527836,0.98611349298600004,460.62199712073908]
["Blat de moro espigots ",90.2,0.52319139706798212,0.41152989548810526,44,14.398539143577599,59.977382422937616,-62.536942624000005,0.46929120000000002,null,null,2,0.45527600000000007,437.0649600000001,5,302,822,408,38,40,1.2,0.7,null,null,null,null,null,null,null,null,null,null,null,null,null,null,null,null,2,0.62321203231751077,0.86849781324800002,415.48628942197058]
["Blat de moro segó",88.3,1.1129736772157073,1.1007866196572278,101,43.238359333239842,96.344289691511847,-50.718016184800007,0.37059999999999998,null,null,2,0.70725199999999999,669.06039199999998,40,150,557,164,19,54,0.3,2.5,null,null,null,null,null,null,null,null,null,null,null,null,null,null,null,null,{"$f":"O19*0.85","v":34},0.53170775876766296,0.91417822026959994,581.76287563553399]
["Blat de moro tortó de gèrmens a pressió",88.1,1.1789597500931865,1.171602179305957,146,59.101547199313913,113.88478174088193,-23.878803971200011,0.2642698,null,null,2,0.80152400000000001,763.05084800000009,82,72,285,82,11,48,0.6,4.7,4.5,null,1.8,8.5,null,null,null,null,null,null,null,null,null,null,null,null,{"$f":"O20*0.8","v":65.600000000000009},0.56855881276595621,0.9382625715424,618.06043466382971]
["Blat de moro tortó de gèrmens amb dissolvent",87.9,1.0419900226719216,1.0235383932445659,135,54.171907268543997,111.696577773504,-33.882297663999992,0.26867210000000002,null,null,2,0.79027999999999987,752.34655999999984,17,79,310,89,12,48,0.9,5,4.5,null,1.8,8.5,null,null,null,null,null,null,null,null,null,1000,null,94,{"$f":"O21*0.75","v":12.75},0.57033439439208355,0.93392019732799991,677.34170324293109]
["Blat de moro extrussionat",90.3,1.2659242795142109,1.3059451410330718,96.35,55.422778448670854,120.6512296608667,-82.396955019056023,0.21464959,null,null,2,0.91813040000000012,904.90932224000017,4.32,2.5499999999999998,12.18,3.1,0.55000000000000004,14.399999999999999,0.3,2.9,1.4,0.5,3.7,0.3,1.2,0.05,4,null,null,30,5,0.08,14,1000,null,25,{"$f":"O22*0.85","v":3.6720000000000002},0.3880056000926686,0.93991618246111197,841.62366180892877]
["Fajol segones",89,1.1855213154544,1.1685861892728744,335,98.398382182629987,150.65027895702997,125.25641129000003,0.21290000000000009,null,null,2,0.79561999999999999,751.8608999999999,82,83,251.39,114.99000000000001,22.61,55,null,null,null,null,null,null,null,null,null,null,null,null,null,null,null,null,null,null,{"$f":"O23*0.8","v":65.600000000000009},0.69466219022372699,0.96197229616999991,567.57273372494842]
["Ordi bagàs cerveseria fresc",20.5,0.86409217991914111,0.77037029419231517,300,129.948715875,172.97965507500001,53.564157499999993,0.49509999999999998,null,null,2,0.63849999999999996,606.57500000000005,86,150,525,206,47,50,3.3,5.7,1.6,null,0.7,1.6,null,0.08,22.2,0.5,null,null,38.5,0.06,85,null,null,29,{"$f":"O24*0.45","v":38.700000000000003},0.5325076886943908,0.9265657974999999,380.32730660831726]
["Ordi bagàs cerveseria sec",91.9,0.87119356499561229,0.78054262949459352,262.39999999999998,107.61563282559231,151.63839868082431,35.094428351199994,0.49509999999999998,null,null,2,0.62731999999999999,601.34895199999994,79.900000000000006,161.6,643.29999999999995,236.4,78.899999999999991,41.4,2.2999999999999998,6.3,null,null,null,null,null,0.08,22.2,0.5,null,null,38.5,0.06,85,null,null,29,{"$f":"O25*0.45","v":35.955000000000005},0.53718506650710496,0.88614373099759991,400.00631345146428]
["Ordi malta, gra germinat i eixugat",89.6,0.82318564868563615,0.75819659606944634,255,66.3550213595625,127.25276543956251,71.697274874999977,0.29589999999999994,null,null,2,0.89924999999999988,840.79874999999993,23,10,94,10,6,65,2.7,7.5,null,null,null,null,null,null,null,null,null,null,null,null,null,null,null,16,{"$f":"O26*0.45","v":10.35},0.73182278620697816,0.97031275087500002,749.4135604827793]
["Ordi segó",89,0.76049500367747369,0.68300071501306703,118,25.132764616152489,75.567175445336488,-8.0437669206000031,0.36300710000000003,null,null,2,0.62060199999999999,581.50407399999995,32,187,539,239,28,63,0.8,3.9,null,null,null,null,null,0.03,11.7,0.6,null,null,123,0.05,59,null,null,null,{"$f":"O27*0.8","v":25.6},0.76510334942826175,0.90673719751619997,521.78626923253478]
["Cacau tortó",86.6,0.92152562915630509,0.87946946177744068,232,88.670879085753597,140.27091297407361,25.814947049499995,0.34659280999999997,null,null,2,0.74546499999999993,673.15489500000001,20,161,363.86,212.89999999999998,47.29,97,2.6,1.3,null,null,null,null,null,null,null,null,null,null,null,null,null,null,null,null,{"$f":"O28*0.75","v":15},0.58297490871153479,0.91649656821350012,556.40507382107603]
["Cacauet, tortó 48",88.6,1.1944335830241395,1.1865160385387328,524,143.30222231441923,198.10149398417923,261.73613801599998,0.28759999999999997,null,null,2,0.84376000000000007,789.75936000000002,16,77,150,101,26,64,1.8,6.6,3,null,null,null,null,0.3,14.5,1.7,null,450,47.5,0.11,61.5,null,null,null,{"$f":"O29*0.75","v":12},0.71794238190373694,0.96958034796799997,625.96116811755815]
["Coco tortó",90,0.97095956734287703,0.93399951412527582,239,87.269035447756792,138.20984342983681,30.484987527999994,0.28759999999999997,null,null,2,0.7160399999999999,660.18887999999993,18,178,580,316,78,78,2,6.6,4,null,null,0.6,null,null,20,null,null,500,60,null,70,null,null,null,{"$f":"O30*0.9","v":16.2},0.58722694217038374,0.88460814194399984,543.53611917872161]
["Colza, gra",89.9,1.9687535898800934,2.0261645054875959,217,41.884822356221591,81.980608908541598,90.240333511999992,0.29589999999999994,null,null,2,0.84608000000000005,798.69952000000012,457,68,199,116,41,56,3.3,5.3,null,null,null,null,null,null,null,null,null,null,null,null,null,null,null,null,{"$f":"O31*0.85","v":388.45},0.79112532282213199,0.92408336497600008,296.37371505240276]
["Colza, gra semiesclovellat",90,2.0068243854673327,2.0660563857148828,217,41.884822356221591,80.92224090854161,91.894033511999979,0.29589999999999994,null,null,2,0.84608000000000005,798.69952000000012,480,68,115,84,41,56,3.3,5.3,null,null,null,null,null,null,null,null,null,null,null,null,null,null,null,null,{"$f":"O32*0.79","v":379.20000000000005},0.79112532282213199,0.92408336497600008,273.37371505240276]
["Colza, turtó ",90,0.95800502495921236,0.90985936028426784,418,103.91199090373202,155.86270835653204,193.04700397999994,0.3125,null,null,2,0.78420000000000001,704.99580000000014,26,120,287,182,74,101,8.4,12.4,5.15,null,12.4,0.75,null,0.1,5.5,0.5,null,300,63.5,7.0000000000000007E-2,64.5,null,null,20,{"$f":"O33*0.8","v":20.8},0.72777380875241571,0.91318648854000006,565.20525205850993]
["Colza, turtó  tanné, curtit",89,1.2403090812927602,1.2532844857689245,391,143.42495357934857,193.47316113966858,118.739675687,0.33739999999999998,null,null,2,0.77349000000000001,713.93126999999993,26,129,302,193,79,77,8.4,12.4,null,null,12.4,0.75,null,0.1,5.5,0.5,null,300,63.5,7.0000000000000007E-2,64.5,null,null,null,{"$f":"O34*0.69","v":17.939999999999998},0.59520702136024917,0.90618107875099996,529.6572153518573]
["Cotó, gra",92,1.1057454642423121,1.0271553531490456,220,48.764449067224007,91.654792821464014,70.583837883999976,0.50340000000000007,null,null,2,0.64651999999999998,618.71964000000003,198,276,456,354,105,43,2.1,6.4,null,null,null,null,null,null,null,null,null,null,null,null,null,null,null,null,{"$f":"O35*0.95","v":188.1},0.73941085414823005,0.85059792473200002,363.39002791261066]
["Cotó tortó dessoliat",89,1.1501920277402691,1.1259438132783857,466,160.92210943249918,212.64457169579521,184.58365271359997,0.29948819999999998,null,null,2,0.80219600000000002,750.855456,20,127,232,138,32,64,4.7,9.4,5.2,null,15.2,0.4,null,null,null,null,null,null,null,null,null,null,null,null,{"$f":"O36*0.75","v":15},0.64090967269049992,0.96167005577279996,563.51936347377296]
["Cotó clovella",91,0.36620814217767916,0.23807886329057015,81,16.103086591867196,54.653602301563204,-25.8351807964,0.65129486000000003,null,null,2,0.32318199999999997,309.60835599999996,19,547,900,697.4,184.60000000000002,42,1.4,1.1000000000000001,null,null,null,null,null,null,null,null,null,null,null,null,null,null,null,null,{"$f":"O37*0.75","v":14.25},0.72375435859716208,0.71966217154279999,268.23245904637008]
["Favó gra",86.9,1.2866071181997207,1.3209577887210684,302,51.430279740777983,115.06988487997799,130.98311697000003,0.1714,null,null,2,0.91429999999999989,876.81370000000004,16,90,171,108,24.700000000000003,41,1.3,7,1.6,0.8,12,0.25,null,0.4,13.8,1,null,100,12.7,0.02,43.7,null,null,null,{"$f":"O38*0.8","v":12.8},0.82245394822364193,0.95918178880999994,807.19479236353993]
["Gira-sol, gra",93,1.7084711843203275,1.695156001331616,174,24.647498694691201,60.4191065078112,72.586862791999977,0.26269999999999993,null,null,2,0.74312,714.13832000000002,485,164,294,200,56,39,1.8,4.8,null,null,null,null,null,null,null,null,null,null,null,null,null,null,null,null,{"$f":"O39*0.95","v":460.75},0.84184492382372955,0.89565440941600005,201.61933674532895]
["Gira-sol tortó esclovellat",91,0.99107641893319698,0.94397086945962927,417,80.253815077377354,133.12343795232135,220.11121425790003,0.32080000000000003,null,null,2,0.74591699999999994,691.46505899999988,22,176,299,220,70,73,3.8,9.9,5.5,1.2,12,0.33,null,null,null,null,null,null,null,null,null,null,null,null,{"$f":"O40*0.75","v":16.5},0.79012083402996014,0.91698092634670014,581.94544679049329]
["Llentia gra",88,1.2927425717054508,1.3306553425464995,281,49.081812964852382,113.1999670179724,113.22538429199999,0.1714,null,null,2,0.91962999999999995,886.52332000000001,19.3,49,160,72,3,36,1.1000000000000001,4.5,null,null,null,null,null,null,null,null,null,null,null,null,null,null,null,null,{"$f":"O41*0.75","v":14.475000000000001},0.82166571738072802,0.97944360991599988,817.11138658398465]
["Llí, gra",90.3,1.6575837469429318,1.6606714982698805,253,51.011948668166198,92.319144300857403,111.00750682392,0.32080000000000003,null,null,2,0.78051800000000005,743.36534319999998,362,101.89999999999999,244.7,148.4,62,47.599999999999994,4.2081949058693242,6.7552602436323372,3.9867109634551494,0.66445182724252494,7.9734219269102988,0.77519379844961245,2.9900332225913622,null,13.289036544850498,0.22148394241417499,0.44296788482834998,163.89811738648947,32.115171650055373,null,49.833887043189371,null,null,null,{"$f":"O42*0.95","v":343.9},0.77769198729402633,0.90697700524215985,325.12141598538869]
["Llinosa tortó dessoliat",89,1.1518710540767036,1.1341411667893986,377,129.46711168154192,180.63225981184593,120.74445604639997,0.30640610000000001,null,null,2,0.80390399999999995,752.45414399999981,58,118,236,149,88,64,4.7,9.4,6.1,null,14,1.3,null,0.6,21,0.6,null,250,59,0.5,73,null,null,9,{"$f":"O43*0.75","v":43.5},0.61695666244551961,0.89654108470719995,550.04680574196072]
["Margalló tortó (palmiste)",90,0.83194750357129577,0.76329964928928062,206,83.768055090368009,136.52083694508801,-3.9262216479999914,0.42869999999999997,null,null,2,0.73055999999999999,699.14591999999993,19,167,632,241,103,43,3.1,6.7,null,null,null,null,null,null,null,null,null,null,null,null,null,null,null,null,{"$f":"O44*0.9","v":17.100000000000001},0.52287183224694234,0.85226794729599997,581.85751744287006]
["Mongeta gra",88,1.2694175668129566,1.3060081028573072,257,44.572029681858787,108.56384220537879,93.98279293200001,0.1714,null,null,2,0.91937000000000002,878.91772000000003,19,51,162,74,3,44,1.3,5.0999999999999996,1.6,null,14,0.4,null,null,null,null,null,null,null,null,null,null,null,null,{"$f":"O45*0.8","v":15.200000000000001},0.82213541357934528,0.97507899463600001,814.20652128989173]
["Pèsol gra",85.7,1.2625786176584095,1.2977899538253017,259,44.911731932978391,108.99577708625841,95.458679448000012,0.1714,null,null,2,0.91768000000000005,877.30208000000005,15,64,162,74,3,44,0.9,4.5999999999999996,1.45,null,11,0.3,null,7.0000000000000007E-2,7.2,1.1000000000000001,null,null,8,0.2,37,null,null,null,{"$f":"O46*0.8","v":12},0.82222021761807795,0.97538858510400006,816.25711636308222]
["Soja, gra extrussionat",88,1.4854856019534888,1.4973907223657086,402,188.43235510953002,238.04062854249003,109.28707276099998,0.32080000000000003,null,null,2,0.97179000000000004,912.51081000000011,213,74,146,92,7,61,2.8,6.4,null,null,null,null,null,null,null,null,null,null,null,null,null,null,null,null,{"$f":"O47*0.95","v":202.35},0.52666678399466216,0.99029010835300013,509.23085716585433]
["Soja, gra torrat",88.6,1.4901857276896577,1.5024458709028436,397.29999999999995,133.30789500662681,185.68918291519,158.22623764286999,0.29589999999999994,null,null,2,0.97577899999999995,918.50077269999986,216.70000000000002,63.2,132,77.78,13.5,58.7,3.6117381489841991,5.9819413092550793,2.5959367945823928,0.56433408577878108,20.767494356659142,0.90293453724604977,3.1602708803611739,null,38.37471783295711,4.5146726862302486,null,161.39954853273139,31.602708803611741,0.31602708803611745,45.146726862302486,null,null,null,{"$f":"O48*0.95","v":205.86500000000001},0.65872130014657793,0.98316887688550991,566.2107452482353]
["Soja tortó 44",87.2,1.1656258626018918,1.1597938319839582,488,153.41999795655397,207.06952650471396,219.17261164349998,0.27810560000000001,null,null,2,0.84965499999999994,779.13363500000003,22,84,163,104,8,83,3.4,7,2.7,null,20,1.95,null,0.3,17.100000000000001,2.2999999999999998,null,200,43.7,0.2,54.6,null,null,7,{"$f":"O49*0.75","v":16.5},0.68199960346033861,0.9886316027755,601.94944148864533]
["Soja tortó 46",87.2,1.2042399719188401,1.2053336060239686,505,160.06920989040626,214.45587978640626,229.07082828750001,0.26867210000000002,null,null,2,0.86389499999999997,799.10287499999993,20,72,143,89,7,75,3.4,7.4,2.7,null,20,1.95,null,0.3,17.100000000000001,2.2999999999999998,null,200,43.7,0.2,54.6,null,null,null,{"$f":"O50*0.75","v":15},0.6799548883113109,0.99038766998750005,617.48009359721186]
["Soja tortó 48",88.3,1.2238106736886152,1.2268716598377332,520,165.08161824536202,219.31515756907405,239.06009480669999,0.26741429999999999,null,null,2,0.86734100000000003,804.02510700000005,23,70,140,87,7,73,3.4,7.8,2.7,null,19.7,1.95,null,0.3,17.100000000000001,2.2999999999999998,null,200,43.7,0.2,54.6,null,null,null,{"$f":"O51*0.75","v":17.25},0.67946396874075055,0.99041798584910001,614.34637074519037]
["Soja tortó 50",87.8,1.225744301238733,1.2255650042406774,544,172.40454338212001,225.71545583172002,256.10169929750003,0.2498051,null,null,2,0.86202699999999988,797.37497499999995,28,77,102,59,6,75,3,7.8,2.7,null,19.7,1.95,null,0.3,17.100000000000001,2.2999999999999998,null,200,43.7,0.2,54.6,null,null,null,{"$f":"O52*0.75","v":21},0.68011632654366916,0.99073551671750015,595.35825663975595]
["Soja tortó 48 curtit \"tanne\"",88.8,1.2238106736886152,1.2268716598377332,520,165.08161824536202,219.31515756907405,239.06009480669999,0.26741429999999999,null,null,2,0.86734100000000003,804.02510700000005,23,70,140,87,7,73,3.4,7.8,null,null,null,null,null,0.3,17.100000000000001,2.2999999999999998,null,200,43.7,0.2,54.6,null,null,null,{"$f":"O53*0.66","v":15.180000000000001},0.67946396874075055,0.99041798584910001,614.34637074519037]
["Llobí (tramús) gra",86.7,1.4985748501920342,1.5443460916061895,399,69.098815818280471,127.26703342788048,218.10215998500001,0.1714,null,null,2,0.90506999999999993,864.34185000000002,104,161,229,172,17,45,2,4.5999999999999996,2.5,null,9.5,0.55000000000000004,null,null,null,null,null,null,null,null,null,null,null,null,{"$f":"O54*0.9","v":93.600000000000009},0.82289872796188157,0.97785852990499988,689.67844245679078]
["Llobí (tramús) extrussionat",88,1.5275128795369315,1.5781926650923088,406,69.232090685749569,127.71452533022958,223.28119586800003,0.1714,null,null,2,0.91027000000000002,877.50027999999998,109,121,214,175,34.4,36,2,4.5,1.7,0.23,10,0.11,null,null,null,null,null,null,null,null,null,null,null,null,{"$f":"O55*0.77","v":83.93},0.82240293019900856,0.96016443876399993,696.39586966079742]
["Polpes (cítrics) ensitjades",21,1.2247648530455373,1.2387634090832353,73,20.576516455389989,79.537256128989995,-58.876155740000002,0.22120000000000006,null,null,2,0.87227999999999994,824.30459999999994,97,156,356.65,206.62,44.65,55,20.399999999999999,1.5,1.6,null,6.2,0.9,0.2,0.16,6,null,null,160,7,null,16,null,null,null,{"$f":"O56*0.6","v":58.199999999999996},0.68078367808218965,0.88300650397999969,704.00180849999981]
["Polpes (cítrics)",90,1.0945776496498119,1.1035515879610236,70,20.494530967225,82.579768544825001,-65.708183715000004,0.22120000000000006,null,null,2,0.87930999999999993,822.1548499999999,28,137,223,158,14,65,23,1.3,null,null,null,null,null,null,null,null,null,null,null,null,null,null,null,null,{"$f":"O57*0.6","v":16.8},0.6799461391636954,0.91478044680499992,771.75107974145862]
["Garrofer garrofa",87,0.84349490499888424,0.82739527562045634,58,20.578036751799999,81.081596271800024,-76.256811750000026,0.28817428899999997,null,null,2,0.801456386292835,771.80250000000012,11,87,257.16000000000003,120.00999999999999,23.83,37,1.5,0.6,null,null,null,null,null,null,null,null,null,null,null,null,null,null,null,null,{"$f":"O58*0.9","v":9.9},0.60525957312408907,0.89880263824999995,737.90755524119731]
["Garrofer polpa deshidratada sense grana, IAMZ",86,0.81755713356327342,0.80100990873229949,56,19.887404593055997,81.023260765855994,-78.364775269999996,0.286199543,null,null,2,0.80349252336448596,773.76329999999996,0.1,84.5,253.55,116.86999999999999,23.07,37,1.5,0.6,null,null,null,null,null,null,null,null,null,null,null,null,null,null,null,null,{"$f":"O59*0.8","v":8.0000000000000016E-2},0.60497831613785447,0.89901957128999999,751.54208570371975]
["Oliva molinada \"orujo\"",89,0.3555684594003049,0.23152849593807051,111,37.773671789926794,72.196085881446805,-21.365022018000008,0.58639999999999992,null,null,2,0.33429000000000003,306.87822,74,339,620.51,456.32,108.36,82,14,3.4,null,null,null,null,null,null,null,null,null,null,null,null,null,null,null,null,{"$f":"O60*0.74","v":54.76},0.57995139706720433,0.81015231828599998,186.25282507445968]
["Oliva polpa sense extracció, IAMZ ",68.5,0.52852566084554287,0.41188219318965796,114,44.703288467039997,84.482230931040007,-28.474597600000006,0.58639999999999992,null,null,2,0.45799999999999996,425.02399999999994,74,200,341,295,60.21,72,11.9,1.6,null,null,null,null,null,null,null,null,null,null,null,null,null,null,null,null,{"$f":"O61*0.74","v":54.76},0.54731158643493383,0.86623403119999987,299.4175208535824]
["Oliva polpa d'extracció (\"orujo\"), IAMZ",87.6,0.28358208219027031,0.16307856023765305,66,20.210481566827202,53.349659430507202,-38.259965412,0.58639999999999992,null,null,2,0.26932,252.89148,74,412,725.77,527.95000000000005,134.64000000000001,61,5.6,0.9,null,null,null,null,null,null,null,null,null,null,null,null,null,null,null,null,{"$f":"O62*0.74","v":54.76},0.60054601929246265,0.766594983324,152.52751727330252]
["Patata-ITEB",13,1.2240398770980918,1.2703481114883948,100,34.239489082499993,100.58316924249999,-56.862000250000008,0.12159999999999993,null,null,2,0.94450000000000001,901.99749999999995,0.8,30,174.97,48.46,7.2799999999999994,45,1,2,1,22,null,null,null,null,null,null,null,null,null,null,null,null,null,null,{"$f":"O63*0.8","v":0.64000000000000012},0.63329746986550162,0.93371292174999998,864.52724698655015]
["Patata polpa-ITEB",17,1.0475620581342135,1.0403259038381121,50,15.367721216250001,77.369791776250025,-80.57823525000002,0.12159999999999993,null,null,2,0.81010000000000004,789.84750000000008,2.5,150,348,199.08999999999997,43.7,25,5,0.5,0.8,6,null,null,null,null,null,null,null,null,null,null,null,null,null,null,{"$f":"O64*0.8","v":2},0.64892165618683528,0.87545822674999996,769.79358280934184]
["Poma deixalles",22,1.1001886495245434,1.1027604333914458,23,8.7955432171043988,71.564699576784406,-100.08680681200001,0.48679999999999995,null,null,2,0.82908000000000004,813.32747999999992,18,68,229.76,96.16,18,19,0.6,0.6,null,null,null,null,null,null,null,null,null,null,null,null,null,null,null,null,{"$f":"O65*0.9","v":16.2},0.57243623367851648,0.89440442012400012,785.49351337460575]
["Poma molinada (\"marc\") deshidratada",94.1,0.5535459390511992,0.42986523768137502,79,22.417724090135192,65.611793691415201,-39.820733751999995,0.48679999999999995,null,null,2,0.44367999999999996,435.25007999999991,39,478,354,610.79,121,19,1.9,1.6,null,null,null,null,null,null,null,null,null,null,null,null,null,null,null,null,35.1,0.64126377758117026,0.79102315750399976,367.90991842891236]
["Poma residu deshidratat, NRC",89,1.0175921929055001,0.98320116886366127,49,17.456201438843994,73.715111672443996,-76.134547240000003,0.48679999999999995,null,null,2,0.73319999999999996,717.06959999999992,51,170,376.83,260,50.24,22,1.3,1.1000000000000001,0.7,null,4.5999999999999996,1.2,0.2,null,10,null,null,300,7,null,null,null,null,null,45.9,{"$f":"1-(F67/(E67*AO67))","v":0.58855484528181679},{"$f":"(88.3+0.0371*E67-3.7*(10^-5)*(E67^2)-0.107*S67-0.00313*(100-N67))/100","v":0.86584810847999993},{"$f":"N67-E67*(1-AN67)-O67","v":645.90878741880897}]
["Raïm vinassa sense pinyols",67,0.66080505971637316,0.56171561481913768,172,20.015764349395198,59.872981870035204,-4.2369023759999997,0.58639999999999992,null,null,2,0.54432999999999998,483.36503999999996,97,103,777,685,536,112,6,2.5,null,null,null,null,null,null,null,null,null,null,null,null,null,null,null,null,{"$f":"O68*0.75","v":72.75},0.68913529881265156,0.37434524575200001,332.89631139577602]
["Raïm polpa",90,0.30489011965292578,0.18655481578623268,120,11.608508946144001,48.208402918624003,-20.987334332000007,0.58639999999999992,null,null,2,0.30492000000000002,292.41828000000004,7,372,754,653,499,41,8,4,null,null,null,null,null,null,null,null,null,null,null,null,null,null,null,null,{"$f":"O69*0.75","v":5.25},0.75465044300790995,0.39428469216400003,255.97633316094925]
["Raïm tortó de pinyols",89,0.16230419405379379,6.7872305095073068E-2,112,-1.6540106768192107,29.626211898540795,-16.035347774000005,0.58639999999999992,null,null,2,0.18833000000000005,181.17346000000003,16,503,847,751,644,38,6.6,1.3,null,null,null,null,null,null,null,null,null,null,null,null,null,null,null,null,{"$f":"O70*0.75","v":12},1.0632808876836617,0.23337144929799986,172.26091942057013]
["Remolatxa polpes ensitjades",22,1.0076659697674053,1.0014902800769032,98,33.631260467481596,93.731943465241613,-53.227317184,0.28759999999999997,null,null,2,0.85377999999999998,778.64736000000005,9,206,428.74,269.38,62.220000000000006,88,13,1,null,null,null,null,null,0.1,4.5999999999999996,0.3,null,null,52.4,0.03,9.6,null,null,null,{"$f":"O71*0.5","v":4.5},0.60575801718969247,0.87047078236799991,731.01164568458989]
["Remolatxa polpes deshidratades",90,1.0254716288107246,1.0191080235150367,98,34.16981376867458,94.986646944936979,-54.346301837909991,0.28759999999999997,null,null,2,0.85500100000000001,794.2104288999999,9,202.7,507.9,302.10000000000002,55.099999999999994,71.100000000000009,10.6,1,2.2333333333333334,0.4,4,2.2333333333333329,2.2000000000000002,9.3333333333333338E-2,7.7333333333333334,0.3,null,243,47.6,0.03,9.7333333333333325,null,0.6,null,4,0.60314025484359779,0.87857630642456985,746.31817387467254]
["Melassa Remolatxa",76,1.184004733191649,1.2070895142316092,146,10.219999999999994,76.740128512000027,17.642299199999986,-0.70840000000000014,null,null,3,0.89,878.25200000000007,2,0,0,0,0,13.200000000000001,3.5,0.5,16.5,null,55,12.5,null,null,null,null,null,null,null,null,null,null,null,null,2,0.93,1,866.03200000000004]
["Melassa canya",75,0.86106390989984793,0.83916162333276656,45,3.1499999999999977,61.811424000000009,-64.008475000000004,-1.5384,null,null,4,0.8,710.40000000000009,12,0,0,0,0,112,9.3000000000000007,1.1000000000000001,4.7,27,33,1.7,null,null,null,null,null,null,null,null,null,null,null,null,12,0.93,1,695.25000000000011]
["Grassa vegetal, mantega de porc (tots els tipus)",99.9,3.61,3.94,9.9999999999999995E-8,9.9999999999999995E-8,9.9999999999999995E-8,-14,0.25,null,null,2,0.9,9.9999999999999995E-8,999,9.9999999999999995E-8,9.9999999999999995E-8,9.9999999999999995E-8,9.9999999999999995E-8,9.9999999999999995E-8,9.9999999999999995E-8,9.9999999999999995E-8,9.9999999999999995E-8,9.9999999999999995E-8,9.9999999999999995E-8,9.9999999999999995E-8,9.9999999999999995E-8,9.9999999999999995E-8,9.9999999999999995E-8,9.9999999999999995E-8,9.9999999999999995E-8,9.9999999999999995E-8,9.9999999999999995E-8,9.9999999999999995E-8,9.9999999999999995E-8,1300,9.9999999999999995E-8,95,{"$f":"O75","v":999},0,0,0]
["Llevat cerveseria",93.3,1.18,1.17,476,87,143,278,0.15,null,null,2,0.84,756,40,21,88,25,7,32,3,13.5,2.4,null,null,null,null,null,null,null,null,null,null,null,null,null,null,null,32,{"$f":"1-(F76/(E76*AO76))","v":0.81515770697868817},{"$f":"(88.3+0.0371*E76-3.7*(10^-5)*(E76^2)-0.107*S76-0.00313*(100-N76))/100","v":0.98880568000000002},{"$f":"N76-E76*(1-AN76)-O76","v":628.0150685218556}]
["Urea",99,0.26,0.2,2870,9.9999999999999995E-7,71,2557,0.23,null,null,2,0.99,9.9999999999999995E-7,9.9999999999999995E-7,9.9999999999999995E-7,9.9999999999999995E-7,9.9999999999999995E-7,9.9999999999999995E-7,9.9999999999999995E-7,9.9999999999999995E-7,9.9999999999999995E-7,9.9999999999999995E-7,9.9999999999999995E-7,9.9999999999999995E-7,9.9999999999999995E-7,9.9999999999999995E-7,9.9999999999999995E-7,9.9999999999999995E-7,9.9999999999999995E-7,9.9999999999999995E-7,9.9999999999999995E-7,9.9999999999999995E-7,9.9999999999999995E-7,9.9999999999999995E-7,9.9999999999999995E-7,9.9999999999999995E-7,9.9999999999999995E-7,0,0,0,0]
["Residu pa deshidratat, NRC ",92,1.0961415666476575,1.0548754187213749,107,22.016129611689657,70.466557902495424,-10.723794204384003,0.29445700000000002,null,null,2,0.71421800000000002,628.16901535999989,127,130,180,130,10,44,1.4,2.6,2.6,16.100000000000001,5.3,12.4,0.2,1.05,5,null,null,31,71,null,16,2000,null,45,null,{"$f":"1-(F78/(E78*AO78))","v":0.77738842706928668},{"$f":"(88.3+0.0371*E78-3.7*(10^-5)*(E78^2)-0.107*S78-0.00313*(100-N78))/100","v":0.924292560180768},{"$f":"N78-E78*(1-AN78)-O78","v":477.34957705641352}]
["Mandioca",85,1.1420974625875657,1.1744543546403801,31,10.1054225265006,75.490022489380621,-97.453437442000009,0.12159999999999993,null,null,2,0.91761999999999999,861.64517999999998,8.1999999999999993,54,118,59,14.01,61,2.5,1,0.9,null,7.5,0.35,null,null,2,null,null,50,5,null,30,null,null,null,{"$f":"O79*0.8","v":6.56},{"$f":"1-(F79/(E79*AO79))","v":0.63899949400537248},{"$f":"(88.3+0.0371*E79-3.7*(10^-5)*(E79^2)-0.107*S79-0.00313*(100-N79))/100","v":0.90299422413399999},{"$f":"N79-E79*(1-AN79)-O79","v":842.25416431416647}]
["Alfals deshidratat i aglomerats",90.2,0.73987011742021469,0.6738447078476324,233,68.64631678888,116.14710297768001,51.380021579999976,0.37889999999999996,null,null,2,0.66579999999999995,579.91179999999997,34,237,405,280,76,129,24.1,3.2,null,null,null,null,null,null,null,null,null,null,null,null,null,null,null,null,{"$f":"O80*0.5","v":17},{"$f":"1-(F80/(E80*AO80))","v":0.66636436588674008},{"$f":"(88.3+0.0371*E80-3.7*(10^-5)*(E80^2)-0.107*S80-0.00313*(100-N80))/100","v":0.88305730933999993},{"$f":"N80-E80*(1-AN80)-O80","v":468.17469725161038}]
["Graminies deshidratades i aglomerades",91,0.82899594181392655,0.78514605944839444,105,26.822401345057497,80.520582379937494,-29.853407866999998,0.38187409999999999,null,null,2,0.72206999999999999,649.14093000000003,25,238,508,269,73.08,101,4.3,2.7,null,null,null,null,null,null,null,null,null,null,null,null,null,null,null,null,{"$f":"O81*0.5","v":12.5},{"$f":"1-(F81/(E81*AO81))","v":0.70187781135587579},{"$f":"(88.3+0.0371*E81-3.7*(10^-5)*(E81^2)-0.107*S81-0.00313*(100-N81))/100","v":0.85686826110900005},{"$f":"N81-E81*(1-AN81)-O81","v":592.83810019236694}]
[]
[]
[]
[]
[]
[]
[]
[]
[]
[]
[]
[]
[]
[]
[]
[]
[]
[]
[]
[]
[]
[]
[]
[]
[]
[]
[]
[]
[]
[]
[]
[]
[]
[]
[]
[]
[]
[]
[]
[]
[]
[]
[]
[]
[]
[]
[]
[]
[]
[]
[]
[]
[]
[]
[]
[]
[]
[]
[]
[]
[]
[]
[]
[]
[]
[]
[]
[]
[]
[]
[]
[]
[]
[]
[]
[]
[]
[]
[]
[]
[]
[]
[]
[]
[]
[]
[]
[]
[]
[]
[]
[]
[]
[]
[]
[]
[]
[]
[]
[]
[]
[]
[]
[]
[]
[]
[]
[]
["","","","","","","","",null,null,null,null,"","","","","","","","","","","","","","","","","","","","","","","","","",""]
["","","","","","","","",null,null,null,null,"","","","","","","","","","","","","","","","","","","","","","","","","",""]
[]
["","","","","","","","",null,null,null,null,"","","","","","","","","","","","","","","","","","","","","","","","","",""]
[]
[]
["","","","","","","","",null,null,null,null,"","","","","","","","","","","","","","","","","","","","","","","","","",""]
[]
["","","","","","","","",null,null,null,null,"","","","","","","","","","","","","","","","","","","","","","","","","",""]

{"sheet":"Taula Minerals-aa","index":3,"n_rows":24,"n_cols":42,"rows_kept":24,"cut":false,"hidden":false,"merged":[]}
["INGREDIENTS","MS","UFL","UFV","MNT_PB","PDIA","PDI","BPR","UEL","UEB","UEM","NI ref","dMO","MOD_TDN","EE","FB","NDF","ADF","Lignina","cendres","Ca","P","Mg","Cl","K","Na","S","Co","Cu","Mo","Iode","Fe","Mn","Se","Zn","Vit A","Vit D","Vit E","AG","DT_N","dr","MOF"]
[]
["Carbonat càlcic",98,null,null,null,null,null,null,null,null,null,null,null,null,null,null,null,null,null,955,145.54,null,14,0.2,0.7,0.7,0.7,null,12,null,null,620]
["Fosfat bicàlcic",98.8,null,null,null,null,null,null,null,null,null,null,null,null,null,null,null,null,null,836,244,122.4,5,0.4,1.2,0.8,11,null,15,null,null,7800]
["Fosfat monocàlcic",98.8,null,null,null,null,null,null,null,null,null,null,null,null,null,null,null,null,null,null,88.2,155.04000000000002]
["Òxid magnèsic",100,null,null,null,null,null,null,null,null,null,null,null,null,null,null,null,null,null,null,30,null,510]
["Farina d’ossos",100,null,null,null,null,null,null,null,null,null,null,null,null,null,null,null,null,null,null,11.8,10.200000000000001]
["Fosfat sòdic",100,null,null,null,null,null,null,null,null,null,null,null,null,null,null,null,null,null,null,null,13.600000000000001,null,null,null,19]
["Fosfòric",100,null,null,null,null,null,null,null,null,null,null,null,null,null,null,null,null,null,null,null,21.488000000000003]
["Bicarbonat sòdic",99.7,null,null,null,null,null,null,null,null,null,null,null,null,null,null,null,null,null,null,null,null,null,null,null,270]
["Carbonat de cobalt",100,null,null,null,null,null,null,null,null,null,null,null,null,null,null,null,null,null,null,null,null,null,null,null,null,null,49]
["Carbonat de manganès",100,null,null,null,null,null,null,null,null,null,null,null,null,null,null,null,null,null,null,null,null,null,null,null,null,null,null,null,null,null,null,47]
["Carbonat de zinc",100,null,null,null,null,null,null,null,null,null,null,null,null,null,null,null,null,null,null,null,null,null,null,null,null,null,null,null,null,null,null,null,null,52]
["Clorur potàssic",100,null,null,null,null,null,null,null,null,null,null,null,null,null,null,null,null,null,null,null,null,null,null,52]
["Clorur sòdic",98,null,null,null,null,null,null,null,null,null,null,null,null,null,null,null,null,null,null,null,null,null,570,null,360]
["Iodur potàssic",100,null,null,null,null,null,null,null,null,null,null,null,null,null,null,null,null,null,null,null,null,null,null,null,null,null,null,null,null,76]
["Òxid de coure",100,null,null,null,null,null,null,null,null,null,null,null,null,null,null,null,null,null,null,null,null,null,null,null,null,null,null,80,null,null,null,null,null,null,null,null,780]
["Òxid de manganès",100,null,null,null,null,null,null,null,null,null,null,null,null,null,null,null,null,null,null,null,null,null,null,null,null,null,null,null,null,null,null,77]
["Òxid de zinc",100,null,null,null,null,null,null,null,null,null,null,null,null,null,null,null,null,null,null,null,null,null,null,null,null,null,null,null,null,null,null,null,null,80]
["Sulfat de cobalt",100,null,null,null,null,null,null,null,null,null,null,null,null,null,null,null,null,null,null,null,null,null,null,null,null,null,22]
["Sulfat de coure",100,null,null,null,null,null,null,null,null,null,null,null,null,null,null,null,null,null,null,null,null,null,null,null,null,null,null,25]
["Sulfat de zinc",100,null,null,null,null,null,null,null,null,null,null,null,null,null,null,null,null,null,null,null,null,null,null,null,null,null,null,null,null,null,null,null,null,23]
["Sulfat magnèsic",100,null,null,null,null,null,null,null,null,null,null,null,null,null,null,null,null,null,null,null,null,10,null,null,null,13]
["Sulfat sòdic",100,null,null,null,null,null,null,null,null,null,null,null,null,null,null,null,null,null,null,null,null,null,null,null,32,22]

{"sheet":"CàlculsEV","index":4,"n_rows":53,"n_cols":109,"rows_kept":53,"cut":false,"hidden":true,"merged":[[2,0,6,0],[7,0,18,0],[19,0,24,0]]}
[null,null,null,{"$f":"OFFSET('Taula Farratges'!$A$1,0,D2,1,1)","v":"MS"},{"$f":"OFFSET('Taula Farratges'!$A$1,0,E2,1,1)","v":"UEB"},{"$f":"OFFSET('Taula Farratges'!$A$1,0,F2,1,1)","v":"UFV"},{"$f":"OFFSET('Taula Farratges'!$A$1,0,G2,1,1)","v":"PDI"},{"$f":"OFFSET('Taula Farratges'!$A$1,0,H2,1,1)","v":"BPR"},{"$f":"OFFSET('Taula Farratges'!$A$1,0,I2,1,1)","v":"NI ref"},{"$f":"OFFSET('Taula Farratges'!$A$1,0,J2,1,1)","v":"Ca"},{"$f":"OFFSET('Taula Farratges'!$A$1,0,K2,1,1)","v":"P"},{"$f":"OFFSET('Taula Farratges'!$A$1,0,L2,1,1)","v":"Mg"},{"$f":"OFFSET('Taula Farratges'!$A$1,0,M2,1,1)","v":"K"},{"$f":"OFFSET('Taula Farratges'!$A$1,0,N2,1,1)","v":"Na"},{"$f":"OFFSET('Taula Farratges'!$A$1,0,O2,1,1)","v":"S"},{"$f":"OFFSET('Taula Farratges'!$A$1,0,P2,1,1)","v":"Cl"},{"$f":"OFFSET('Taula Farratges'!$A$1,0,Q2,1,1)","v":"Co"},{"$f":"OFFSET('Taula Farratges'!$A$1,0,R2,1,1)","v":"Cu"},{"$f":"OFFSET('Taula Farratges'!$A$1,0,S2,1,1)","v":"Mn"},{"$f":"OFFSET('Taula Farratges'!$A$1,0,T2,1,1)","v":"Zn"},{"$f":"OFFSET('Taula Farratges'!$A$1,0,U2,1,1)","v":"Iode"},{"$f":"OFFSET('Taula Farratges'!$A$1,0,V2,1,1)","v":"Se"},{"$f":"OFFSET('Taula Farratges'!$A$1,0,W2,1,1)","v":"Vit A"},{"$f":"OFFSET('Taula Farratges'!$A$1,0,X2,1,1)","v":"Vit D"},{"$f":"OFFSET('Taula Farratges'!$A$1,0,Y2,1,1)","v":"Vit E"},{"$f":"OFFSET('Taula Farratges'!$A$1,0,Z2,1,1)","v":"AG"},{"$f":"OFFSET('Taula Farratges'!$A$1,0,AA2,1,1)","v":"MNT_PB"},{"$f":"OFFSET('Taula Farratges'!$A$1,0,AB2,1,1)","v":"PDIA"},{"$f":"OFFSET('Taula Farratges'!$A$1,0,AC2,1,1)","v":"dMO"},{"$f":"OFFSET('Taula Farratges'!$A$1,0,AD2,1,1)","v":"MOD_TDN"},{"$f":"OFFSET('Taula Farratges'!$A$1,0,AE2,1,1)","v":"EE"},{"$f":"OFFSET('Taula Farratges'!$A$1,0,AF2,1,1)","v":"FB"},{"$f":"OFFSET('Taula Farratges'!$A$1,0,AG2,1,1)","v":"NDF"},{"$f":"OFFSET('Taula Farratges'!$A$1,0,AH2,1,1)","v":"ADF"},{"$f":"OFFSET('Taula Farratges'!$A$1,0,AI2,1,1)","v":"Lignina"},{"$f":"OFFSET('Taula Farratges'!$A$1,0,AJ2,1,1)","v":"cendres"},{"$f":"OFFSET('Taula Farratges'!$A$1,0,AK2,1,1)","v":"Mo"},{"$f":"OFFSET('Taula Farratges'!$A$1,0,AL2,1,1)","v":"DT_N"},{"$f":"OFFSET('Taula Farratges'!$A$1,0,AM2,1,1)","v":"MOF"},null,null,null,null,null,null,null,null,null,null,null,null,null,null,null,null,null,null,null,null,null,"AG","MNT_PB","PDIA","dMO","MOD","EE","FB","NDF","ADF","Lignina","cendres","Mo"]
["TIPUS","INGREDIENTS UTILITZATS","Nº",1,9,{"$f":"E29+1","v":3},6,7,11,20,21,22,24,25,26,23,27,28,32,34,30,33,35,36,37,38,4,5,12,13,14,15,16,17,18,19,29,39,41,"UEB","UFV","PDI","BPR","NI ref","Ca","P","Mg","K","Na","S","Cl","Co","Cu","Mn","Zn","Iode","Se","Vit A","Vit D","Vit E","AG","MNT_PB","PDIA","dMO","MOD","EE","FB","NDF","ADF","Lignina","cendres","Mo","DT_N","MOF"]
["FARRATGES",{"$f":"IF(OFFSET('Taula Farratges'!$A$1,C3,0,1,1)=0,\"\",OFFSET('Taula Farratges'!$A$1,C3,0,1,1))","v":"Poma residu deshidratat, NRC"},66,{"$f":"OFFSET('Taula Farratges'!$A$1,$C3,$D$2,1,1)","v":89},{"$f":"OFFSET('Taula Farratges'!$A$1,$C3,$E$2,1,1)","v":0},{"$f":"OFFSET('Taula Farratges'!$A$1,$C3,$F$2,1,1)","v":0.98320116886366127},{"$f":"OFFSET('Taula Farratges'!$A$1,$C3,$G$2,1,1)","v":73.715111672443996},{"$f":"OFFSET('Taula Farratges'!$A$1,$C3,$H$2,1,1)","v":-76.134547240000003},{"$f":"OFFSET('Taula Farratges'!$A$1,$C3,$I$2,1,1)","v":2},{"$f":"OFFSET('Taula Farratges'!$A$1,$C3,$J$2,1,1)","v":0.71500000000000008},{"$f":"OFFSET('Taula Farratges'!$A$1,$C3,$K$2,1,1)","v":0.74800000000000011},{"$f":"OFFSET('Taula Farratges'!$A$1,$C3,$L$2,1,1)","v":0.7},{"$f":"OFFSET('Taula Farratges'!$A$1,$C3,$M$2,1,1)","v":4.5999999999999996},{"$f":"OFFSET('Taula Farratges'!$A$1,$C3,$N$2,1,1)","v":1.2},{"$f":"OFFSET('Taula Farratges'!$A$1,$C3,$O$2,1,1)","v":0.2},{"$f":"OFFSET('Taula Farratges'!$A$1,$C3,$P$2,1,1)","v":0},{"$f":"OFFSET('Taula Farratges'!$A$1,$C3,$Q$2,1,1)","v":0},{"$f":"OFFSET('Taula Farratges'!$A$1,$C3,$R$2,1,1)","v":10},{"$f":"OFFSET('Taula Farratges'!$A$1,$C3,$S$2,1,1)","v":7},{"$f":"OFFSET('Taula Farratges'!$A$1,$C3,$T$2,1,1)","v":0},{"$f":"OFFSET('Taula Farratges'!$A$1,$C3,$U$2,1,1)","v":0},{"$f":"OFFSET('Taula Farratges'!$A$1,$C3,$V$2,1,1)","v":0},{"$f":"OFFSET('Taula Farratges'!$A$1,$C3,$W$2,1,1)","v":0},{"$f":"OFFSET('Taula Farratges'!$A$1,$C3,$X$2,1,1)","v":0},{"$f":"OFFSET('Taula Farratges'!$A$1,$C3,$Y$2,1,1)","v":0},{"$f":"OFFSET('Taula Farratges'!$A$1,$C3,$Z$2,1,1)","v":45.9},{"$f":"OFFSET('Taula Farratges'!$A$1,$C3,$AA$2,1,1)","v":49},{"$f":"OFFSET('Taula Farratges'!$A$1,$C3,$AB$2,1,1)","v":17.456201438843994},{"$f":"OFFSET('Taula Farratges'!$A$1,$C3,$AC$2,1,1)","v":0.73319999999999996},{"$f":"OFFSET('Taula Farratges'!$A$1,$C3,$AD$2,1,1)","v":717.06959999999992},{"$f":"OFFSET('Taula Farratges'!$A$1,$C3,$AE$2,1,1)","v":51},{"$f":"OFFSET('Taula Farratges'!$A$1,$C3,$AF$2,1,1)","v":170},{"$f":"OFFSET('Taula Farratges'!$A$1,$C3,$AG$2,1,1)","v":376.83},{"$f":"OFFSET('Taula Farratges'!$A$1,$C3,$AH$2,1,1)","v":260},{"$f":"OFFSET('Taula Farratges'!$A$1,$C3,$AI$2,1,1)","v":50.24},{"$f":"OFFSET('Taula Farratges'!$A$1,$C3,$AJ$2,1,1)","v":22},{"$f":"OFFSET('Taula Farratges'!$A$1,$C3,$AK$2,1,1)","v":0},{"$f":"OFFSET('Taula Farratges'!$A$1,$C3,$AL$2,1,1)","v":0.58855484528181679},{"$f":"OFFSET('Taula Farratges'!$A$1,$C3,$AM$2,1,1)","v":628.0150685218556},{"$f":"IF('II_Plantejar Ració'!$E4>0,IF(CàlculsEV!E3>0,1,\"No\"),\"\")","v":"No"},{"$f":"IF('II_Plantejar Ració'!$E4>0,IF(CàlculsEV!F3>0,1,\"No\"),\"\")","v":1},{"$f":"IF('II_Plantejar Ració'!$E4>0,IF(CàlculsEV!G3>0,1,\"No\"),\"\")","v":1},{"$f":"IF('II_Plantejar Ració'!$E4>0,IF(CàlculsEV!H3=0,\"No\",1),\"\")","v":1},{"$f":"IF('II_Plantejar Ració'!$E4>0,IF(CàlculsEV!I3>0,1,\"No\"),\"\")","v":1},{"$f":"IF('II_Plantejar Ració'!$E4>0,IF(CàlculsEV!J3>0,1,\"No\"),\"\")","v":1},{"$f":"IF('II_Plantejar Ració'!$E4>0,IF(CàlculsEV!K3>0,1,\"No\"),\"\")","v":1},{"$f":"IF('II_Plantejar Ració'!$E4>0,IF(CàlculsEV!L3>0,1,\"No\"),\"\")","v":1},{"$f":"IF('II_Plantejar Ració'!$E4>0,IF(CàlculsEV!M3>0,1,\"No\"),\"\")","v":1},{"$f":"IF('II_Plantejar Ració'!$E4>0,IF(CàlculsEV!N3>0,1,\"No\"),\"\")","v":1},{"$f":"IF('II_Plantejar Ració'!$E4>0,IF(CàlculsEV!O3>0,1,\"No\"),\"\")","v":1},{"$f":"IF('II_Plantejar Ració'!$E4>0,IF(CàlculsEV!P3>0,1,\"No\"),\"\")","v":"No"},{"$f":"IF('II_Plantejar Ració'!$E4>0,IF(CàlculsEV!Q3>0,1,\"No\"),\"\")","v":"No"},{"$f":"IF('II_Plantejar Ració'!$E4>0,IF(CàlculsEV!R3>0,1,\"No\"),\"\")","v":1},{"$f":"IF('II_Plantejar Ració'!$E4>0,IF(CàlculsEV!S3>0,1,\"No\"),\"\")","v":1},{"$f":"IF('II_Plantejar Ració'!$E4>0,IF(CàlculsEV!T3>0,1,\"No\"),\"\")","v":"No"},{"$f":"IF('II_Plantejar Ració'!$E4>0,IF(CàlculsEV!U3>0,1,\"No\"),\"\")","v":"No"},{"$f":"IF('II_Plantejar Ració'!$E4>0,IF(CàlculsEV!V3>0,1,\"No\"),\"\")","v":"No"},{"$f":"IF('II_Plantejar Ració'!$E4>0,IF(CàlculsEV!W3>0,1,\"No\"),\"\")","v":"No"},{"$f":"IF('II_Plantejar Ració'!$E4>0,IF(CàlculsEV!X3>0,1,\"No\"),\"\")","v":"No"},{"$f":"IF('II_Plantejar Ració'!$E4>0,IF(CàlculsEV!Y3>0,1,\"No\"),\"\")","v":"No"},{"$f":"IF('II_Plantejar Ració'!$E4>0,IF(CàlculsEV!Z3>0,1,\"No\"),\"\")","v":1},{"$f":"IF('II_Plantejar Ració'!$E4>0,IF(CàlculsEV!AA3>0,1,\"No\"),\"\")","v":1},{"$f":"IF('II_Plantejar Ració'!$E4>0,IF(CàlculsEV!AB3>0,1,\"No\"),\"\")","v":1},{"$f":"IF('II_Plantejar Ració'!$E4>0,IF(CàlculsEV!AC3>0,1,\"No\"),\"\")","v":1},{"$f":"IF('II_Plantejar Ració'!$E4>0,IF(CàlculsEV!AD3>0,1,\"No\"),\"\")","v":1},{"$f":"IF('II_Plantejar Ració'!$E4>0,IF(CàlculsEV!AE3>0,1,\"No\"),\"\")","v":1},{"$f":"IF('II_Plantejar Ració'!$E4>0,IF(CàlculsEV!AF3>0,1,\"No\"),\"\")","v":1},{"$f":"IF('II_Plantejar Ració'!$E4>0,IF(CàlculsEV!AG3>0,1,\"No\"),\"\")","v":1},{"$f":"IF('II_Plantejar Ració'!$E4>0,IF(CàlculsEV!AH3>0,1,\"No\"),\"\")","v":1},{"$f":"IF('II_Plantejar Ració'!$E4>0,IF(CàlculsEV!AI3>0,1,\"No\"),\"\")","v":1},{"$f":"IF('II_Plantejar Ració'!$E4>0,IF(CàlculsEV!AJ3>0,1,\"No\"),\"\")","v":1},{"$f":"IF('II_Plantejar Ració'!$E4>0,IF(CàlculsEV!AK3>0,1,\"No\"),\"\")","v":"No"},{"$f":"IF('II_Plantejar Ració'!$E4>0,IF(CàlculsEV!AL3>0,1,\"No\"),\"\")","v":1},{"$f":"IF('II_Plantejar Ració'!$E4>0,IF(CàlculsEV!AM3>0,1,\"No\"),\"\")","v":1},{"$f":"IF(AN3=\"\",0,1)","v":1},1,1,1,1,1,1,1,1,1,1,1,1,1,1,1,1,1,1,1,1,1,1,1,1,1,1,1,1,1,1,1,1,1,1]
[null,{"$f":"IF(OFFSET('Taula Farratges'!$A$1,C4,0,1,1)=0,\"\",OFFSET('Taula Farratges'!$A$1,C4,0,1,1))","v":"Polpes (cítrics) ensitjades"},55,{"$f":"OFFSET('Taula Farratges'!$A$1,$C4,$D$2,1,1)","v":21},{"$f":"OFFSET('Taula Farratges'!$A$1,$C4,$E$2,1,1)","v":0},{"$f":"OFFSET('Taula Farratges'!$A$1,$C4,$F$2,1,1)","v":1.2387634090832353},{"$f":"OFFSET('Taula Farratges'!$A$1,$C4,$G$2,1,1)","v":79.537256128989995},{"$f":"OFFSET('Taula Farratges'!$A$1,$C4,$H$2,1,1)","v":-58.876155740000002},{"$f":"OFFSET('Taula Farratges'!$A$1,$C4,$I$2,1,1)","v":2},{"$f":"OFFSET('Taula Farratges'!$A$1,$C4,$J$2,1,1)","v":11.22},{"$f":"OFFSET('Taula Farratges'!$A$1,$C4,$K$2,1,1)","v":1.35},{"$f":"OFFSET('Taula Farratges'!$A$1,$C4,$L$2,1,1)","v":1.6},{"$f":"OFFSET('Taula Farratges'!$A$1,$C4,$M$2,1,1)","v":6.2},{"$f":"OFFSET('Taula Farratges'!$A$1,$C4,$N$2,1,1)","v":0.9},{"$f":"OFFSET('Taula Farratges'!$A$1,$C4,$O$2,1,1)","v":0.2},{"$f":"OFFSET('Taula Farratges'!$A$1,$C4,$P$2,1,1)","v":0},{"$f":"OFFSET('Taula Farratges'!$A$1,$C4,$Q$2,1,1)","v":0.16},{"$f":"OFFSET('Taula Farratges'!$A$1,$C4,$R$2,1,1)","v":6},{"$f":"OFFSET('Taula Farratges'!$A$1,$C4,$S$2,1,1)","v":7},{"$f":"OFFSET('Taula Farratges'!$A$1,$C4,$T$2,1,1)","v":16},{"$f":"OFFSET('Taula Farratges'!$A$1,$C4,$U$2,1,1)","v":0},{"$f":"OFFSET('Taula Farratges'!$A$1,$C4,$V$2,1,1)","v":0},{"$f":"OFFSET('Taula Farratges'!$A$1,$C4,$W$2,1,1)","v":0},{"$f":"OFFSET('Taula Farratges'!$A$1,$C4,$X$2,1,1)","v":0},{"$f":"OFFSET('Taula Farratges'!$A$1,$C4,$Y$2,1,1)","v":0},{"$f":"OFFSET('Taula Farratges'!$A$1,$C4,$Z$2,1,1)","v":58.199999999999996},{"$f":"OFFSET('Taula Farratges'!$A$1,$C4,$AA$2,1,1)","v":73},{"$f":"OFFSET('Taula Farratges'!$A$1,$C4,$AB$2,1,1)","v":20.576516455389989},{"$f":"OFFSET('Taula Farratges'!$A$1,$C4,$AC$2,1,1)","v":0.87227999999999994},{"$f":"OFFSET('Taula Farratges'!$A$1,$C4,$AD$2,1,1)","v":824.30459999999994},{"$f":"OFFSET('Taula Farratges'!$A$1,$C4,$AE$2,1,1)","v":97},{"$f":"OFFSET('Taula Farratges'!$A$1,$C4,$AF$2,1,1)","v":156},{"$f":"OFFSET('Taula Farratges'!$A$1,$C4,$AG$2,1,1)","v":356.65},{"$f":"OFFSET('Taula Farratges'!$A$1,$C4,$AH$2,1,1)","v":206.62},{"$f":"OFFSET('Taula Farratges'!$A$1,$C4,$AI$2,1,1)","v":44.65},{"$f":"OFFSET('Taula Farratges'!$A$1,$C4,$AJ$2,1,1)","v":55},{"$f":"OFFSET('Taula Farratges'!$A$1,$C4,$AK$2,1,1)","v":0},{"$f":"OFFSET('Taula Farratges'!$A$1,$C4,$AL$2,1,1)","v":0.68078367808218965},{"$f":"OFFSET('Taula Farratges'!$A$1,$C4,$AM$2,1,1)","v":785.49351337460575},{"$f":"IF('II_Plantejar Ració'!$E5>0,IF(CàlculsEV!E4>0,1,\"No\"),\"\")","v":""},{"$f":"IF('II_Plantejar Ració'!$E5>0,IF(CàlculsEV!F4>0,1,\"No\"),\"\")","v":""},{"$f":"IF('II_Plantejar Ració'!$E5>0,IF(CàlculsEV!G4>0,1,\"No\"),\"\")","v":""},{"$f":"IF('II_Plantejar Ració'!$E5>0,IF(CàlculsEV!H4=0,\"No\",1),\"\")","v":""},{"$f":"IF('II_Plantejar Ració'!$E5>0,IF(CàlculsEV!I4>0,1,\"No\"),\"\")","v":""},{"$f":"IF('II_Plantejar Ració'!$E5>0,IF(CàlculsEV!J4>0,1,\"No\"),\"\")","v":""},{"$f":"IF('II_Plantejar Ració'!$E5>0,IF(CàlculsEV!K4>0,1,\"No\"),\"\")","v":""},{"$f":"IF('II_Plantejar Ració'!$E5>0,IF(CàlculsEV!L4>0,1,\"No\"),\"\")","v":""},{"$f":"IF('II_Plantejar Ració'!$E5>0,IF(CàlculsEV!M4>0,1,\"No\"),\"\")","v":""},{"$f":"IF('II_Plantejar Ració'!$E5>0,IF(CàlculsEV!N4>0,1,\"No\"),\"\")","v":""},{"$f":"IF('II_Plantejar Ració'!$E5>0,IF(CàlculsEV!O4>0,1,\"No\"),\"\")","v":""},{"$f":"IF('II_Plantejar Ració'!$E5>0,IF(CàlculsEV!P4>0,1,\"No\"),\"\")","v":""},{"$f":"IF('II_Plantejar Ració'!$E5>0,IF(CàlculsEV!Q4>0,1,\"No\"),\"\")","v":""},{"$f":"IF('II_Plantejar Ració'!$E5>0,IF(CàlculsEV!R4>0,1,\"No\"),\"\")","v":""},{"$f":"IF('II_Plantejar Ració'!$E5>0,IF(CàlculsEV!S4>0,1,\"No\"),\"\")","v":""},{"$f":"IF('II_Plantejar Ració'!$E5>0,IF(CàlculsEV!T4>0,1,\"No\"),\"\")","v":""},{"$f":"IF('II_Plantejar Ració'!$E5>0,IF(CàlculsEV!U4>0,1,\"No\"),\"\")","v":""},{"$f":"IF('II_Plantejar Ració'!$E5>0,IF(CàlculsEV!V4>0,1,\"No\"),\"\")","v":""},{"$f":"IF('II_Plantejar Ració'!$E5>0,IF(CàlculsEV!W4>0,1,\"No\"),\"\")","v":""},{"$f":"IF('II_Plantejar Ració'!$E5>0,IF(CàlculsEV!X4>0,1,\"No\"),\"\")","v":""},{"$f":"IF('II_Plantejar Ració'!$E5>0,IF(CàlculsEV!Y4>0,1,\"No\"),\"\")","v":""},{"$f":"IF('II_Plantejar Ració'!$E5>0,IF(CàlculsEV!Z4>0,1,\"No\"),\"\")","v":""},{"$f":"IF('II_Plantejar Ració'!$E5>0,IF(CàlculsEV!AA4>0,1,\"No\"),\"\")","v":""},{"$f":"IF('II_Plantejar Ració'!$E5>0,IF(CàlculsEV!AB4>0,1,\"No\"),\"\")","v":""},{"$f":"IF('II_Plantejar Ració'!$E5>0,IF(CàlculsEV!AC4>0,1,\"No\"),\"\")","v":""},{"$f":"IF('II_Plantejar Ració'!$E5>0,IF(CàlculsEV!AD4>0,1,\"No\"),\"\")","v":""},{"$f":"IF('II_Plantejar Ració'!$E5>0,IF(CàlculsEV!AE4>0,1,\"No\"),\"\")","v":""},{"$f":"IF('II_Plantejar Ració'!$E5>0,IF(CàlculsEV!AF4>0,1,\"No\"),\"\")","v":""},{"$f":"IF('II_Plantejar Ració'!$E5>0,IF(CàlculsEV!AG4>0,1,\"No\"),\"\")","v":""},{"$f":"IF('II_Plantejar Ració'!$E5>0,IF(CàlculsEV!AH4>0,1,\"No\"),\"\")","v":""},{"$f":"IF('II_Plantejar Ració'!$E5>0,IF(CàlculsEV!AI4>0,1,\"No\"),\"\")","v":""},{"$f":"IF('II_Plantejar Ració'!$E5>0,IF(CàlculsEV!AJ4>0,1,\"No\"),\"\")","v":""},{"$f":"IF('II_Plantejar Ració'!$E5>0,IF(CàlculsEV!AK4>0,1,\"No\"),\"\")","v":""},{"$f":"IF('II_Plantejar Ració'!$E5>0,IF(CàlculsEV!AL4>0,1,\"No\"),\"\")","v":""},{"$f":"IF('II_Plantejar Ració'!$E5>0,IF(CàlculsEV!AM4>0,1,\"No\"),\"\")","v":""},{"$f":"IF(AN4=\"\",0,1)","v":0},{"$f":"IF(AO4=\"\",0,1)","v":0},{"$f":"IF(AP4=\"\",0,1)","v":0},{"$f":"IF(AQ4=\"\",0,1)","v":0},{"$f":"IF(AR4=\"\",0,1)","v":0},{"$f":"IF(AS4=\"\",0,1)","v":0},{"$f":"IF(AT4=\"\",0,1)","v":0},{"$f":"IF(AU4=\"\",0,1)","v":0},{"$f":"IF(AV4=\"\",0,1)","v":0},{"$f":"IF(AW4=\"\",0,1)","v":0},{"$f":"IF(AX4=\"\",0,1)","v":0},{"$f":"IF(AY4=\"\",0,1)","v":0},{"$f":"IF(AZ4=\"\",0,1)","v":0},{"$f":"IF(BA4=\"\",0,1)","v":0},{"$f":"IF(BB4=\"\",0,1)","v":0},{"$f":"IF(BC4=\"\",0,1)","v":0},{"$f":"IF(BD4=\"\",0,1)","v":0},{"$f":"IF(BE4=\"\",0,1)","v":0},{"$f":"IF(BF4=\"\",0,1)","v":0},{"$f":"IF(BG4=\"\",0,1)","v":0},{"$f":"IF(BH4=\"\",0,1)","v":0},{"$f":"IF(BI4=\"\",0,1)","v":0},{"$f":"IF(BJ4=\"\",0,1)","v":0},{"$f":"IF(BK4=\"\",0,1)","v":0},{"$f":"IF(BL4=\"\",0,1)","v":0},{"$f":"IF(BM4=\"\",0,1)","v":0},{"$f":"IF(BN4=\"\",0,1)","v":0},{"$f":"IF(BO4=\"\",0,1)","v":0},{"$f":"IF(BP4=\"\",0,1)","v":0},{"$f":"IF(BQ4=\"\",0,1)","v":0},{"$f":"IF(BR4=\"\",0,1)","v":0},{"$f":"IF(BS4=\"\",0,1)","v":0},{"$f":"IF(BT4=\"\",0,1)","v":0},{"$f":"IF(BU4=\"\",0,1)","v":0},{"$f":"IF(BV4=\"\",0,1)","v":0}]
[null,{"$f":"IF(OFFSET('Taula Farratges'!$A$1,C5,0,1,1)=0,\"\",OFFSET('Taula Farratges'!$A$1,C5,0,1,1))","v":""},1,{"$f":"OFFSET('Taula Farratges'!$A$1,$C5,$D$2,1,1)","v":0},{"$f":"OFFSET('Taula Farratges'!$A$1,$C5,$E$2,1,1)","v":0},{"$f":"OFFSET('Taula Farratges'!$A$1,$C5,$F$2,1,1)","v":0},{"$f":"OFFSET('Taula Farratges'!$A$1,$C5,$G$2,1,1)","v":0},{"$f":"OFFSET('Taula Farratges'!$A$1,$C5,$H$2,1,1)","v":0},{"$f":"OFFSET('Taula Farratges'!$A$1,$C5,$I$2,1,1)","v":0},{"$f":"OFFSET('Taula Farratges'!$A$1,$C5,$J$2,1,1)","v":0},{"$f":"OFFSET('Taula Farratges'!$A$1,$C5,$K$2,1,1)","v":0},{"$f":"OFFSET('Taula Farratges'!$A$1,$C5,$L$2,1,1)","v":0},{"$f":"OFFSET('Taula Farratges'!$A$1,$C5,$M$2,1,1)","v":0},{"$f":"OFFSET('Taula Farratges'!$A$1,$C5,$N$2,1,1)","v":0},{"$f":"OFFSET('Taula Farratges'!$A$1,$C5,$O$2,1,1)","v":0},{"$f":"OFFSET('Taula Farratges'!$A$1,$C5,$P$2,1,1)","v":0},{"$f":"OFFSET('Taula Farratges'!$A$1,$C5,$Q$2,1,1)","v":0},{"$f":"OFFSET('Taula Farratges'!$A$1,$C5,$R$2,1,1)","v":0},{"$f":"OFFSET('Taula Farratges'!$A$1,$C5,$S$2,1,1)","v":0},{"$f":"OFFSET('Taula Farratges'!$A$1,$C5,$T$2,1,1)","v":0},{"$f":"OFFSET('Taula Farratges'!$A$1,$C5,$U$2,1,1)","v":0},{"$f":"OFFSET('Taula Farratges'!$A$1,$C5,$V$2,1,1)","v":0},{"$f":"OFFSET('Taula Farratges'!$A$1,$C5,$W$2,1,1)","v":0},{"$f":"OFFSET('Taula Farratges'!$A$1,$C5,$X$2,1,1)","v":0},{"$f":"OFFSET('Taula Farratges'!$A$1,$C5,$Y$2,1,1)","v":0},{"$f":"OFFSET('Taula Farratges'!$A$1,$C5,$Z$2,1,1)","v":0},{"$f":"OFFSET('Taula Farratges'!$A$1,$C5,$AA$2,1,1)","v":0},{"$f":"OFFSET('Taula Farratges'!$A$1,$C5,$AB$2,1,1)","v":0},{"$f":"OFFSET('Taula Farratges'!$A$1,$C5,$AC$2,1,1)","v":0},{"$f":"OFFSET('Taula Farratges'!$A$1,$C5,$AD$2,1,1)","v":0},{"$f":"OFFSET('Taula Farratges'!$A$1,$C5,$AE$2,1,1)","v":0},{"$f":"OFFSET('Taula Farratges'!$A$1,$C5,$AF$2,1,1)","v":0},{"$f":"OFFSET('Taula Farratges'!$A$1,$C5,$AG$2,1,1)","v":0},{"$f":"OFFSET('Taula Farratges'!$A$1,$C5,$AH$2,1,1)","v":0},{"$f":"OFFSET('Taula Farratges'!$A$1,$C5,$AI$2,1,1)","v":0},{"$f":"OFFSET('Taula Farratges'!$A$1,$C5,$AJ$2,1,1)","v":0},{"$f":"OFFSET('Taula Farratges'!$A$1,$C5,$AK$2,1,1)","v":0},{"$f":"OFFSET('Taula Farratges'!$A$1,$C5,$AL$2,1,1)","v":0},{"$f":"OFFSET('Taula Farratges'!$A$1,$C5,$AM$2,1,1)","v":0},{"$f":"IF('II_Plantejar Ració'!$E6>0,IF(CàlculsEV!E5>0,1,\"No\"),\"\")","v":""},{"$f":"IF('II_Plantejar Ració'!$E6>0,IF(CàlculsEV!F5>0,1,\"No\"),\"\")","v":""},{"$f":"IF('II_Plantejar Ració'!$E6>0,IF(CàlculsEV!G5>0,1,\"No\"),\"\")","v":""},{"$f":"IF('II_Plantejar Ració'!$E6>0,IF(CàlculsEV!H5=0,\"No\",1),\"\")","v":""},{"$f":"IF('II_Plantejar Ració'!$E6>0,IF(CàlculsEV!I5>0,1,\"No\"),\"\")","v":""},{"$f":"IF('II_Plantejar Ració'!$E6>0,IF(CàlculsEV!J5>0,1,\"No\"),\"\")","v":""},{"$f":"IF('II_Plantejar Ració'!$E6>0,IF(CàlculsEV!K5>0,1,\"No\"),\"\")","v":""},{"$f":"IF('II_Plantejar Ració'!$E6>0,IF(CàlculsEV!L5>0,1,\"No\"),\"\")","v":""},{"$f":"IF('II_Plantejar Ració'!$E6>0,IF(CàlculsEV!M5>0,1,\"No\"),\"\")","v":""},{"$f":"IF('II_Plantejar Ració'!$E6>0,IF(CàlculsEV!N5>0,1,\"No\"),\"\")","v":""},{"$f":"IF('II_Plantejar Ració'!$E6>0,IF(CàlculsEV!O5>0,1,\"No\"),\"\")","v":""},{"$f":"IF('II_Plantejar Ració'!$E6>0,IF(CàlculsEV!P5>0,1,\"No\"),\"\")","v":""},{"$f":"IF('II_Plantejar Ració'!$E6>0,IF(CàlculsEV!Q5>0,1,\"No\"),\"\")","v":""},{"$f":"IF('II_Plantejar Ració'!$E6>0,IF(CàlculsEV!R5>0,1,\"No\"),\"\")","v":""},{"$f":"IF('II_Plantejar Ració'!$E6>0,IF(CàlculsEV!S5>0,1,\"No\"),\"\")","v":""},{"$f":"IF('II_Plantejar Ració'!$E6>0,IF(CàlculsEV!T5>0,1,\"No\"),\"\")","v":""},{"$f":"IF('II_Plantejar Ració'!$E6>0,IF(CàlculsEV!U5>0,1,\"No\"),\"\")","v":""},{"$f":"IF('II_Plantejar Ració'!$E6>0,IF(CàlculsEV!V5>0,1,\"No\"),\"\")","v":""},{"$f":"IF('II_Plantejar Ració'!$E6>0,IF(CàlculsEV!W5>0,1,\"No\"),\"\")","v":""},{"$f":"IF('II_Plantejar Ració'!$E6>0,IF(CàlculsEV!X5>0,1,\"No\"),\"\")","v":""},{"$f":"IF('II_Plantejar Ració'!$E6>0,IF(CàlculsEV!Y5>0,1,\"No\"),\"\")","v":""},{"$f":"IF('II_Plantejar Ració'!$E6>0,IF(CàlculsEV!Z5>0,1,\"No\"),\"\")","v":""},{"$f":"IF('II_Plantejar Ració'!$E6>0,IF(CàlculsEV!AA5>0,1,\"No\"),\"\")","v":""},{"$f":"IF('II_Plantejar Ració'!$E6>0,IF(CàlculsEV!AB5>0,1,\"No\"),\"\")","v":""},{"$f":"IF('II_Plantejar Ració'!$E6>0,IF(CàlculsEV!AC5>0,1,\"No\"),\"\")","v":""},{"$f":"IF('II_Plantejar Ració'!$E6>0,IF(CàlculsEV!AD5>0,1,\"No\"),\"\")","v":""},{"$f":"IF('II_Plantejar Ració'!$E6>0,IF(CàlculsEV!AE5>0,1,\"No\"),\"\")","v":""},{"$f":"IF('II_Plantejar Ració'!$E6>0,IF(CàlculsEV!AF5>0,1,\"No\"),\"\")","v":""},{"$f":"IF('II_Plantejar Ració'!$E6>0,IF(CàlculsEV!AG5>0,1,\"No\"),\"\")","v":""},{"$f":"IF('II_Plantejar Ració'!$E6>0,IF(CàlculsEV!AH5>0,1,\"No\"),\"\")","v":""},{"$f":"IF('II_Plantejar Ració'!$E6>0,IF(CàlculsEV!AI5>0,1,\"No\"),\"\")","v":""},{"$f":"IF('II_Plantejar Ració'!$E6>0,IF(CàlculsEV!AJ5>0,1,\"No\"),\"\")","v":""},{"$f":"IF('II_Plantejar Ració'!$E6>0,IF(CàlculsEV!AK5>0,1,\"No\"),\"\")","v":""},{"$f":"IF('II_Plantejar Ració'!$E6>0,IF(CàlculsEV!AL5>0,1,\"No\"),\"\")","v":""},{"$f":"IF('II_Plantejar Ració'!$E6>0,IF(CàlculsEV!AM5>0,1,\"No\"),\"\")","v":""},0,0,0,0,0,0,0,0,0,0,0,0,0,0,0,0,0,0,0,0,0,0,0,0,0,0,0,0,0,0,0,0,0,0,0]
[null,{"$f":"IF(OFFSET('Taula Farratges'!$A$1,C6,0,1,1)=0,\"\",OFFSET('Taula Farratges'!$A$1,C6,0,1,1))","v":""},1,{"$f":"OFFSET('Taula Farratges'!$A$1,$C6,$D$2,1,1)","v":0},{"$f":"OFFSET('Taula Farratges'!$A$1,$C6,$E$2,1,1)","v":0},{"$f":"OFFSET('Taula Farratges'!$A$1,$C6,$F$2,1,1)","v":0},{"$f":"OFFSET('Taula Farratges'!$A$1,$C6,$G$2,1,1)","v":0},{"$f":"OFFSET('Taula Farratges'!$A$1,$C6,$H$2,1,1)","v":0},{"$f":"OFFSET('Taula Farratges'!$A$1,$C6,$I$2,1,1)","v":0},{"$f":"OFFSET('Taula Farratges'!$A$1,$C6,$J$2,1,1)","v":0},{"$f":"OFFSET('Taula Farratges'!$A$1,$C6,$K$2,1,1)","v":0},{"$f":"OFFSET('Taula Farratges'!$A$1,$C6,$L$2,1,1)","v":0},{"$f":"OFFSET('Taula Farratges'!$A$1,$C6,$M$2,1,1)","v":0},{"$f":"OFFSET('Taula Farratges'!$A$1,$C6,$N$2,1,1)","v":0},{"$f":"OFFSET('Taula Farratges'!$A$1,$C6,$O$2,1,1)","v":0},{"$f":"OFFSET('Taula Farratges'!$A$1,$C6,$P$2,1,1)","v":0},{"$f":"OFFSET('Taula Farratges'!$A$1,$C6,$Q$2,1,1)","v":0},{"$f":"OFFSET('Taula Farratges'!$A$1,$C6,$R$2,1,1)","v":0},{"$f":"OFFSET('Taula Farratges'!$A$1,$C6,$S$2,1,1)","v":0},{"$f":"OFFSET('Taula Farratges'!$A$1,$C6,$T$2,1,1)","v":0},{"$f":"OFFSET('Taula Farratges'!$A$1,$C6,$U$2,1,1)","v":0},{"$f":"OFFSET('Taula Farratges'!$A$1,$C6,$V$2,1,1)","v":0},{"$f":"OFFSET('Taula Farratges'!$A$1,$C6,$W$2,1,1)","v":0},{"$f":"OFFSET('Taula Farratges'!$A$1,$C6,$X$2,1,1)","v":0},{"$f":"OFFSET('Taula Farratges'!$A$1,$C6,$Y$2,1,1)","v":0},{"$f":"OFFSET('Taula Farratges'!$A$1,$C6,$Z$2,1,1)","v":0},{"$f":"OFFSET('Taula Farratges'!$A$1,$C6,$AA$2,1,1)","v":0},{"$f":"OFFSET('Taula Farratges'!$A$1,$C6,$AB$2,1,1)","v":0},{"$f":"OFFSET('Taula Farratges'!$A$1,$C6,$AC$2,1,1)","v":0},{"$f":"OFFSET('Taula Farratges'!$A$1,$C6,$AD$2,1,1)","v":0},{"$f":"OFFSET('Taula Farratges'!$A$1,$C6,$AE$2,1,1)","v":0},{"$f":"OFFSET('Taula Farratges'!$A$1,$C6,$AF$2,1,1)","v":0},{"$f":"OFFSET('Taula Farratges'!$A$1,$C6,$AG$2,1,1)","v":0},{"$f":"OFFSET('Taula Farratges'!$A$1,$C6,$AH$2,1,1)","v":0},{"$f":"OFFSET('Taula Farratges'!$A$1,$C6,$AI$2,1,1)","v":0},{"$f":"OFFSET('Taula Farratges'!$A$1,$C6,$AJ$2,1,1)","v":0},{"$f":"OFFSET('Taula Farratges'!$A$1,$C6,$AK$2,1,1)","v":0},{"$f":"OFFSET('Taula Farratges'!$A$1,$C6,$AL$2,1,1)","v":0},{"$f":"OFFSET('Taula Farratges'!$A$1,$C6,$AM$2,1,1)","v":0},{"$f":"IF('II_Plantejar Ració'!$E7>0,IF(CàlculsEV!E6>0,1,\"No\"),\"\")","v":""},{"$f":"IF('II_Plantejar Ració'!$E7>0,IF(CàlculsEV!F6>0,1,\"No\"),\"\")","v":""},{"$f":"IF('II_Plantejar Ració'!$E7>0,IF(CàlculsEV!G6>0,1,\"No\"),\"\")","v":""},{"$f":"IF('II_Plantejar Ració'!$E7>0,IF(CàlculsEV!H6=0,\"No\",1),\"\")","v":""},{"$f":"IF('II_Plantejar Ració'!$E7>0,IF(CàlculsEV!I6>0,1,\"No\"),\"\")","v":""},{"$f":"IF('II_Plantejar Ració'!$E7>0,IF(CàlculsEV!J6>0,1,\"No\"),\"\")","v":""},{"$f":"IF('II_Plantejar Ració'!$E7>0,IF(CàlculsEV!K6>0,1,\"No\"),\"\")","v":""},{"$f":"IF('II_Plantejar Ració'!$E7>0,IF(CàlculsEV!L6>0,1,\"No\"),\"\")","v":""},{"$f":"IF('II_Plantejar Ració'!$E7>0,IF(CàlculsEV!M6>0,1,\"No\"),\"\")","v":""},{"$f":"IF('II_Plantejar Ració'!$E7>0,IF(CàlculsEV!N6>0,1,\"No\"),\"\")","v":""},{"$f":"IF('II_Plantejar Ració'!$E7>0,IF(CàlculsEV!O6>0,1,\"No\"),\"\")","v":""},{"$f":"IF('II_Plantejar Ració'!$E7>0,IF(CàlculsEV!P6>0,1,\"No\"),\"\")","v":""},{"$f":"IF('II_Plantejar Ració'!$E7>0,IF(CàlculsEV!Q6>0,1,\"No\"),\"\")","v":""},{"$f":"IF('II_Plantejar Ració'!$E7>0,IF(CàlculsEV!R6>0,1,\"No\"),\"\")","v":""},{"$f":"IF('II_Plantejar Ració'!$E7>0,IF(CàlculsEV!S6>0,1,\"No\"),\"\")","v":""},{"$f":"IF('II_Plantejar Ració'!$E7>0,IF(CàlculsEV!T6>0,1,\"No\"),\"\")","v":""},{"$f":"IF('II_Plantejar Ració'!$E7>0,IF(CàlculsEV!U6>0,1,\"No\"),\"\")","v":""},{"$f":"IF('II_Plantejar Ració'!$E7>0,IF(CàlculsEV!V6>0,1,\"No\"),\"\")","v":""},{"$f":"IF('II_Plantejar Ració'!$E7>0,IF(CàlculsEV!W6>0,1,\"No\"),\"\")","v":""},{"$f":"IF('II_Plantejar Ració'!$E7>0,IF(CàlculsEV!X6>0,1,\"No\"),\"\")","v":""},{"$f":"IF('II_Plantejar Ració'!$E7>0,IF(CàlculsEV!Y6>0,1,\"No\"),\"\")","v":""},{"$f":"IF('II_Plantejar Ració'!$E7>0,IF(CàlculsEV!Z6>0,1,\"No\"),\"\")","v":""},{"$f":"IF('II_Plantejar Ració'!$E7>0,IF(CàlculsEV!AA6>0,1,\"No\"),\"\")","v":""},{"$f":"IF('II_Plantejar Ració'!$E7>0,IF(CàlculsEV!AB6>0,1,\"No\"),\"\")","v":""},{"$f":"IF('II_Plantejar Ració'!$E7>0,IF(CàlculsEV!AC6>0,1,\"No\"),\"\")","v":""},{"$f":"IF('II_Plantejar Ració'!$E7>0,IF(CàlculsEV!AD6>0,1,\"No\"),\"\")","v":""},{"$f":"IF('II_Plantejar Ració'!$E7>0,IF(CàlculsEV!AE6>0,1,\"No\"),\"\")","v":""},{"$f":"IF('II_Plantejar Ració'!$E7>0,IF(CàlculsEV!AF6>0,1,\"No\"),\"\")","v":""},{"$f":"IF('II_Plantejar Ració'!$E7>0,IF(CàlculsEV!AG6>0,1,\"No\"),\"\")","v":""},{"$f":"IF('II_Plantejar Ració'!$E7>0,IF(CàlculsEV!AH6>0,1,\"No\"),\"\")","v":""},{"$f":"IF('II_Plantejar Ració'!$E7>0,IF(CàlculsEV!AI6>0,1,\"No\"),\"\")","v":""},{"$f":"IF('II_Plantejar Ració'!$E7>0,IF(CàlculsEV!AJ6>0,1,\"No\"),\"\")","v":""},{"$f":"IF('II_Plantejar Ració'!$E7>0,IF(CàlculsEV!AK6>0,1,\"No\"),\"\")","v":""},{"$f":"IF('II_Plantejar Ració'!$E7>0,IF(CàlculsEV!AL6>0,1,\"No\"),\"\")","v":""},{"$f":"IF('II_Plantejar Ració'!$E7>0,IF(CàlculsEV!AM6>0,1,\"No\"),\"\")","v":""},0,0,0,0,0,0,0,0,0,0,0,0,0,0,0,0,0,0,0,0,0,0,0,0,0,0,0,0,0,0,0,0,0,0,0]
[null,{"$f":"IF(OFFSET('Taula Farratges'!$A$1,C7,0,1,1)=0,\"\",OFFSET('Taula Farratges'!$A$1,C7,0,1,1))","v":""},1,{"$f":"OFFSET('Taula Farratges'!$A$1,$C7,$D$2,1,1)","v":0},{"$f":"OFFSET('Taula Farratges'!$A$1,$C7,$E$2,1,1)","v":0},{"$f":"OFFSET('Taula Farratges'!$A$1,$C7,$F$2,1,1)","v":0},{"$f":"OFFSET('Taula Farratges'!$A$1,$C7,$G$2,1,1)","v":0},{"$f":"OFFSET('Taula Farratges'!$A$1,$C7,$H$2,1,1)","v":0},{"$f":"OFFSET('Taula Farratges'!$A$1,$C7,$I$2,1,1)","v":0},{"$f":"OFFSET('Taula Farratges'!$A$1,$C7,$J$2,1,1)","v":0},{"$f":"OFFSET('Taula Farratges'!$A$1,$C7,$K$2,1,1)","v":0},{"$f":"OFFSET('Taula Farratges'!$A$1,$C7,$L$2,1,1)","v":0},{"$f":"OFFSET('Taula Farratges'!$A$1,$C7,$M$2,1,1)","v":0},{"$f":"OFFSET('Taula Farratges'!$A$1,$C7,$N$2,1,1)","v":0},{"$f":"OFFSET('Taula Farratges'!$A$1,$C7,$O$2,1,1)","v":0},{"$f":"OFFSET('Taula Farratges'!$A$1,$C7,$P$2,1,1)","v":0},{"$f":"OFFSET('Taula Farratges'!$A$1,$C7,$Q$2,1,1)","v":0},{"$f":"OFFSET('Taula Farratges'!$A$1,$C7,$R$2,1,1)","v":0},{"$f":"OFFSET('Taula Farratges'!$A$1,$C7,$S$2,1,1)","v":0},{"$f":"OFFSET('Taula Farratges'!$A$1,$C7,$T$2,1,1)","v":0},{"$f":"OFFSET('Taula Farratges'!$A$1,$C7,$U$2,1,1)","v":0},{"$f":"OFFSET('Taula Farratges'!$A$1,$C7,$V$2,1,1)","v":0},{"$f":"OFFSET('Taula Farratges'!$A$1,$C7,$W$2,1,1)","v":0},{"$f":"OFFSET('Taula Farratges'!$A$1,$C7,$X$2,1,1)","v":0},{"$f":"OFFSET('Taula Farratges'!$A$1,$C7,$Y$2,1,1)","v":0},{"$f":"OFFSET('Taula Farratges'!$A$1,$C7,$Z$2,1,1)","v":0},{"$f":"OFFSET('Taula Farratges'!$A$1,$C7,$AA$2,1,1)","v":0},{"$f":"OFFSET('Taula Farratges'!$A$1,$C7,$AB$2,1,1)","v":0},{"$f":"OFFSET('Taula Farratges'!$A$1,$C7,$AC$2,1,1)","v":0},{"$f":"OFFSET('Taula Farratges'!$A$1,$C7,$AD$2,1,1)","v":0},{"$f":"OFFSET('Taula Farratges'!$A$1,$C7,$AE$2,1,1)","v":0},{"$f":"OFFSET('Taula Farratges'!$A$1,$C7,$AF$2,1,1)","v":0},{"$f":"OFFSET('Taula Farratges'!$A$1,$C7,$AG$2,1,1)","v":0},{"$f":"OFFSET('Taula Farratges'!$A$1,$C7,$AH$2,1,1)","v":0},{"$f":"OFFSET('Taula Farratges'!$A$1,$C7,$AI$2,1,1)","v":0},{"$f":"OFFSET('Taula Farratges'!$A$1,$C7,$AJ$2,1,1)","v":0},{"$f":"OFFSET('Taula Farratges'!$A$1,$C7,$AK$2,1,1)","v":0},{"$f":"OFFSET('Taula Farratges'!$A$1,$C7,$AL$2,1,1)","v":0},{"$f":"OFFSET('Taula Farratges'!$A$1,$C7,$AM$2,1,1)","v":0},{"$f":"IF('II_Plantejar Ració'!$E8>0,IF(CàlculsEV!E7>0,1,\"No\"),\"\")","v":""},{"$f":"IF('II_Plantejar Ració'!$E8>0,IF(CàlculsEV!F7>0,1,\"No\"),\"\")","v":""},{"$f":"IF('II_Plantejar Ració'!$E8>0,IF(CàlculsEV!G7>0,1,\"No\"),\"\")","v":""},{"$f":"IF('II_Plantejar Ració'!$E8>0,IF(CàlculsEV!H7=0,\"No\",1),\"\")","v":""},{"$f":"IF('II_Plantejar Ració'!$E8>0,IF(CàlculsEV!I7>0,1,\"No\"),\"\")","v":""},{"$f":"IF('II_Plantejar Ració'!$E8>0,IF(CàlculsEV!J7>0,1,\"No\"),\"\")","v":""},{"$f":"IF('II_Plantejar Ració'!$E8>0,IF(CàlculsEV!K7>0,1,\"No\"),\"\")","v":""},{"$f":"IF('II_Plantejar Ració'!$E8>0,IF(CàlculsEV!L7>0,1,\"No\"),\"\")","v":""},{"$f":"IF('II_Plantejar Ració'!$E8>0,IF(CàlculsEV!M7>0,1,\"No\"),\"\")","v":""},{"$f":"IF('II_Plantejar Ració'!$E8>0,IF(CàlculsEV!N7>0,1,\"No\"),\"\")","v":""},{"$f":"IF('II_Plantejar Ració'!$E8>0,IF(CàlculsEV!O7>0,1,\"No\"),\"\")","v":""},{"$f":"IF('II_Plantejar Ració'!$E8>0,IF(CàlculsEV!P7>0,1,\"No\"),\"\")","v":""},{"$f":"IF('II_Plantejar Ració'!$E8>0,IF(CàlculsEV!Q7>0,1,\"No\"),\"\")","v":""},{"$f":"IF('II_Plantejar Ració'!$E8>0,IF(CàlculsEV!R7>0,1,\"No\"),\"\")","v":""},{"$f":"IF('II_Plantejar Ració'!$E8>0,IF(CàlculsEV!S7>0,1,\"No\"),\"\")","v":""},{"$f":"IF('II_Plantejar Ració'!$E8>0,IF(CàlculsEV!T7>0,1,\"No\"),\"\")","v":""},{"$f":"IF('II_Plantejar Ració'!$E8>0,IF(CàlculsEV!U7>0,1,\"No\"),\"\")","v":""},{"$f":"IF('II_Plantejar Ració'!$E8>0,IF(CàlculsEV!V7>0,1,\"No\"),\"\")","v":""},{"$f":"IF('II_Plantejar Ració'!$E8>0,IF(CàlculsEV!W7>0,1,\"No\"),\"\")","v":""},{"$f":"IF('II_Plantejar Ració'!$E8>0,IF(CàlculsEV!X7>0,1,\"No\"),\"\")","v":""},{"$f":"IF('II_Plantejar Ració'!$E8>0,IF(CàlculsEV!Y7>0,1,\"No\"),\"\")","v":""},{"$f":"IF('II_Plantejar Ració'!$E8>0,IF(CàlculsEV!Z7>0,1,\"No\"),\"\")","v":""},{"$f":"IF('II_Plantejar Ració'!$E8>0,IF(CàlculsEV!AA7>0,1,\"No\"),\"\")","v":""},{"$f":"IF('II_Plantejar Ració'!$E8>0,IF(CàlculsEV!AB7>0,1,\"No\"),\"\")","v":""},{"$f":"IF('II_Plantejar Ració'!$E8>0,IF(CàlculsEV!AC7>0,1,\"No\"),\"\")","v":""},{"$f":"IF('II_Plantejar Ració'!$E8>0,IF(CàlculsEV!AD7>0,1,\"No\"),\"\")","v":""},{"$f":"IF('II_Plantejar Ració'!$E8>0,IF(CàlculsEV!AE7>0,1,\"No\"),\"\")","v":""},{"$f":"IF('II_Plantejar Ració'!$E8>0,IF(CàlculsEV!AF7>0,1,\"No\"),\"\")","v":""},{"$f":"IF('II_Plantejar Ració'!$E8>0,IF(CàlculsEV!AG7>0,1,\"No\"),\"\")","v":""},{"$f":"IF('II_Plantejar Ració'!$E8>0,IF(CàlculsEV!AH7>0,1,\"No\"),\"\")","v":""},{"$f":"IF('II_Plantejar Ració'!$E8>0,IF(CàlculsEV!AI7>0,1,\"No\"),\"\")","v":""},{"$f":"IF('II_Plantejar Ració'!$E8>0,IF(CàlculsEV!AJ7>0,1,\"No\"),\"\")","v":""},{"$f":"IF('II_Plantejar Ració'!$E8>0,IF(CàlculsEV!AK7>0,1,\"No\"),\"\")","v":""},{"$f":"IF('II_Plantejar Ració'!$E8>0,IF(CàlculsEV!AL7>0,1,\"No\"),\"\")","v":""},{"$f":"IF('II_Plantejar Ració'!$E8>0,IF(CàlculsEV!AM7>0,1,\"No\"),\"\")","v":""},0,0,0,0,0,0,0,0,0,0,0,0,0,0,0,0,0,0,0,0,0,0,0,0,0,0,0,0,0,0,0,0,0,0,0]
["CONCENTRATS",{"$f":"IF(OFFSET('Taula Concentrats'!$A$1,C8,0,1,1)=0,\"\",OFFSET('Taula Concentrats'!$A$1,C8,0,1,1))","v":""},1,{"$f":"OFFSET('Taula Concentrats'!$A$1,$C8,$D$2,1,1)","v":0},{"$f":"OFFSET('Taula Concentrats'!$A$1,$C8,$E$2,1,1)","v":0},{"$f":"OFFSET('Taula Concentrats'!$A$1,$C8,$F$2,1,1)","v":0},{"$f":"OFFSET('Taula Concentrats'!$A$1,$C8,$G$2,1,1)","v":0},{"$f":"OFFSET('Taula Concentrats'!$A$1,$C8,$H$2,1,1)","v":0},{"$f":"OFFSET('Taula Concentrats'!$A$1,$C8,$I$2,1,1)","v":0},{"$f":"OFFSET('Taula Concentrats'!$A$1,$C8,$J$2,1,1)","v":0},{"$f":"OFFSET('Taula Concentrats'!$A$1,$C8,$K$2,1,1)","v":0},{"$f":"OFFSET('Taula Concentrats'!$A$1,$C8,$L$2,1,1)","v":0},{"$f":"OFFSET('Taula Concentrats'!$A$1,$C8,$M$2,1,1)","v":0},{"$f":"OFFSET('Taula Concentrats'!$A$1,$C8,$N$2,1,1)","v":0},{"$f":"OFFSET('Taula Concentrats'!$A$1,$C8,$O$2,1,1)","v":0},{"$f":"OFFSET('Taula Concentrats'!$A$1,$C8,$P$2,1,1)","v":0},{"$f":"OFFSET('Taula Concentrats'!$A$1,$C8,$Q$2,1,1)","v":0},{"$f":"OFFSET('Taula Concentrats'!$A$1,$C8,$R$2,1,1)","v":0},{"$f":"OFFSET('Taula Concentrats'!$A$1,$C8,$S$2,1,1)","v":0},{"$f":"OFFSET('Taula Concentrats'!$A$1,$C8,$T$2,1,1)","v":0},{"$f":"OFFSET('Taula Concentrats'!$A$1,$C8,$U$2,1,1)","v":0},{"$f":"OFFSET('Taula Concentrats'!$A$1,$C8,$V$2,1,1)","v":0},{"$f":"OFFSET('Taula Concentrats'!$A$1,$C8,$W$2,1,1)","v":0},{"$f":"OFFSET('Taula Concentrats'!$A$1,$C8,$X$2,1,1)","v":0},{"$f":"OFFSET('Taula Concentrats'!$A$1,$C8,$Y$2,1,1)","v":0},{"$f":"OFFSET('Taula Concentrats'!$A$1,$C8,$Z$2,1,1)","v":0},{"$f":"OFFSET('Taula Concentrats'!$A$1,$C8,$AA$2,1,1)","v":0},{"$f":"OFFSET('Taula Concentrats'!$A$1,$C8,$AB$2,1,1)","v":0},{"$f":"OFFSET('Taula Concentrats'!$A$1,$C8,$AC$2,1,1)","v":0},{"$f":"OFFSET('Taula Concentrats'!$A$1,$C8,$AD$2,1,1)","v":0},{"$f":"OFFSET('Taula Concentrats'!$A$1,$C8,$AE$2,1,1)","v":0},{"$f":"OFFSET('Taula Concentrats'!$A$1,$C8,$AF$2,1,1)","v":0},{"$f":"OFFSET('Taula Concentrats'!$A$1,$C8,$AG$2,1,1)","v":0},{"$f":"OFFSET('Taula Concentrats'!$A$1,$C8,$AH$2,1,1)","v":0},{"$f":"OFFSET('Taula Concentrats'!$A$1,$C8,$AI$2,1,1)","v":0},{"$f":"OFFSET('Taula Concentrats'!$A$1,$C8,$AJ$2,1,1)","v":0},{"$f":"OFFSET('Taula Concentrats'!$A$1,$C8,$AK$2,1,1)","v":0},{"$f":"OFFSET('Taula Concentrats'!$A$1,$C8,$AL$2,1,1)","v":0},{"$f":"OFFSET('Taula Concentrats'!$A$1,$C8,$AM$2,1,1)","v":0},{"$f":"IF('II_Plantejar Ració'!$E9>0,IF(CàlculsEV!E8>=0,1,\"No\"),\"\")","v":""},{"$f":"IF('II_Plantejar Ració'!$E9>0,IF(CàlculsEV!F8>0,1,\"No\"),\"\")","v":""},{"$f":"IF('II_Plantejar Ració'!$E9>0,IF(CàlculsEV!G8>0,1,\"No\"),\"\")","v":""},{"$f":"IF('II_Plantejar Ració'!$E9>0,IF(CàlculsEV!H8=0,\"No\",1),\"\")","v":""},{"$f":"IF('II_Plantejar Ració'!$E9>0,IF(CàlculsEV!I8>0,1,\"No\"),\"\")","v":""},{"$f":"IF('II_Plantejar Ració'!$E9>0,IF(CàlculsEV!J8>0,1,\"No\"),\"\")","v":""},{"$f":"IF('II_Plantejar Ració'!$E9>0,IF(CàlculsEV!K8>0,1,\"No\"),\"\")","v":""},{"$f":"IF('II_Plantejar Ració'!$E9>0,IF(CàlculsEV!L8>0,1,\"No\"),\"\")","v":""},{"$f":"IF('II_Plantejar Ració'!$E9>0,IF(CàlculsEV!M8>0,1,\"No\"),\"\")","v":""},{"$f":"IF('II_Plantejar Ració'!$E9>0,IF(CàlculsEV!N8>0,1,\"No\"),\"\")","v":""},{"$f":"IF('II_Plantejar Ració'!$E9>0,IF(CàlculsEV!O8>0,1,\"No\"),\"\")","v":""},{"$f":"IF('II_Plantejar Ració'!$E9>0,IF(CàlculsEV!P8>0,1,\"No\"),\"\")","v":""},{"$f":"IF('II_Plantejar Ració'!$E9>0,IF(CàlculsEV!Q8>0,1,\"No\"),\"\")","v":""},{"$f":"IF('II_Plantejar Ració'!$E9>0,IF(CàlculsEV!R8>0,1,\"No\"),\"\")","v":""},{"$f":"IF('II_Plantejar Ració'!$E9>0,IF(CàlculsEV!S8>0,1,\"No\"),\"\")","v":""},{"$f":"IF('II_Plantejar Ració'!$E9>0,IF(CàlculsEV!T8>0,1,\"No\"),\"\")","v":""},{"$f":"IF('II_Plantejar Ració'!$E9>0,IF(CàlculsEV!U8>0,1,\"No\"),\"\")","v":""},{"$f":"IF('II_Plantejar Ració'!$E9>0,IF(CàlculsEV!V8>0,1,\"No\"),\"\")","v":""},{"$f":"IF('II_Plantejar Ració'!$E9>0,IF(CàlculsEV!W8>0,1,\"No\"),\"\")","v":""},{"$f":"IF('II_Plantejar Ració'!$E9>0,IF(CàlculsEV!X8>0,1,\"No\"),\"\")","v":""},{"$f":"IF('II_Plantejar Ració'!$E9>0,IF(CàlculsEV!Y8>0,1,\"No\"),\"\")","v":""},{"$f":"IF('II_Plantejar Ració'!$E9>0,IF(CàlculsEV!Z8>0,1,\"No\"),\"\")","v":""},{"$f":"IF('II_Plantejar Ració'!$E9>0,IF(CàlculsEV!AA8>0,1,\"No\"),\"\")","v":""},{"$f":"IF('II_Plantejar Ració'!$E9>0,IF(CàlculsEV!AB8>0,1,\"No\"),\"\")","v":""},{"$f":"IF('II_Plantejar Ració'!$E9>0,IF(CàlculsEV!AC8>0,1,\"No\"),\"\")","v":""},{"$f":"IF('II_Plantejar Ració'!$E9>0,IF(CàlculsEV!AD8>0,1,\"No\"),\"\")","v":""},{"$f":"IF('II_Plantejar Ració'!$E9>0,IF(CàlculsEV!AE8>0,1,\"No\"),\"\")","v":""},{"$f":"IF('II_Plantejar Ració'!$E9>0,IF(CàlculsEV!AF8>0,1,\"No\"),\"\")","v":""},{"$f":"IF('II_Plantejar Ració'!$E9>0,IF(CàlculsEV!AG8>0,1,\"No\"),\"\")","v":""},{"$f":"IF('II_Plantejar Ració'!$E9>0,IF(CàlculsEV!AH8>0,1,\"No\"),\"\")","v":""},{"$f":"IF('II_Plantejar Ració'!$E9>0,IF(CàlculsEV!AI8>0,1,\"No\"),\"\")","v":""},{"$f":"IF('II_Plantejar Ració'!$E9>0,IF(CàlculsEV!AJ8>0,1,\"No\"),\"\")","v":""},{"$f":"IF('II_Plantejar Ració'!$E9>0,IF(CàlculsEV!AK8>0,1,\"No\"),\"\")","v":""},{"$f":"IF('II_Plantejar Ració'!$E9>0,IF(CàlculsEV!AL8>0,1,\"No\"),\"\")","v":""},{"$f":"IF('II_Plantejar Ració'!$E9>0,IF(CàlculsEV!AM8>0,1,\"No\"),\"\")","v":""},0,0,0,0,0,0,0,0,0,0,0,0,0,0,0,0,0,0,0,0,0,0,0,0,0,0,0,0,0,0,0,0,0,0,0]
[null,{"$f":"IF(OFFSET('Taula Concentrats'!$A$1,C9,0,1,1)=0,\"\",OFFSET('Taula Concentrats'!$A$1,C9,0,1,1))","v":"Ordi gra"},2,{"$f":"OFFSET('Taula Concentrats'!$A$1,$C9,$D$2,1,1)","v":87.2},{"$f":"OFFSET('Taula Concentrats'!$A$1,$C9,$E$2,1,1)","v":0},{"$f":"OFFSET('Taula Concentrats'!$A$1,$C9,$F$2,1,1)","v":1.0677525561217629},{"$f":"OFFSET('Taula Concentrats'!$A$1,$C9,$G$2,1,1)","v":89.462201893951999},{"$f":"OFFSET('Taula Concentrats'!$A$1,$C9,$H$2,1,1)","v":-31.347374120000008},{"$f":"OFFSET('Taula Concentrats'!$A$1,$C9,$I$2,1,1)","v":2},{"$f":"OFFSET('Taula Concentrats'!$A$1,$C9,$J$2,1,1)","v":0.8},{"$f":"OFFSET('Taula Concentrats'!$A$1,$C9,$K$2,1,1)","v":3.9},{"$f":"OFFSET('Taula Concentrats'!$A$1,$C9,$L$2,1,1)","v":1.3},{"$f":"OFFSET('Taula Concentrats'!$A$1,$C9,$M$2,1,1)","v":5.55},{"$f":"OFFSET('Taula Concentrats'!$A$1,$C9,$N$2,1,1)","v":0.35},{"$f":"OFFSET('Taula Concentrats'!$A$1,$C9,$O$2,1,1)","v":0},{"$f":"OFFSET('Taula Concentrats'!$A$1,$C9,$P$2,1,1)","v":0},{"$f":"OFFSET('Taula Concentrats'!$A$1,$C9,$Q$2,1,1)","v":0.01},{"$f":"OFFSET('Taula Concentrats'!$A$1,$C9,$R$2,1,1)","v":4.0999999999999996},{"$f":"OFFSET('Taula Concentrats'!$A$1,$C9,$S$2,1,1)","v":17.600000000000001},{"$f":"OFFSET('Taula Concentrats'!$A$1,$C9,$T$2,1,1)","v":24.4},{"$f":"OFFSET('Taula Concentrats'!$A$1,$C9,$U$2,1,1)","v":0},{"$f":"OFFSET('Taula Concentrats'!$A$1,$C9,$V$2,1,1)","v":0.02},{"$f":"OFFSET('Taula Concentrats'!$A$1,$C9,$W$2,1,1)","v":1000},{"$f":"OFFSET('Taula Concentrats'!$A$1,$C9,$X$2,1,1)","v":0},{"$f":"OFFSET('Taula Concentrats'!$A$1,$C9,$Y$2,1,1)","v":25},{"$f":"OFFSET('Taula Concentrats'!$A$1,$C9,$Z$2,1,1)","v":14.25},{"$f":"OFFSET('Taula Concentrats'!$A$1,$C9,$AA$2,1,1)","v":112},{"$f":"OFFSET('Taula Concentrats'!$A$1,$C9,$AB$2,1,1)","v":27.595082457151996},{"$f":"OFFSET('Taula Concentrats'!$A$1,$C9,$AC$2,1,1)","v":0.83732799999999996},{"$f":"OFFSET('Taula Concentrats'!$A$1,$C9,$AD$2,1,1)","v":816.39479999999992},{"$f":"OFFSET('Taula Concentrats'!$A$1,$C9,$AE$2,1,1)","v":19},{"$f":"OFFSET('Taula Concentrats'!$A$1,$C9,$AF$2,1,1)","v":54},{"$f":"OFFSET('Taula Concentrats'!$A$1,$C9,$AG$2,1,1)","v":215},{"$f":"OFFSET('Taula Concentrats'!$A$1,$C9,$AH$2,1,1)","v":65},{"$f":"OFFSET('Taula Concentrats'!$A$1,$C9,$AI$2,1,1)","v":12},{"$f":"OFFSET('Taula Concentrats'!$A$1,$C9,$AJ$2,1,1)","v":25},{"$f":"OFFSET('Taula Concentrats'!$A$1,$C9,$AK$2,1,1)","v":0.3},{"$f":"OFFSET('Taula Concentrats'!$A$1,$C9,$AL$2,1,1)","v":0.73492599485689536},{"$f":"OFFSET('Taula Concentrats'!$A$1,$C9,$AM$2,1,1)","v":767.70651142397219},{"$f":"IF('II_Plantejar Ració'!$E10>0,IF(CàlculsEV!E9>=0,1,\"No\"),\"\")","v":""},{"$f":"IF('II_Plantejar Ració'!$E10>0,IF(CàlculsEV!F9>0,1,\"No\"),\"\")","v":""},{"$f":"IF('II_Plantejar Ració'!$E10>0,IF(CàlculsEV!G9>0,1,\"No\"),\"\")","v":""},{"$f":"IF('II_Plantejar Ració'!$E10>0,IF(CàlculsEV!H9=0,\"No\",1),\"\")","v":""},{"$f":"IF('II_Plantejar Ració'!$E10>0,IF(CàlculsEV!I9>0,1,\"No\"),\"\")","v":""},{"$f":"IF('II_Plantejar Ració'!$E10>0,IF(CàlculsEV!J9>0,1,\"No\"),\"\")","v":""},{"$f":"IF('II_Plantejar Ració'!$E10>0,IF(CàlculsEV!K9>0,1,\"No\"),\"\")","v":""},{"$f":"IF('II_Plantejar Ració'!$E10>0,IF(CàlculsEV!L9>0,1,\"No\"),\"\")","v":""},{"$f":"IF('II_Plantejar Ració'!$E10>0,IF(CàlculsEV!M9>0,1,\"No\"),\"\")","v":""},{"$f":"IF('II_Plantejar Ració'!$E10>0,IF(CàlculsEV!N9>0,1,\"No\"),\"\")","v":""},{"$f":"IF('II_Plantejar Ració'!$E10>0,IF(CàlculsEV!O9>0,1,\"No\"),\"\")","v":""},{"$f":"IF('II_Plantejar Ració'!$E10>0,IF(CàlculsEV!P9>0,1,\"No\"),\"\")","v":""},{"$f":"IF('II_Plantejar Ració'!$E10>0,IF(CàlculsEV!Q9>0,1,\"No\"),\"\")","v":""},{"$f":"IF('II_Plantejar Ració'!$E10>0,IF(CàlculsEV!R9>0,1,\"No\"),\"\")","v":""},{"$f":"IF('II_Plantejar Ració'!$E10>0,IF(CàlculsEV!S9>0,1,\"No\"),\"\")","v":""},{"$f":"IF('II_Plantejar Ració'!$E10>0,IF(CàlculsEV!T9>0,1,\"No\"),\"\")","v":""},{"$f":"IF('II_Plantejar Ració'!$E10>0,IF(CàlculsEV!U9>0,1,\"No\"),\"\")","v":""},{"$f":"IF('II_Plantejar Ració'!$E10>0,IF(CàlculsEV!V9>0,1,\"No\"),\"\")","v":""},{"$f":"IF('II_Plantejar Ració'!$E10>0,IF(CàlculsEV!W9>0,1,\"No\"),\"\")","v":""},{"$f":"IF('II_Plantejar Ració'!$E10>0,IF(CàlculsEV!X9>0,1,\"No\"),\"\")","v":""},{"$f":"IF('II_Plantejar Ració'!$E10>0,IF(CàlculsEV!Y9>0,1,\"No\"),\"\")","v":""},{"$f":"IF('II_Plantejar Ració'!$E10>0,IF(CàlculsEV!Z9>0,1,\"No\"),\"\")","v":""},{"$f":"IF('II_Plantejar Ració'!$E10>0,IF(CàlculsEV!AA9>0,1,\"No\"),\"\")","v":""},{"$f":"IF('II_Plantejar Ració'!$E10>0,IF(CàlculsEV!AB9>0,1,\"No\"),\"\")","v":""},{"$f":"IF('II_Plantejar Ració'!$E10>0,IF(CàlculsEV!AC9>0,1,\"No\"),\"\")","v":""},{"$f":"IF('II_Plantejar Ració'!$E10>0,IF(CàlculsEV!AD9>0,1,\"No\"),\"\")","v":""},{"$f":"IF('II_Plantejar Ració'!$E10>0,IF(CàlculsEV!AE9>0,1,\"No\"),\"\")","v":""},{"$f":"IF('II_Plantejar Ració'!$E10>0,IF(CàlculsEV!AF9>0,1,\"No\"),\"\")","v":""},{"$f":"IF('II_Plantejar Ració'!$E10>0,IF(CàlculsEV!AG9>0,1,\"No\"),\"\")","v":""},{"$f":"IF('II_Plantejar Ració'!$E10>0,IF(CàlculsEV!AH9>0,1,\"No\"),\"\")","v":""},{"$f":"IF('II_Plantejar Ració'!$E10>0,IF(CàlculsEV!AI9>0,1,\"No\"),\"\")","v":""},{"$f":"IF('II_Plantejar Ració'!$E10>0,IF(CàlculsEV!AJ9>0,1,\"No\"),\"\")","v":""},{"$f":"IF('II_Plantejar Ració'!$E10>0,IF(CàlculsEV!AK9>0,1,\"No\"),\"\")","v":""},{"$f":"IF('II_Plantejar Ració'!$E10>0,IF(CàlculsEV!AL9>0,1,\"No\"),\"\")","v":""},{"$f":"IF('II_Plantejar Ració'!$E10>0,IF(CàlculsEV!AM9>0,1,\"No\"),\"\")","v":""},0,0,0,0,0,0,0,0,0,0,0,0,0,0,0,0,0,0,0,0,0,0,0,0,0,0,0,0,0,0,0,0,0,0,0]
[null,{"$f":"IF(OFFSET('Taula Concentrats'!$A$1,C10,0,1,1)=0,\"\",OFFSET('Taula Concentrats'!$A$1,C10,0,1,1))","v":"Colza, turtó "},32,{"$f":"OFFSET('Taula Concentrats'!$A$1,$C10,$D$2,1,1)","v":90},{"$f":"OFFSET('Taula Concentrats'!$A$1,$C10,$E$2,1,1)","v":0},{"$f":"OFFSET('Taula Concentrats'!$A$1,$C10,$F$2,1,1)","v":0.90985936028426784},{"$f":"OFFSET('Taula Concentrats'!$A$1,$C10,$G$2,1,1)","v":155.86270835653204},{"$f":"OFFSET('Taula Concentrats'!$A$1,$C10,$H$2,1,1)","v":193.04700397999994},{"$f":"OFFSET('Taula Concentrats'!$A$1,$C10,$I$2,1,1)","v":2},{"$f":"OFFSET('Taula Concentrats'!$A$1,$C10,$J$2,1,1)","v":8.4},{"$f":"OFFSET('Taula Concentrats'!$A$1,$C10,$K$2,1,1)","v":12.4},{"$f":"OFFSET('Taula Concentrats'!$A$1,$C10,$L$2,1,1)","v":5.15},{"$f":"OFFSET('Taula Concentrats'!$A$1,$C10,$M$2,1,1)","v":12.4},{"$f":"OFFSET('Taula Concentrats'!$A$1,$C10,$N$2,1,1)","v":0.75},{"$f":"OFFSET('Taula Concentrats'!$A$1,$C10,$O$2,1,1)","v":0},{"$f":"OFFSET('Taula Concentrats'!$A$1,$C10,$P$2,1,1)","v":0},{"$f":"OFFSET('Taula Concentrats'!$A$1,$C10,$Q$2,1,1)","v":0.1},{"$f":"OFFSET('Taula Concentrats'!$A$1,$C10,$R$2,1,1)","v":5.5},{"$f":"OFFSET('Taula Concentrats'!$A$1,$C10,$S$2,1,1)","v":63.5},{"$f":"OFFSET('Taula Concentrats'!$A$1,$C10,$T$2,1,1)","v":64.5},{"$f":"OFFSET('Taula Concentrats'!$A$1,$C10,$U$2,1,1)","v":0},{"$f":"OFFSET('Taula Concentrats'!$A$1,$C10,$V$2,1,1)","v":7.0000000000000007E-2},{"$f":"OFFSET('Taula Concentrats'!$A$1,$C10,$W$2,1,1)","v":0},{"$f":"OFFSET('Taula Concentrats'!$A$1,$C10,$X$2,1,1)","v":0},{"$f":"OFFSET('Taula Concentrats'!$A$1,$C10,$Y$2,1,1)","v":20},{"$f":"OFFSET('Taula Concentrats'!$A$1,$C10,$Z$2,1,1)","v":20.8},{"$f":"OFFSET('Taula Concentrats'!$A$1,$C10,$AA$2,1,1)","v":418},{"$f":"OFFSET('Taula Concentrats'!$A$1,$C10,$AB$2,1,1)","v":103.91199090373202},{"$f":"OFFSET('Taula Concentrats'!$A$1,$C10,$AC$2,1,1)","v":0.78420000000000001},{"$f":"OFFSET('Taula Concentrats'!$A$1,$C10,$AD$2,1,1)","v":704.99580000000014},{"$f":"OFFSET('Taula Concentrats'!$A$1,$C10,$AE$2,1,1)","v":26},{"$f":"OFFSET('Taula Concentrats'!$A$1,$C10,$AF$2,1,1)","v":120},{"$f":"OFFSET('Taula Concentrats'!$A$1,$C10,$AG$2,1,1)","v":287},{"$f":"OFFSET('Taula Concentrats'!$A$1,$C10,$AH$2,1,1)","v":182},{"$f":"OFFSET('Taula Concentrats'!$A$1,$C10,$AI$2,1,1)","v":74},{"$f":"OFFSET('Taula Concentrats'!$A$1,$C10,$AJ$2,1,1)","v":101},{"$f":"OFFSET('Taula Concentrats'!$A$1,$C10,$AK$2,1,1)","v":0.5},{"$f":"OFFSET('Taula Concentrats'!$A$1,$C10,$AL$2,1,1)","v":0.72777380875241571},{"$f":"OFFSET('Taula Concentrats'!$A$1,$C10,$AM$2,1,1)","v":565.20525205850993},{"$f":"IF('II_Plantejar Ració'!$E11>0,IF(CàlculsEV!E10>=0,1,\"No\"),\"\")","v":""},{"$f":"IF('II_Plantejar Ració'!$E11>0,IF(CàlculsEV!F10>0,1,\"No\"),\"\")","v":""},{"$f":"IF('II_Plantejar Ració'!$E11>0,IF(CàlculsEV!G10>0,1,\"No\"),\"\")","v":""},{"$f":"IF('II_Plantejar Ració'!$E11>0,IF(CàlculsEV!H10=0,\"No\",1),\"\")","v":""},{"$f":"IF('II_Plantejar Ració'!$E11>0,IF(CàlculsEV!I10>0,1,\"No\"),\"\")","v":""},{"$f":"IF('II_Plantejar Ració'!$E11>0,IF(CàlculsEV!J10>0,1,\"No\"),\"\")","v":""},{"$f":"IF('II_Plantejar Ració'!$E11>0,IF(CàlculsEV!K10>0,1,\"No\"),\"\")","v":""},{"$f":"IF('II_Plantejar Ració'!$E11>0,IF(CàlculsEV!L10>0,1,\"No\"),\"\")","v":""},{"$f":"IF('II_Plantejar Ració'!$E11>0,IF(CàlculsEV!M10>0,1,\"No\"),\"\")","v":""},{"$f":"IF('II_Plantejar Ració'!$E11>0,IF(CàlculsEV!N10>0,1,\"No\"),\"\")","v":""},{"$f":"IF('II_Plantejar Ració'!$E11>0,IF(CàlculsEV!O10>0,1,\"No\"),\"\")","v":""},{"$f":"IF('II_Plantejar Ració'!$E11>0,IF(CàlculsEV!P10>0,1,\"No\"),\"\")","v":""},{"$f":"IF('II_Plantejar Ració'!$E11>0,IF(CàlculsEV!Q10>0,1,\"No\"),\"\")","v":""},{"$f":"IF('II_Plantejar Ració'!$E11>0,IF(CàlculsEV!R10>0,1,\"No\"),\"\")","v":""},{"$f":"IF('II_Plantejar Ració'!$E11>0,IF(CàlculsEV!S10>0,1,\"No\"),\"\")","v":""},{"$f":"IF('II_Plantejar Ració'!$E11>0,IF(CàlculsEV!T10>0,1,\"No\"),\"\")","v":""},{"$f":"IF('II_Plantejar Ració'!$E11>0,IF(CàlculsEV!U10>0,1,\"No\"),\"\")","v":""},{"$f":"IF('II_Plantejar Ració'!$E11>0,IF(CàlculsEV!V10>0,1,\"No\"),\"\")","v":""},{"$f":"IF('II_Plantejar Ració'!$E11>0,IF(CàlculsEV!W10>0,1,\"No\"),\"\")","v":""},{"$f":"IF('II_Plantejar Ració'!$E11>0,IF(CàlculsEV!X10>0,1,\"No\"),\"\")","v":""},{"$f":"IF('II_Plantejar Ració'!$E11>0,IF(CàlculsEV!Y10>0,1,\"No\"),\"\")","v":""},{"$f":"IF('II_Plantejar Ració'!$E11>0,IF(CàlculsEV!Z10>0,1,\"No\"),\"\")","v":""},{"$f":"IF('II_Plantejar Ració'!$E11>0,IF(CàlculsEV!AA10>0,1,\"No\"),\"\")","v":""},{"$f":"IF('II_Plantejar Ració'!$E11>0,IF(CàlculsEV!AB10>0,1,\"No\"),\"\")","v":""},{"$f":"IF('II_Plantejar Ració'!$E11>0,IF(CàlculsEV!AC10>0,1,\"No\"),\"\")","v":""},{"$f":"IF('II_Plantejar Ració'!$E11>0,IF(CàlculsEV!AD10>0,1,\"No\"),\"\")","v":""},{"$f":"IF('II_Plantejar Ració'!$E11>0,IF(CàlculsEV!AE10>0,1,\"No\"),\"\")","v":""},{"$f":"IF('II_Plantejar Ració'!$E11>0,IF(CàlculsEV!AF10>0,1,\"No\"),\"\")","v":""},{"$f":"IF('II_Plantejar Ració'!$E11>0,IF(CàlculsEV!AG10>0,1,\"No\"),\"\")","v":""},{"$f":"IF('II_Plantejar Ració'!$E11>0,IF(CàlculsEV!AH10>0,1,\"No\"),\"\")","v":""},{"$f":"IF('II_Plantejar Ració'!$E11>0,IF(CàlculsEV!AI10>0,1,\"No\"),\"\")","v":""},{"$f":"IF('II_Plantejar Ració'!$E11>0,IF(CàlculsEV!AJ10>0,1,\"No\"),\"\")","v":""},{"$f":"IF('II_Plantejar Ració'!$E11>0,IF(CàlculsEV!AK10>0,1,\"No\"),\"\")","v":""},{"$f":"IF('II_Plantejar Ració'!$E11>0,IF(CàlculsEV!AL10>0,1,\"No\"),\"\")","v":""},{"$f":"IF('II_Plantejar Ració'!$E11>0,IF(CàlculsEV!AM10>0,1,\"No\"),\"\")","v":""},0,0,0,0,0,0,0,0,0,0,0,0,0,0,0,0,0,0,0,0,0,0,0,0,0,0,0,0,0,0,0,0,0,0,0]
[null,{"$f":"IF(OFFSET('Taula Concentrats'!$A$1,C11,0,1,1)=0,\"\",OFFSET('Taula Concentrats'!$A$1,C11,0,1,1))","v":"Blat de moro gra"},3,{"$f":"OFFSET('Taula Concentrats'!$A$1,$C11,$D$2,1,1)","v":86},{"$f":"OFFSET('Taula Concentrats'!$A$1,$C11,$E$2,1,1)","v":0},{"$f":"OFFSET('Taula Concentrats'!$A$1,$C11,$F$2,1,1)","v":1.2699211700375517},{"$f":"OFFSET('Taula Concentrats'!$A$1,$C11,$G$2,1,1)","v":100.70571645287278},{"$f":"OFFSET('Taula Concentrats'!$A$1,$C11,$H$2,1,1)","v":-70.144731616400009},{"$f":"OFFSET('Taula Concentrats'!$A$1,$C11,$I$2,1,1)","v":2},{"$f":"OFFSET('Taula Concentrats'!$A$1,$C11,$J$2,1,1)","v":0.5},{"$f":"OFFSET('Taula Concentrats'!$A$1,$C11,$K$2,1,1)","v":2.9},{"$f":"OFFSET('Taula Concentrats'!$A$1,$C11,$L$2,1,1)","v":1.4},{"$f":"OFFSET('Taula Concentrats'!$A$1,$C11,$M$2,1,1)","v":3.6},{"$f":"OFFSET('Taula Concentrats'!$A$1,$C11,$N$2,1,1)","v":0.33},{"$f":"OFFSET('Taula Concentrats'!$A$1,$C11,$O$2,1,1)","v":0},{"$f":"OFFSET('Taula Concentrats'!$A$1,$C11,$P$2,1,1)","v":0},{"$f":"OFFSET('Taula Concentrats'!$A$1,$C11,$Q$2,1,1)","v":0.02},{"$f":"OFFSET('Taula Concentrats'!$A$1,$C11,$R$2,1,1)","v":2.2999999999999998},{"$f":"OFFSET('Taula Concentrats'!$A$1,$C11,$S$2,1,1)","v":10.8},{"$f":"OFFSET('Taula Concentrats'!$A$1,$C11,$T$2,1,1)","v":21.4},{"$f":"OFFSET('Taula Concentrats'!$A$1,$C11,$U$2,1,1)","v":0},{"$f":"OFFSET('Taula Concentrats'!$A$1,$C11,$V$2,1,1)","v":0.02},{"$f":"OFFSET('Taula Concentrats'!$A$1,$C11,$W$2,1,1)","v":0},{"$f":"OFFSET('Taula Concentrats'!$A$1,$C11,$X$2,1,1)","v":0},{"$f":"OFFSET('Taula Concentrats'!$A$1,$C11,$Y$2,1,1)","v":0},{"$f":"OFFSET('Taula Concentrats'!$A$1,$C11,$Z$2,1,1)","v":36.549999999999997},{"$f":"OFFSET('Taula Concentrats'!$A$1,$C11,$AA$2,1,1)","v":89},{"$f":"OFFSET('Taula Concentrats'!$A$1,$C11,$AB$2,1,1)","v":38.129888218376763},{"$f":"OFFSET('Taula Concentrats'!$A$1,$C11,$AC$2,1,1)","v":0.88284600000000013},{"$f":"OFFSET('Taula Concentrats'!$A$1,$C11,$AD$2,1,1)","v":870.48615600000005},{"$f":"OFFSET('Taula Concentrats'!$A$1,$C11,$AE$2,1,1)","v":43},{"$f":"OFFSET('Taula Concentrats'!$A$1,$C11,$AF$2,1,1)","v":26},{"$f":"OFFSET('Taula Concentrats'!$A$1,$C11,$AG$2,1,1)","v":125},{"$f":"OFFSET('Taula Concentrats'!$A$1,$C11,$AH$2,1,1)","v":31},{"$f":"OFFSET('Taula Concentrats'!$A$1,$C11,$AI$2,1,1)","v":60},{"$f":"OFFSET('Taula Concentrats'!$A$1,$C11,$AJ$2,1,1)","v":14},{"$f":"OFFSET('Taula Concentrats'!$A$1,$C11,$AK$2,1,1)","v":0.3},{"$f":"OFFSET('Taula Concentrats'!$A$1,$C11,$AL$2,1,1)","v":0.50925139963862587},{"$f":"OFFSET('Taula Concentrats'!$A$1,$C11,$AM$2,1,1)","v":783.80953056783778},{"$f":"IF('II_Plantejar Ració'!$E12>0,IF(CàlculsEV!E11>=0,1,\"No\"),\"\")","v":""},{"$f":"IF('II_Plantejar Ració'!$E12>0,IF(CàlculsEV!F11>0,1,\"No\"),\"\")","v":""},{"$f":"IF('II_Plantejar Ració'!$E12>0,IF(CàlculsEV!G11>0,1,\"No\"),\"\")","v":""},{"$f":"IF('II_Plantejar Ració'!$E12>0,IF(CàlculsEV!H11=0,\"No\",1),\"\")","v":""},{"$f":"IF('II_Plantejar Ració'!$E12>0,IF(CàlculsEV!I11>0,1,\"No\"),\"\")","v":""},{"$f":"IF('II_Plantejar Ració'!$E12>0,IF(CàlculsEV!J11>0,1,\"No\"),\"\")","v":""},{"$f":"IF('II_Plantejar Ració'!$E12>0,IF(CàlculsEV!K11>0,1,\"No\"),\"\")","v":""},{"$f":"IF('II_Plantejar Ració'!$E12>0,IF(CàlculsEV!L11>0,1,\"No\"),\"\")","v":""},{"$f":"IF('II_Plantejar Ració'!$E12>0,IF(CàlculsEV!M11>0,1,\"No\"),\"\")","v":""},{"$f":"IF('II_Plantejar Ració'!$E12>0,IF(CàlculsEV!N11>0,1,\"No\"),\"\")","v":""},{"$f":"IF('II_Plantejar Ració'!$E12>0,IF(CàlculsEV!O11>0,1,\"No\"),\"\")","v":""},{"$f":"IF('II_Plantejar Ració'!$E12>0,IF(CàlculsEV!P11>0,1,\"No\"),\"\")","v":""},{"$f":"IF('II_Plantejar Ració'!$E12>0,IF(CàlculsEV!Q11>0,1,\"No\"),\"\")","v":""},{"$f":"IF('II_Plantejar Ració'!$E12>0,IF(CàlculsEV!R11>0,1,\"No\"),\"\")","v":""},{"$f":"IF('II_Plantejar Ració'!$E12>0,IF(CàlculsEV!S11>0,1,\"No\"),\"\")","v":""},{"$f":"IF('II_Plantejar Ració'!$E12>0,IF(CàlculsEV!T11>0,1,\"No\"),\"\")","v":""},{"$f":"IF('II_Plantejar Ració'!$E12>0,IF(CàlculsEV!U11>0,1,\"No\"),\"\")","v":""},{"$f":"IF('II_Plantejar Ració'!$E12>0,IF(CàlculsEV!V11>0,1,\"No\"),\"\")","v":""},{"$f":"IF('II_Plantejar Ració'!$E12>0,IF(CàlculsEV!W11>0,1,\"No\"),\"\")","v":""},{"$f":"IF('II_Plantejar Ració'!$E12>0,IF(CàlculsEV!X11>0,1,\"No\"),\"\")","v":""},{"$f":"IF('II_Plantejar Ració'!$E12>0,IF(CàlculsEV!Y11>0,1,\"No\"),\"\")","v":""},{"$f":"IF('II_Plantejar Ració'!$E12>0,IF(CàlculsEV!Z11>0,1,\"No\"),\"\")","v":""},{"$f":"IF('II_Plantejar Ració'!$E12>0,IF(CàlculsEV!AA11>0,1,\"No\"),\"\")","v":""},{"$f":"IF('II_Plantejar Ració'!$E12>0,IF(CàlculsEV!AB11>0,1,\"No\"),\"\")","v":""},{"$f":"IF('II_Plantejar Ració'!$E12>0,IF(CàlculsEV!AC11>0,1,\"No\"),\"\")","v":""},{"$f":"IF('II_Plantejar Ració'!$E12>0,IF(CàlculsEV!AD11>0,1,\"No\"),\"\")","v":""},{"$f":"IF('II_Plantejar Ració'!$E12>0,IF(CàlculsEV!AE11>0,1,\"No\"),\"\")","v":""},{"$f":"IF('II_Plantejar Ració'!$E12>0,IF(CàlculsEV!AF11>0,1,\"No\"),\"\")","v":""},{"$f":"IF('II_Plantejar Ració'!$E12>0,IF(CàlculsEV!AG11>0,1,\"No\"),\"\")","v":""},{"$f":"IF('II_Plantejar Ració'!$E12>0,IF(CàlculsEV!AH11>0,1,\"No\"),\"\")","v":""},{"$f":"IF('II_Plantejar Ració'!$E12>0,IF(CàlculsEV!AI11>0,1,\"No\"),\"\")","v":""},{"$f":"IF('II_Plantejar Ració'!$E12>0,IF(CàlculsEV!AJ11>0,1,\"No\"),\"\")","v":""},{"$f":"IF('II_Plantejar Ració'!$E12>0,IF(CàlculsEV!AK11>0,1,\"No\"),\"\")","v":""},{"$f":"IF('II_Plantejar Ració'!$E12>0,IF(CàlculsEV!AL11>0,1,\"No\"),\"\")","v":""},{"$f":"IF('II_Plantejar Ració'!$E12>0,IF(CàlculsEV!AM11>0,1,\"No\"),\"\")","v":""},0,0,0,0,0,0,0,0,0,0,0,0,0,0,0,0,0,0,0,0,0,0,0,0,0,0,0,0,0,0,0,0,0,0,0]
[null,{"$f":"IF(OFFSET('Taula Concentrats'!$A$1,C12,0,1,1)=0,\"\",OFFSET('Taula Concentrats'!$A$1,C12,0,1,1))","v":"Soja tortó 44"},48,{"$f":"OFFSET('Taula Concentrats'!$A$1,$C12,$D$2,1,1)","v":87.2},{"$f":"OFFSET('Taula Concentrats'!$A$1,$C12,$E$2,1,1)","v":0},{"$f":"OFFSET('Taula Concentrats'!$A$1,$C12,$F$2,1,1)","v":1.1597938319839582},{"$f":"OFFSET('Taula Concentrats'!$A$1,$C12,$G$2,1,1)","v":207.06952650471396},{"$f":"OFFSET('Taula Concentrats'!$A$1,$C12,$H$2,1,1)","v":219.17261164349998},{"$f":"OFFSET('Taula Concentrats'!$A$1,$C12,$I$2,1,1)","v":2},{"$f":"OFFSET('Taula Concentrats'!$A$1,$C12,$J$2,1,1)","v":3.4},{"$f":"OFFSET('Taula Concentrats'!$A$1,$C12,$K$2,1,1)","v":7},{"$f":"OFFSET('Taula Concentrats'!$A$1,$C12,$L$2,1,1)","v":2.7},{"$f":"OFFSET('Taula Concentrats'!$A$1,$C12,$M$2,1,1)","v":20},{"$f":"OFFSET('Taula Concentrats'!$A$1,$C12,$N$2,1,1)","v":1.95},{"$f":"OFFSET('Taula Concentrats'!$A$1,$C12,$O$2,1,1)","v":0},{"$f":"OFFSET('Taula Concentrats'!$A$1,$C12,$P$2,1,1)","v":0},{"$f":"OFFSET('Taula Concentrats'!$A$1,$C12,$Q$2,1,1)","v":0.3},{"$f":"OFFSET('Taula Concentrats'!$A$1,$C12,$R$2,1,1)","v":17.100000000000001},{"$f":"OFFSET('Taula Concentrats'!$A$1,$C12,$S$2,1,1)","v":43.7},{"$f":"OFFSET('Taula Concentrats'!$A$1,$C12,$T$2,1,1)","v":54.6},{"$f":"OFFSET('Taula Concentrats'!$A$1,$C12,$U$2,1,1)","v":0},{"$f":"OFFSET('Taula Concentrats'!$A$1,$C12,$V$2,1,1)","v":0.2},{"$f":"OFFSET('Taula Concentrats'!$A$1,$C12,$W$2,1,1)","v":0},{"$f":"OFFSET('Taula Concentrats'!$A$1,$C12,$X$2,1,1)","v":0},{"$f":"OFFSET('Taula Concentrats'!$A$1,$C12,$Y$2,1,1)","v":7},{"$f":"OFFSET('Taula Concentrats'!$A$1,$C12,$Z$2,1,1)","v":16.5},{"$f":"OFFSET('Taula Concentrats'!$A$1,$C12,$AA$2,1,1)","v":488},{"$f":"OFFSET('Taula Concentrats'!$A$1,$C12,$AB$2,1,1)","v":153.41999795655397},{"$f":"OFFSET('Taula Concentrats'!$A$1,$C12,$AC$2,1,1)","v":0.84965499999999994},{"$f":"OFFSET('Taula Concentrats'!$A$1,$C12,$AD$2,1,1)","v":779.13363500000003},{"$f":"OFFSET('Taula Concentrats'!$A$1,$C12,$AE$2,1,1)","v":22},{"$f":"OFFSET('Taula Concentrats'!$A$1,$C12,$AF$2,1,1)","v":84},{"$f":"OFFSET('Taula Concentrats'!$A$1,$C12,$AG$2,1,1)","v":163},{"$f":"OFFSET('Taula Concentrats'!$A$1,$C12,$AH$2,1,1)","v":104},{"$f":"OFFSET('Taula Concentrats'!$A$1,$C12,$AI$2,1,1)","v":8},{"$f":"OFFSET('Taula Concentrats'!$A$1,$C12,$AJ$2,1,1)","v":83},{"$f":"OFFSET('Taula Concentrats'!$A$1,$C12,$AK$2,1,1)","v":2.2999999999999998},{"$f":"OFFSET('Taula Concentrats'!$A$1,$C12,$AL$2,1,1)","v":0.68199960346033861},{"$f":"OFFSET('Taula Concentrats'!$A$1,$C12,$AM$2,1,1)","v":601.94944148864533},{"$f":"IF('II_Plantejar Ració'!$E13>0,IF(CàlculsEV!E12>=0,1,\"No\"),\"\")","v":""},{"$f":"IF('II_Plantejar Ració'!$E13>0,IF(CàlculsEV!F12>0,1,\"No\"),\"\")","v":""},{"$f":"IF('II_Plantejar Ració'!$E13>0,IF(CàlculsEV!G12>0,1,\"No\"),\"\")","v":""},{"$f":"IF('II_Plantejar Ració'!$E13>0,IF(CàlculsEV!H12=0,\"No\",1),\"\")","v":""},{"$f":"IF('II_Plantejar Ració'!$E13>0,IF(CàlculsEV!I12>0,1,\"No\"),\"\")","v":""},{"$f":"IF('II_Plantejar Ració'!$E13>0,IF(CàlculsEV!J12>0,1,\"No\"),\"\")","v":""},{"$f":"IF('II_Plantejar Ració'!$E13>0,IF(CàlculsEV!K12>0,1,\"No\"),\"\")","v":""},{"$f":"IF('II_Plantejar Ració'!$E13>0,IF(CàlculsEV!L12>0,1,\"No\"),\"\")","v":""},{"$f":"IF('II_Plantejar Ració'!$E13>0,IF(CàlculsEV!M12>0,1,\"No\"),\"\")","v":""},{"$f":"IF('II_Plantejar Ració'!$E13>0,IF(CàlculsEV!N12>0,1,\"No\"),\"\")","v":""},{"$f":"IF('II_Plantejar Ració'!$E13>0,IF(CàlculsEV!O12>0,1,\"No\"),\"\")","v":""},{"$f":"IF('II_Plantejar Ració'!$E13>0,IF(CàlculsEV!P12>0,1,\"No\"),\"\")","v":""},{"$f":"IF('II_Plantejar Ració'!$E13>0,IF(CàlculsEV!Q12>0,1,\"No\"),\"\")","v":""},{"$f":"IF('II_Plantejar Ració'!$E13>0,IF(CàlculsEV!R12>0,1,\"No\"),\"\")","v":""},{"$f":"IF('II_Plantejar Ració'!$E13>0,IF(CàlculsEV!S12>0,1,\"No\"),\"\")","v":""},{"$f":"IF('II_Plantejar Ració'!$E13>0,IF(CàlculsEV!T12>0,1,\"No\"),\"\")","v":""},{"$f":"IF('II_Plantejar Ració'!$E13>0,IF(CàlculsEV!U12>0,1,\"No\"),\"\")","v":""},{"$f":"IF('II_Plantejar Ració'!$E13>0,IF(CàlculsEV!V12>0,1,\"No\"),\"\")","v":""},{"$f":"IF('II_Plantejar Ració'!$E13>0,IF(CàlculsEV!W12>0,1,\"No\"),\"\")","v":""},{"$f":"IF('II_Plantejar Ració'!$E13>0,IF(CàlculsEV!X12>0,1,\"No\"),\"\")","v":""},{"$f":"IF('II_Plantejar Ració'!$E13>0,IF(CàlculsEV!Y12>0,1,\"No\"),\"\")","v":""},{"$f":"IF('II_Plantejar Ració'!$E13>0,IF(CàlculsEV!Z12>0,1,\"No\"),\"\")","v":""},{"$f":"IF('II_Plantejar Ració'!$E13>0,IF(CàlculsEV!AA12>0,1,\"No\"),\"\")","v":""},{"$f":"IF('II_Plantejar Ració'!$E13>0,IF(CàlculsEV!AB12>0,1,\"No\"),\"\")","v":""},{"$f":"IF('II_Plantejar Ració'!$E13>0,IF(CàlculsEV!AC12>0,1,\"No\"),\"\")","v":""},{"$f":"IF('II_Plantejar Ració'!$E13>0,IF(CàlculsEV!AD12>0,1,\"No\"),\"\")","v":""},{"$f":"IF('II_Plantejar Ració'!$E13>0,IF(CàlculsEV!AE12>0,1,\"No\"),\"\")","v":""},{"$f":"IF('II_Plantejar Ració'!$E13>0,IF(CàlculsEV!AF12>0,1,\"No\"),\"\")","v":""},{"$f":"IF('II_Plantejar Ració'!$E13>0,IF(CàlculsEV!AG12>0,1,\"No\"),\"\")","v":""},{"$f":"IF('II_Plantejar Ració'!$E13>0,IF(CàlculsEV!AH12>0,1,\"No\"),\"\")","v":""},{"$f":"IF('II_Plantejar Ració'!$E13>0,IF(CàlculsEV!AI12>0,1,\"No\"),\"\")","v":""},{"$f":"IF('II_Plantejar Ració'!$E13>0,IF(CàlculsEV!AJ12>0,1,\"No\"),\"\")","v":""},{"$f":"IF('II_Plantejar Ració'!$E13>0,IF(CàlculsEV!AK12>0,1,\"No\"),\"\")","v":""},{"$f":"IF('II_Plantejar Ració'!$E13>0,IF(CàlculsEV!AL12>0,1,\"No\"),\"\")","v":""},{"$f":"IF('II_Plantejar Ració'!$E13>0,IF(CàlculsEV!AM12>0,1,\"No\"),\"\")","v":""},0,0,0,0,0,0,0,0,0,0,0,0,0,0,0,0,0,0,0,0,0,0,0,0,0,0,0,0,0,0,0,0,0,0,0]
[null,{"$f":"IF(OFFSET('Taula Concentrats'!$A$1,C13,0,1,1)=0,\"\",OFFSET('Taula Concentrats'!$A$1,C13,0,1,1))","v":"Mandioca"},78,{"$f":"OFFSET('Taula Concentrats'!$A$1,$C13,$D$2,1,1)","v":85},{"$f":"OFFSET('Taula Concentrats'!$A$1,$C13,$E$2,1,1)","v":0},{"$f":"OFFSET('Taula Concentrats'!$A$1,$C13,$F$2,1,1)","v":1.1744543546403801},{"$f":"OFFSET('Taula Concentrats'!$A$1,$C13,$G$2,1,1)","v":75.490022489380621},{"$f":"OFFSET('Taula Concentrats'!$A$1,$C13,$H$2,1,1)","v":-97.453437442000009},{"$f":"OFFSET('Taula Concentrats'!$A$1,$C13,$I$2,1,1)","v":2},{"$f":"OFFSET('Taula Concentrats'!$A$1,$C13,$J$2,1,1)","v":2.5},{"$f":"OFFSET('Taula Concentrats'!$A$1,$C13,$K$2,1,1)","v":1},{"$f":"OFFSET('Taula Concentrats'!$A$1,$C13,$L$2,1,1)","v":0.9},{"$f":"OFFSET('Taula Concentrats'!$A$1,$C13,$M$2,1,1)","v":7.5},{"$f":"OFFSET('Taula Concentrats'!$A$1,$C13,$N$2,1,1)","v":0.35},{"$f":"OFFSET('Taula Concentrats'!$A$1,$C13,$O$2,1,1)","v":0},{"$f":"OFFSET('Taula Concentrats'!$A$1,$C13,$P$2,1,1)","v":0},{"$f":"OFFSET('Taula Concentrats'!$A$1,$C13,$Q$2,1,1)","v":0},{"$f":"OFFSET('Taula Concentrats'!$A$1,$C13,$R$2,1,1)","v":2},{"$f":"OFFSET('Taula Concentrats'!$A$1,$C13,$S$2,1,1)","v":5},{"$f":"OFFSET('Taula Concentrats'!$A$1,$C13,$T$2,1,1)","v":30},{"$f":"OFFSET('Taula Concentrats'!$A$1,$C13,$U$2,1,1)","v":0},{"$f":"OFFSET('Taula Concentrats'!$A$1,$C13,$V$2,1,1)","v":0},{"$f":"OFFSET('Taula Concentrats'!$A$1,$C13,$W$2,1,1)","v":0},{"$f":"OFFSET('Taula Concentrats'!$A$1,$C13,$X$2,1,1)","v":0},{"$f":"OFFSET('Taula Concentrats'!$A$1,$C13,$Y$2,1,1)","v":0},{"$f":"OFFSET('Taula Concentrats'!$A$1,$C13,$Z$2,1,1)","v":6.56},{"$f":"OFFSET('Taula Concentrats'!$A$1,$C13,$AA$2,1,1)","v":31},{"$f":"OFFSET('Taula Concentrats'!$A$1,$C13,$AB$2,1,1)","v":10.1054225265006},{"$f":"OFFSET('Taula Concentrats'!$A$1,$C13,$AC$2,1,1)","v":0.91761999999999999},{"$f":"OFFSET('Taula Concentrats'!$A$1,$C13,$AD$2,1,1)","v":861.64517999999998},{"$f":"OFFSET('Taula Concentrats'!$A$1,$C13,$AE$2,1,1)","v":8.1999999999999993},{"$f":"OFFSET('Taula Concentrats'!$A$1,$C13,$AF$2,1,1)","v":54},{"$f":"OFFSET('Taula Concentrats'!$A$1,$C13,$AG$2,1,1)","v":118},{"$f":"OFFSET('Taula Concentrats'!$A$1,$C13,$AH$2,1,1)","v":59},{"$f":"OFFSET('Taula Concentrats'!$A$1,$C13,$AI$2,1,1)","v":14.01},{"$f":"OFFSET('Taula Concentrats'!$A$1,$C13,$AJ$2,1,1)","v":61},{"$f":"OFFSET('Taula Concentrats'!$A$1,$C13,$AK$2,1,1)","v":0},{"$f":"OFFSET('Taula Concentrats'!$A$1,$C13,$AL$2,1,1)","v":0.63899949400537248},{"$f":"OFFSET('Taula Concentrats'!$A$1,$C13,$AM$2,1,1)","v":842.25416431416647},{"$f":"IF('II_Plantejar Ració'!$E14>0,IF(CàlculsEV!E13>=0,1,\"No\"),\"\")","v":""},{"$f":"IF('II_Plantejar Ració'!$E14>0,IF(CàlculsEV!F13>0,1,\"No\"),\"\")","v":""},{"$f":"IF('II_Plantejar Ració'!$E14>0,IF(CàlculsEV!G13>0,1,\"No\"),\"\")","v":""},{"$f":"IF('II_Plantejar Ració'!$E14>0,IF(CàlculsEV!H13=0,\"No\",1),\"\")","v":""},{"$f":"IF('II_Plantejar Ració'!$E14>0,IF(CàlculsEV!I13>0,1,\"No\"),\"\")","v":""},{"$f":"IF('II_Plantejar Ració'!$E14>0,IF(CàlculsEV!J13>0,1,\"No\"),\"\")","v":""},{"$f":"IF('II_Plantejar Ració'!$E14>0,IF(CàlculsEV!K13>0,1,\"No\"),\"\")","v":""},{"$f":"IF('II_Plantejar Ració'!$E14>0,IF(CàlculsEV!L13>0,1,\"No\"),\"\")","v":""},{"$f":"IF('II_Plantejar Ració'!$E14>0,IF(CàlculsEV!M13>0,1,\"No\"),\"\")","v":""},{"$f":"IF('II_Plantejar Ració'!$E14>0,IF(CàlculsEV!N13>0,1,\"No\"),\"\")","v":""},{"$f":"IF('II_Plantejar Ració'!$E14>0,IF(CàlculsEV!O13>0,1,\"No\"),\"\")","v":""},{"$f":"IF('II_Plantejar Ració'!$E14>0,IF(CàlculsEV!P13>0,1,\"No\"),\"\")","v":""},{"$f":"IF('II_Plantejar Ració'!$E14>0,IF(CàlculsEV!Q13>0,1,\"No\"),\"\")","v":""},{"$f":"IF('II_Plantejar Ració'!$E14>0,IF(CàlculsEV!R13>0,1,\"No\"),\"\")","v":""},{"$f":"IF('II_Plantejar Ració'!$E14>0,IF(CàlculsEV!S13>0,1,\"No\"),\"\")","v":""},{"$f":"IF('II_Plantejar Ració'!$E14>0,IF(CàlculsEV!T13>0,1,\"No\"),\"\")","v":""},{"$f":"IF('II_Plantejar Ració'!$E14>0,IF(CàlculsEV!U13>0,1,\"No\"),\"\")","v":""},{"$f":"IF('II_Plantejar Ració'!$E14>0,IF(CàlculsEV!V13>0,1,\"No\"),\"\")","v":""},{"$f":"IF('II_Plantejar Ració'!$E14>0,IF(CàlculsEV!W13>0,1,\"No\"),\"\")","v":""},{"$f":"IF('II_Plantejar Ració'!$E14>0,IF(CàlculsEV!X13>0,1,\"No\"),\"\")","v":""},{"$f":"IF('II_Plantejar Ració'!$E14>0,IF(CàlculsEV!Y13>0,1,\"No\"),\"\")","v":""},{"$f":"IF('II_Plantejar Ració'!$E14>0,IF(CàlculsEV!Z13>0,1,\"No\"),\"\")","v":""},{"$f":"IF('II_Plantejar Ració'!$E14>0,IF(CàlculsEV!AA13>0,1,\"No\"),\"\")","v":""},{"$f":"IF('II_Plantejar Ració'!$E14>0,IF(CàlculsEV!AB13>0,1,\"No\"),\"\")","v":""},{"$f":"IF('II_Plantejar Ració'!$E14>0,IF(CàlculsEV!AC13>0,1,\"No\"),\"\")","v":""},{"$f":"IF('II_Plantejar Ració'!$E14>0,IF(CàlculsEV!AD13>0,1,\"No\"),\"\")","v":""},{"$f":"IF('II_Plantejar Ració'!$E14>0,IF(CàlculsEV!AE13>0,1,\"No\"),\"\")","v":""},{"$f":"IF('II_Plantejar Ració'!$E14>0,IF(CàlculsEV!AF13>0,1,\"No\"),\"\")","v":""},{"$f":"IF('II_Plantejar Ració'!$E14>0,IF(CàlculsEV!AG13>0,1,\"No\"),\"\")","v":""},{"$f":"IF('II_Plantejar Ració'!$E14>0,IF(CàlculsEV!AH13>0,1,\"No\"),\"\")","v":""},{"$f":"IF('II_Plantejar Ració'!$E14>0,IF(CàlculsEV!AI13>0,1,\"No\"),\"\")","v":""},{"$f":"IF('II_Plantejar Ració'!$E14>0,IF(CàlculsEV!AJ13>0,1,\"No\"),\"\")","v":""},{"$f":"IF('II_Plantejar Ració'!$E14>0,IF(CàlculsEV!AK13>0,1,\"No\"),\"\")","v":""},{"$f":"IF('II_Plantejar Ració'!$E14>0,IF(CàlculsEV!AL13>0,1,\"No\"),\"\")","v":""},{"$f":"IF('II_Plantejar Ració'!$E14>0,IF(CàlculsEV!AM13>0,1,\"No\"),\"\")","v":""},0,0,0,0,0,0,0,0,0,0,0,0,0,0,0,0,0,0,0,0,0,0,0,0,0,0,0,0,0,0,0,0,0,0,0]
[null,{"$f":"IF(OFFSET('Taula Concentrats'!$A$1,C14,0,1,1)=0,\"\",OFFSET('Taula Concentrats'!$A$1,C14,0,1,1))","v":"Ordi bagàs cerveseria sec"},24,{"$f":"OFFSET('Taula Concentrats'!$A$1,$C14,$D$2,1,1)","v":91.9},{"$f":"OFFSET('Taula Concentrats'!$A$1,$C14,$E$2,1,1)","v":0},{"$f":"OFFSET('Taula Concentrats'!$A$1,$C14,$F$2,1,1)","v":0.78054262949459352},{"$f":"OFFSET('Taula Concentrats'!$A$1,$C14,$G$2,1,1)","v":151.63839868082431},{"$f":"OFFSET('Taula Concentrats'!$A$1,$C14,$H$2,1,1)","v":35.094428351199994},{"$f":"OFFSET('Taula Concentrats'!$A$1,$C14,$I$2,1,1)","v":2},{"$f":"OFFSET('Taula Concentrats'!$A$1,$C14,$J$2,1,1)","v":2.2999999999999998},{"$f":"OFFSET('Taula Concentrats'!$A$1,$C14,$K$2,1,1)","v":6.3},{"$f":"OFFSET('Taula Concentrats'!$A$1,$C14,$L$2,1,1)","v":0},{"$f":"OFFSET('Taula Concentrats'!$A$1,$C14,$M$2,1,1)","v":0},{"$f":"OFFSET('Taula Concentrats'!$A$1,$C14,$N$2,1,1)","v":0},{"$f":"OFFSET('Taula Concentrats'!$A$1,$C14,$O$2,1,1)","v":0},{"$f":"OFFSET('Taula Concentrats'!$A$1,$C14,$P$2,1,1)","v":0},{"$f":"OFFSET('Taula Concentrats'!$A$1,$C14,$Q$2,1,1)","v":0.08},{"$f":"OFFSET('Taula Concentrats'!$A$1,$C14,$R$2,1,1)","v":22.2},{"$f":"OFFSET('Taula Concentrats'!$A$1,$C14,$S$2,1,1)","v":38.5},{"$f":"OFFSET('Taula Concentrats'!$A$1,$C14,$T$2,1,1)","v":85},{"$f":"OFFSET('Taula Concentrats'!$A$1,$C14,$U$2,1,1)","v":0},{"$f":"OFFSET('Taula Concentrats'!$A$1,$C14,$V$2,1,1)","v":0.06},{"$f":"OFFSET('Taula Concentrats'!$A$1,$C14,$W$2,1,1)","v":0},{"$f":"OFFSET('Taula Concentrats'!$A$1,$C14,$X$2,1,1)","v":0},{"$f":"OFFSET('Taula Concentrats'!$A$1,$C14,$Y$2,1,1)","v":29},{"$f":"OFFSET('Taula Concentrats'!$A$1,$C14,$Z$2,1,1)","v":35.955000000000005},{"$f":"OFFSET('Taula Concentrats'!$A$1,$C14,$AA$2,1,1)","v":262.39999999999998},{"$f":"OFFSET('Taula Concentrats'!$A$1,$C14,$AB$2,1,1)","v":107.61563282559231},{"$f":"OFFSET('Taula Concentrats'!$A$1,$C14,$AC$2,1,1)","v":0.62731999999999999},{"$f":"OFFSET('Taula Concentrats'!$A$1,$C14,$AD$2,1,1)","v":601.34895199999994},{"$f":"OFFSET('Taula Concentrats'!$A$1,$C14,$AE$2,1,1)","v":79.900000000000006},{"$f":"OFFSET('Taula Concentrats'!$A$1,$C14,$AF$2,1,1)","v":161.6},{"$f":"OFFSET('Taula Concentrats'!$A$1,$C14,$AG$2,1,1)","v":643.29999999999995},{"$f":"OFFSET('Taula Concentrats'!$A$1,$C14,$AH$2,1,1)","v":236.4},{"$f":"OFFSET('Taula Concentrats'!$A$1,$C14,$AI$2,1,1)","v":78.899999999999991},{"$f":"OFFSET('Taula Concentrats'!$A$1,$C14,$AJ$2,1,1)","v":41.4},{"$f":"OFFSET('Taula Concentrats'!$A$1,$C14,$AK$2,1,1)","v":0.5},{"$f":"OFFSET('Taula Concentrats'!$A$1,$C14,$AL$2,1,1)","v":0.53718506650710496},{"$f":"OFFSET('Taula Concentrats'!$A$1,$C14,$AM$2,1,1)","v":400.00631345146428},{"$f":"IF('II_Plantejar Ració'!$E15>0,IF(CàlculsEV!E14>=0,1,\"No\"),\"\")","v":""},{"$f":"IF('II_Plantejar Ració'!$E15>0,IF(CàlculsEV!F14>0,1,\"No\"),\"\")","v":""},{"$f":"IF('II_Plantejar Ració'!$E15>0,IF(CàlculsEV!G14>0,1,\"No\"),\"\")","v":""},{"$f":"IF('II_Plantejar Ració'!$E15>0,IF(CàlculsEV!H14=0,\"No\",1),\"\")","v":""},{"$f":"IF('II_Plantejar Ració'!$E15>0,IF(CàlculsEV!I14>0,1,\"No\"),\"\")","v":""},{"$f":"IF('II_Plantejar Ració'!$E15>0,IF(CàlculsEV!J14>0,1,\"No\"),\"\")","v":""},{"$f":"IF('II_Plantejar Ració'!$E15>0,IF(CàlculsEV!K14>0,1,\"No\"),\"\")","v":""},{"$f":"IF('II_Plantejar Ració'!$E15>0,IF(CàlculsEV!L14>0,1,\"No\"),\"\")","v":""},{"$f":"IF('II_Plantejar Ració'!$E15>0,IF(CàlculsEV!M14>0,1,\"No\"),\"\")","v":""},{"$f":"IF('II_Plantejar Ració'!$E15>0,IF(CàlculsEV!N14>0,1,\"No\"),\"\")","v":""},{"$f":"IF('II_Plantejar Ració'!$E15>0,IF(CàlculsEV!O14>0,1,\"No\"),\"\")","v":""},{"$f":"IF('II_Plantejar Ració'!$E15>0,IF(CàlculsEV!P14>0,1,\"No\"),\"\")","v":""},{"$f":"IF('II_Plantejar Ració'!$E15>0,IF(CàlculsEV!Q14>0,1,\"No\"),\"\")","v":""},{"$f":"IF('II_Plantejar Ració'!$E15>0,IF(CàlculsEV!R14>0,1,\"No\"),\"\")","v":""},{"$f":"IF('II_Plantejar Ració'!$E15>0,IF(CàlculsEV!S14>0,1,\"No\"),\"\")","v":""},{"$f":"IF('II_Plantejar Ració'!$E15>0,IF(CàlculsEV!T14>0,1,\"No\"),\"\")","v":""},{"$f":"IF('II_Plantejar Ració'!$E15>0,IF(CàlculsEV!U14>0,1,\"No\"),\"\")","v":""},{"$f":"IF('II_Plantejar Ració'!$E15>0,IF(CàlculsEV!V14>0,1,\"No\"),\"\")","v":""},{"$f":"IF('II_Plantejar Ració'!$E15>0,IF(CàlculsEV!W14>0,1,\"No\"),\"\")","v":""},{"$f":"IF('II_Plantejar Ració'!$E15>0,IF(CàlculsEV!X14>0,1,\"No\"),\"\")","v":""},{"$f":"IF('II_Plantejar Ració'!$E15>0,IF(CàlculsEV!Y14>0,1,\"No\"),\"\")","v":""},{"$f":"IF('II_Plantejar Ració'!$E15>0,IF(CàlculsEV!Z14>0,1,\"No\"),\"\")","v":""},{"$f":"IF('II_Plantejar Ració'!$E15>0,IF(CàlculsEV!AA14>0,1,\"No\"),\"\")","v":""},{"$f":"IF('II_Plantejar Ració'!$E15>0,IF(CàlculsEV!AB14>0,1,\"No\"),\"\")","v":""},{"$f":"IF('II_Plantejar Ració'!$E15>0,IF(CàlculsEV!AC14>0,1,\"No\"),\"\")","v":""},{"$f":"IF('II_Plantejar Ració'!$E15>0,IF(CàlculsEV!AD14>0,1,\"No\"),\"\")","v":""},{"$f":"IF('II_Plantejar Ració'!$E15>0,IF(CàlculsEV!AE14>0,1,\"No\"),\"\")","v":""},{"$f":"IF('II_Plantejar Ració'!$E15>0,IF(CàlculsEV!AF14>0,1,\"No\"),\"\")","v":""},{"$f":"IF('II_Plantejar Ració'!$E15>0,IF(CàlculsEV!AG14>0,1,\"No\"),\"\")","v":""},{"$f":"IF('II_Plantejar Ració'!$E15>0,IF(CàlculsEV!AH14>0,1,\"No\"),\"\")","v":""},{"$f":"IF('II_Plantejar Ració'!$E15>0,IF(CàlculsEV!AI14>0,1,\"No\"),\"\")","v":""},{"$f":"IF('II_Plantejar Ració'!$E15>0,IF(CàlculsEV!AJ14>0,1,\"No\"),\"\")","v":""},{"$f":"IF('II_Plantejar Ració'!$E15>0,IF(CàlculsEV!AK14>0,1,\"No\"),\"\")","v":""},{"$f":"IF('II_Plantejar Ració'!$E15>0,IF(CàlculsEV!AL14>0,1,\"No\"),\"\")","v":""},{"$f":"IF('II_Plantejar Ració'!$E15>0,IF(CàlculsEV!AM14>0,1,\"No\"),\"\")","v":""},0,0,0,0,0,0,0,0,0,0,0,0,0,0,0,0,0,0,0,0,0,0,0,0,0,0,0,0,0,0,0,0,0,0,0]
[null,{"$f":"IF(OFFSET('Taula Concentrats'!$A$1,C15,0,1,1)=0,\"\",OFFSET('Taula Concentrats'!$A$1,C15,0,1,1))","v":"Cotó, gra"},34,{"$f":"OFFSET('Taula Concentrats'!$A$1,$C15,$D$2,1,1)","v":92},{"$f":"OFFSET('Taula Concentrats'!$A$1,$C15,$E$2,1,1)","v":0},{"$f":"OFFSET('Taula Concentrats'!$A$1,$C15,$F$2,1,1)","v":1.0271553531490456},{"$f":"OFFSET('Taula Concentrats'!$A$1,$C15,$G$2,1,1)","v":91.654792821464014},{"$f":"OFFSET('Taula Concentrats'!$A$1,$C15,$H$2,1,1)","v":70.583837883999976},{"$f":"OFFSET('Taula Concentrats'!$A$1,$C15,$I$2,1,1)","v":2},{"$f":"OFFSET('Taula Concentrats'!$A$1,$C15,$J$2,1,1)","v":2.1},{"$f":"OFFSET('Taula Concentrats'!$A$1,$C15,$K$2,1,1)","v":6.4},{"$f":"OFFSET('Taula Concentrats'!$A$1,$C15,$L$2,1,1)","v":0},{"$f":"OFFSET('Taula Concentrats'!$A$1,$C15,$M$2,1,1)","v":0},{"$f":"OFFSET('Taula Concentrats'!$A$1,$C15,$N$2,1,1)","v":0},{"$f":"OFFSET('Taula Concentrats'!$A$1,$C15,$O$2,1,1)","v":0},{"$f":"OFFSET('Taula Concentrats'!$A$1,$C15,$P$2,1,1)","v":0},{"$f":"OFFSET('Taula Concentrats'!$A$1,$C15,$Q$2,1,1)","v":0},{"$f":"OFFSET('Taula Concentrats'!$A$1,$C15,$R$2,1,1)","v":0},{"$f":"OFFSET('Taula Concentrats'!$A$1,$C15,$S$2,1,1)","v":0},{"$f":"OFFSET('Taula Concentrats'!$A$1,$C15,$T$2,1,1)","v":0},{"$f":"OFFSET('Taula Concentrats'!$A$1,$C15,$U$2,1,1)","v":0},{"$f":"OFFSET('Taula Concentrats'!$A$1,$C15,$V$2,1,1)","v":0},{"$f":"OFFSET('Taula Concentrats'!$A$1,$C15,$W$2,1,1)","v":0},{"$f":"OFFSET('Taula Concentrats'!$A$1,$C15,$X$2,1,1)","v":0},{"$f":"OFFSET('Taula Concentrats'!$A$1,$C15,$Y$2,1,1)","v":0},{"$f":"OFFSET('Taula Concentrats'!$A$1,$C15,$Z$2,1,1)","v":188.1},{"$f":"OFFSET('Taula Concentrats'!$A$1,$C15,$AA$2,1,1)","v":220},{"$f":"OFFSET('Taula Concentrats'!$A$1,$C15,$AB$2,1,1)","v":48.764449067224007},{"$f":"OFFSET('Taula Concentrats'!$A$1,$C15,$AC$2,1,1)","v":0.64651999999999998},{"$f":"OFFSET('Taula Concentrats'!$A$1,$C15,$AD$2,1,1)","v":618.71964000000003},{"$f":"OFFSET('Taula Concentrats'!$A$1,$C15,$AE$2,1,1)","v":198},{"$f":"OFFSET('Taula Concentrats'!$A$1,$C15,$AF$2,1,1)","v":276},{"$f":"OFFSET('Taula Concentrats'!$A$1,$C15,$AG$2,1,1)","v":456},{"$f":"OFFSET('Taula Concentrats'!$A$1,$C15,$AH$2,1,1)","v":354},{"$f":"OFFSET('Taula Concentrats'!$A$1,$C15,$AI$2,1,1)","v":105},{"$f":"OFFSET('Taula Concentrats'!$A$1,$C15,$AJ$2,1,1)","v":43},{"$f":"OFFSET('Taula Concentrats'!$A$1,$C15,$AK$2,1,1)","v":0},{"$f":"OFFSET('Taula Concentrats'!$A$1,$C15,$AL$2,1,1)","v":0.73941085414823005},{"$f":"OFFSET('Taula Concentrats'!$A$1,$C15,$AM$2,1,1)","v":363.39002791261066},{"$f":"IF('II_Plantejar Ració'!$E16>0,IF(CàlculsEV!E15>=0,1,\"No\"),\"\")","v":""},{"$f":"IF('II_Plantejar Ració'!$E16>0,IF(CàlculsEV!F15>0,1,\"No\"),\"\")","v":""},{"$f":"IF('II_Plantejar Ració'!$E16>0,IF(CàlculsEV!G15>0,1,\"No\"),\"\")","v":""},{"$f":"IF('II_Plantejar Ració'!$E16>0,IF(CàlculsEV!H15=0,\"No\",1),\"\")","v":""},{"$f":"IF('II_Plantejar Ració'!$E16>0,IF(CàlculsEV!I15>0,1,\"No\"),\"\")","v":""},{"$f":"IF('II_Plantejar Ració'!$E16>0,IF(CàlculsEV!J15>0,1,\"No\"),\"\")","v":""},{"$f":"IF('II_Plantejar Ració'!$E16>0,IF(CàlculsEV!K15>0,1,\"No\"),\"\")","v":""},{"$f":"IF('II_Plantejar Ració'!$E16>0,IF(CàlculsEV!L15>0,1,\"No\"),\"\")","v":""},{"$f":"IF('II_Plantejar Ració'!$E16>0,IF(CàlculsEV!M15>0,1,\"No\"),\"\")","v":""},{"$f":"IF('II_Plantejar Ració'!$E16>0,IF(CàlculsEV!N15>0,1,\"No\"),\"\")","v":""},{"$f":"IF('II_Plantejar Ració'!$E16>0,IF(CàlculsEV!O15>0,1,\"No\"),\"\")","v":""},{"$f":"IF('II_Plantejar Ració'!$E16>0,IF(CàlculsEV!P15>0,1,\"No\"),\"\")","v":""},{"$f":"IF('II_Plantejar Ració'!$E16>0,IF(CàlculsEV!Q15>0,1,\"No\"),\"\")","v":""},{"$f":"IF('II_Plantejar Ració'!$E16>0,IF(CàlculsEV!R15>0,1,\"No\"),\"\")","v":""},{"$f":"IF('II_Plantejar Ració'!$E16>0,IF(CàlculsEV!S15>0,1,\"No\"),\"\")","v":""},{"$f":"IF('II_Plantejar Ració'!$E16>0,IF(CàlculsEV!T15>0,1,\"No\"),\"\")","v":""},{"$f":"IF('II_Plantejar Ració'!$E16>0,IF(CàlculsEV!U15>0,1,\"No\"),\"\")","v":""},{"$f":"IF('II_Plantejar Ració'!$E16>0,IF(CàlculsEV!V15>0,1,\"No\"),\"\")","v":""},{"$f":"IF('II_Plantejar Ració'!$E16>0,IF(CàlculsEV!W15>0,1,\"No\"),\"\")","v":""},{"$f":"IF('II_Plantejar Ració'!$E16>0,IF(CàlculsEV!X15>0,1,\"No\"),\"\")","v":""},{"$f":"IF('II_Plantejar Ració'!$E16>0,IF(CàlculsEV!Y15>0,1,\"No\"),\"\")","v":""},{"$f":"IF('II_Plantejar Ració'!$E16>0,IF(CàlculsEV!Z15>0,1,\"No\"),\"\")","v":""},{"$f":"IF('II_Plantejar Ració'!$E16>0,IF(CàlculsEV!AA15>0,1,\"No\"),\"\")","v":""},{"$f":"IF('II_Plantejar Ració'!$E16>0,IF(CàlculsEV!AB15>0,1,\"No\"),\"\")","v":""},{"$f":"IF('II_Plantejar Ració'!$E16>0,IF(CàlculsEV!AC15>0,1,\"No\"),\"\")","v":""},{"$f":"IF('II_Plantejar Ració'!$E16>0,IF(CàlculsEV!AD15>0,1,\"No\"),\"\")","v":""},{"$f":"IF('II_Plantejar Ració'!$E16>0,IF(CàlculsEV!AE15>0,1,\"No\"),\"\")","v":""},{"$f":"IF('II_Plantejar Ració'!$E16>0,IF(CàlculsEV!AF15>0,1,\"No\"),\"\")","v":""},{"$f":"IF('II_Plantejar Ració'!$E16>0,IF(CàlculsEV!AG15>0,1,\"No\"),\"\")","v":""},{"$f":"IF('II_Plantejar Ració'!$E16>0,IF(CàlculsEV!AH15>0,1,\"No\"),\"\")","v":""},{"$f":"IF('II_Plantejar Ració'!$E16>0,IF(CàlculsEV!AI15>0,1,\"No\"),\"\")","v":""},{"$f":"IF('II_Plantejar Ració'!$E16>0,IF(CàlculsEV!AJ15>0,1,\"No\"),\"\")","v":""},{"$f":"IF('II_Plantejar Ració'!$E16>0,IF(CàlculsEV!AK15>0,1,\"No\"),\"\")","v":""},{"$f":"IF('II_Plantejar Ració'!$E16>0,IF(CàlculsEV!AL15>0,1,\"No\"),\"\")","v":""},{"$f":"IF('II_Plantejar Ració'!$E16>0,IF(CàlculsEV!AM15>0,1,\"No\"),\"\")","v":""},0,0,0,0,0,0,0,0,0,0,0,0,0,0,0,0,0,0,0,0,0,0,0,0,0,0,0,0,0,0,0,0,0,0,0]
[null,{"$f":"IF(OFFSET('Taula Concentrats'!$A$1,C16,0,1,1)=0,\"\",OFFSET('Taula Concentrats'!$A$1,C16,0,1,1))","v":"Llevat cerveseria"},75,{"$f":"OFFSET('Taula Concentrats'!$A$1,$C16,$D$2,1,1)","v":93.3},{"$f":"OFFSET('Taula Concentrats'!$A$1,$C16,$E$2,1,1)","v":0},{"$f":"OFFSET('Taula Concentrats'!$A$1,$C16,$F$2,1,1)","v":1.17},{"$f":"OFFSET('Taula Concentrats'!$A$1,$C16,$G$2,1,1)","v":143},{"$f":"OFFSET('Taula Concentrats'!$A$1,$C16,$H$2,1,1)","v":278},{"$f":"OFFSET('Taula Concentrats'!$A$1,$C16,$I$2,1,1)","v":2},{"$f":"OFFSET('Taula Concentrats'!$A$1,$C16,$J$2,1,1)","v":3},{"$f":"OFFSET('Taula Concentrats'!$A$1,$C16,$K$2,1,1)","v":13.5},{"$f":"OFFSET('Taula Concentrats'!$A$1,$C16,$L$2,1,1)","v":2.4},{"$f":"OFFSET('Taula Concentrats'!$A$1,$C16,$M$2,1,1)","v":0},{"$f":"OFFSET('Taula Concentrats'!$A$1,$C16,$N$2,1,1)","v":0},{"$f":"OFFSET('Taula Concentrats'!$A$1,$C16,$O$2,1,1)","v":0},{"$f":"OFFSET('Taula Concentrats'!$A$1,$C16,$P$2,1,1)","v":0},{"$f":"OFFSET('Taula Concentrats'!$A$1,$C16,$Q$2,1,1)","v":0},{"$f":"OFFSET('Taula Concentrats'!$A$1,$C16,$R$2,1,1)","v":0},{"$f":"OFFSET('Taula Concentrats'!$A$1,$C16,$S$2,1,1)","v":0},{"$f":"OFFSET('Taula Concentrats'!$A$1,$C16,$T$2,1,1)","v":0},{"$f":"OFFSET('Taula Concentrats'!$A$1,$C16,$U$2,1,1)","v":0},{"$f":"OFFSET('Taula Concentrats'!$A$1,$C16,$V$2,1,1)","v":0},{"$f":"OFFSET('Taula Concentrats'!$A$1,$C16,$W$2,1,1)","v":0},{"$f":"OFFSET('Taula Concentrats'!$A$1,$C16,$X$2,1,1)","v":0},{"$f":"OFFSET('Taula Concentrats'!$A$1,$C16,$Y$2,1,1)","v":0},{"$f":"OFFSET('Taula Concentrats'!$A$1,$C16,$Z$2,1,1)","v":32},{"$f":"OFFSET('Taula Concentrats'!$A$1,$C16,$AA$2,1,1)","v":476},{"$f":"OFFSET('Taula Concentrats'!$A$1,$C16,$AB$2,1,1)","v":87},{"$f":"OFFSET('Taula Concentrats'!$A$1,$C16,$AC$2,1,1)","v":0.84},{"$f":"OFFSET('Taula Concentrats'!$A$1,$C16,$AD$2,1,1)","v":756},{"$f":"OFFSET('Taula Concentrats'!$A$1,$C16,$AE$2,1,1)","v":40},{"$f":"OFFSET('Taula Concentrats'!$A$1,$C16,$AF$2,1,1)","v":21},{"$f":"OFFSET('Taula Concentrats'!$A$1,$C16,$AG$2,1,1)","v":88},{"$f":"OFFSET('Taula Concentrats'!$A$1,$C16,$AH$2,1,1)","v":25},{"$f":"OFFSET('Taula Concentrats'!$A$1,$C16,$AI$2,1,1)","v":7},{"$f":"OFFSET('Taula Concentrats'!$A$1,$C16,$AJ$2,1,1)","v":32},{"$f":"OFFSET('Taula Concentrats'!$A$1,$C16,$AK$2,1,1)","v":0},{"$f":"OFFSET('Taula Concentrats'!$A$1,$C16,$AL$2,1,1)","v":0.81515770697868817},{"$f":"OFFSET('Taula Concentrats'!$A$1,$C16,$AM$2,1,1)","v":628.0150685218556},{"$f":"IF('II_Plantejar Ració'!$E17>0,IF(CàlculsEV!E16>=0,1,\"No\"),\"\")","v":""},{"$f":"IF('II_Plantejar Ració'!$E17>0,IF(CàlculsEV!F16>0,1,\"No\"),\"\")","v":""},{"$f":"IF('II_Plantejar Ració'!$E17>0,IF(CàlculsEV!G16>0,1,\"No\"),\"\")","v":""},{"$f":"IF('II_Plantejar Ració'!$E17>0,IF(CàlculsEV!H16=0,\"No\",1),\"\")","v":""},{"$f":"IF('II_Plantejar Ració'!$E17>0,IF(CàlculsEV!I16>0,1,\"No\"),\"\")","v":""},{"$f":"IF('II_Plantejar Ració'!$E17>0,IF(CàlculsEV!J16>0,1,\"No\"),\"\")","v":""},{"$f":"IF('II_Plantejar Ració'!$E17>0,IF(CàlculsEV!K16>0,1,\"No\"),\"\")","v":""},{"$f":"IF('II_Plantejar Ració'!$E17>0,IF(CàlculsEV!L16>0,1,\"No\"),\"\")","v":""},{"$f":"IF('II_Plantejar Ració'!$E17>0,IF(CàlculsEV!M16>0,1,\"No\"),\"\")","v":""},{"$f":"IF('II_Plantejar Ració'!$E17>0,IF(CàlculsEV!N16>0,1,\"No\"),\"\")","v":""},{"$f":"IF('II_Plantejar Ració'!$E17>0,IF(CàlculsEV!O16>0,1,\"No\"),\"\")","v":""},{"$f":"IF('II_Plantejar Ració'!$E17>0,IF(CàlculsEV!P16>0,1,\"No\"),\"\")","v":""},{"$f":"IF('II_Plantejar Ració'!$E17>0,IF(CàlculsEV!Q16>0,1,\"No\"),\"\")","v":""},{"$f":"IF('II_Plantejar Ració'!$E17>0,IF(CàlculsEV!R16>0,1,\"No\"),\"\")","v":""},{"$f":"IF('II_Plantejar Ració'!$E17>0,IF(CàlculsEV!S16>0,1,\"No\"),\"\")","v":""},{"$f":"IF('II_Plantejar Ració'!$E17>0,IF(CàlculsEV!T16>0,1,\"No\"),\"\")","v":""},{"$f":"IF('II_Plantejar Ració'!$E17>0,IF(CàlculsEV!U16>0,1,\"No\"),\"\")","v":""},{"$f":"IF('II_Plantejar Ració'!$E17>0,IF(CàlculsEV!V16>0,1,\"No\"),\"\")","v":""},{"$f":"IF('II_Plantejar Ració'!$E17>0,IF(CàlculsEV!W16>0,1,\"No\"),\"\")","v":""},{"$f":"IF('II_Plantejar Ració'!$E17>0,IF(CàlculsEV!X16>0,1,\"No\"),\"\")","v":""},{"$f":"IF('II_Plantejar Ració'!$E17>0,IF(CàlculsEV!Y16>0,1,\"No\"),\"\")","v":""},{"$f":"IF('II_Plantejar Ració'!$E17>0,IF(CàlculsEV!Z16>0,1,\"No\"),\"\")","v":""},{"$f":"IF('II_Plantejar Ració'!$E17>0,IF(CàlculsEV!AA16>0,1,\"No\"),\"\")","v":""},{"$f":"IF('II_Plantejar Ració'!$E17>0,IF(CàlculsEV!AB16>0,1,\"No\"),\"\")","v":""},{"$f":"IF('II_Plantejar Ració'!$E17>0,IF(CàlculsEV!AC16>0,1,\"No\"),\"\")","v":""},{"$f":"IF('II_Plantejar Ració'!$E17>0,IF(CàlculsEV!AD16>0,1,\"No\"),\"\")","v":""},{"$f":"IF('II_Plantejar Ració'!$E17>0,IF(CàlculsEV!AE16>0,1,\"No\"),\"\")","v":""},{"$f":"IF('II_Plantejar Ració'!$E17>0,IF(CàlculsEV!AF16>0,1,\"No\"),\"\")","v":""},{"$f":"IF('II_Plantejar Ració'!$E17>0,IF(CàlculsEV!AG16>0,1,\"No\"),\"\")","v":""},{"$f":"IF('II_Plantejar Ració'!$E17>0,IF(CàlculsEV!AH16>0,1,\"No\"),\"\")","v":""},{"$f":"IF('II_Plantejar Ració'!$E17>0,IF(CàlculsEV!AI16>0,1,\"No\"),\"\")","v":""},{"$f":"IF('II_Plantejar Ració'!$E17>0,IF(CàlculsEV!AJ16>0,1,\"No\"),\"\")","v":""},{"$f":"IF('II_Plantejar Ració'!$E17>0,IF(CàlculsEV!AK16>0,1,\"No\"),\"\")","v":""},{"$f":"IF('II_Plantejar Ració'!$E17>0,IF(CàlculsEV!AL16>0,1,\"No\"),\"\")","v":""},{"$f":"IF('II_Plantejar Ració'!$E17>0,IF(CàlculsEV!AM16>0,1,\"No\"),\"\")","v":""},0,0,0,0,0,0,0,0,0,0,0,0,0,0,0,0,0,0,0,0,0,0,0,0,0,0,0,0,0,0,0,0,0,0,0]
[null,{"$f":"IF(OFFSET('Taula Concentrats'!$A$1,C17,0,1,1)=0,\"\",OFFSET('Taula Concentrats'!$A$1,C17,0,1,1))","v":"Grassa vegetal, mantega de porc (tots els tipus)"},74,{"$f":"OFFSET('Taula Concentrats'!$A$1,$C17,$D$2,1,1)","v":99.9},{"$f":"OFFSET('Taula Concentrats'!$A$1,$C17,$E$2,1,1)","v":0},{"$f":"OFFSET('Taula Concentrats'!$A$1,$C17,$F$2,1,1)","v":3.94},{"$f":"OFFSET('Taula Concentrats'!$A$1,$C17,$G$2,1,1)","v":9.9999999999999995E-8},{"$f":"OFFSET('Taula Concentrats'!$A$1,$C17,$H$2,1,1)","v":-14},{"$f":"OFFSET('Taula Concentrats'!$A$1,$C17,$I$2,1,1)","v":2},{"$f":"OFFSET('Taula Concentrats'!$A$1,$C17,$J$2,1,1)","v":9.9999999999999995E-8},{"$f":"OFFSET('Taula Concentrats'!$A$1,$C17,$K$2,1,1)","v":9.9999999999999995E-8},{"$f":"OFFSET('Taula Concentrats'!$A$1,$C17,$L$2,1,1)","v":9.9999999999999995E-8},{"$f":"OFFSET('Taula Concentrats'!$A$1,$C17,$M$2,1,1)","v":9.9999999999999995E-8},{"$f":"OFFSET('Taula Concentrats'!$A$1,$C17,$N$2,1,1)","v":9.9999999999999995E-8},{"$f":"OFFSET('Taula Concentrats'!$A$1,$C17,$O$2,1,1)","v":9.9999999999999995E-8},{"$f":"OFFSET('Taula Concentrats'!$A$1,$C17,$P$2,1,1)","v":9.9999999999999995E-8},{"$f":"OFFSET('Taula Concentrats'!$A$1,$C17,$Q$2,1,1)","v":9.9999999999999995E-8},{"$f":"OFFSET('Taula Concentrats'!$A$1,$C17,$R$2,1,1)","v":9.9999999999999995E-8},{"$f":"OFFSET('Taula Concentrats'!$A$1,$C17,$S$2,1,1)","v":9.9999999999999995E-8},{"$f":"OFFSET('Taula Concentrats'!$A$1,$C17,$T$2,1,1)","v":9.9999999999999995E-8},{"$f":"OFFSET('Taula Concentrats'!$A$1,$C17,$U$2,1,1)","v":9.9999999999999995E-8},{"$f":"OFFSET('Taula Concentrats'!$A$1,$C17,$V$2,1,1)","v":9.9999999999999995E-8},{"$f":"OFFSET('Taula Concentrats'!$A$1,$C17,$W$2,1,1)","v":1300},{"$f":"OFFSET('Taula Concentrats'!$A$1,$C17,$X$2,1,1)","v":9.9999999999999995E-8},{"$f":"OFFSET('Taula Concentrats'!$A$1,$C17,$Y$2,1,1)","v":95},{"$f":"OFFSET('Taula Concentrats'!$A$1,$C17,$Z$2,1,1)","v":999},{"$f":"OFFSET('Taula Concentrats'!$A$1,$C17,$AA$2,1,1)","v":9.9999999999999995E-8},{"$f":"OFFSET('Taula Concentrats'!$A$1,$C17,$AB$2,1,1)","v":9.9999999999999995E-8},{"$f":"OFFSET('Taula Concentrats'!$A$1,$C17,$AC$2,1,1)","v":0.9},{"$f":"OFFSET('Taula Concentrats'!$A$1,$C17,$AD$2,1,1)","v":9.9999999999999995E-8},{"$f":"OFFSET('Taula Concentrats'!$A$1,$C17,$AE$2,1,1)","v":999},{"$f":"OFFSET('Taula Concentrats'!$A$1,$C17,$AF$2,1,1)","v":9.9999999999999995E-8},{"$f":"OFFSET('Taula Concentrats'!$A$1,$C17,$AG$2,1,1)","v":9.9999999999999995E-8},{"$f":"OFFSET('Taula Concentrats'!$A$1,$C17,$AH$2,1,1)","v":9.9999999999999995E-8},{"$f":"OFFSET('Taula Concentrats'!$A$1,$C17,$AI$2,1,1)","v":9.9999999999999995E-8},{"$f":"OFFSET('Taula Concentrats'!$A$1,$C17,$AJ$2,1,1)","v":9.9999999999999995E-8},{"$f":"OFFSET('Taula Concentrats'!$A$1,$C17,$AK$2,1,1)","v":9.9999999999999995E-8},{"$f":"OFFSET('Taula Concentrats'!$A$1,$C17,$AL$2,1,1)","v":0},{"$f":"OFFSET('Taula Concentrats'!$A$1,$C17,$AM$2,1,1)","v":0},{"$f":"IF('II_Plantejar Ració'!$E18>0,IF(CàlculsEV!E17>=0,1,\"No\"),\"\")","v":""},{"$f":"IF('II_Plantejar Ració'!$E18>0,IF(CàlculsEV!F17>0,1,\"No\"),\"\")","v":""},{"$f":"IF('II_Plantejar Ració'!$E18>0,IF(CàlculsEV!G17>0,1,\"No\"),\"\")","v":""},{"$f":"IF('II_Plantejar Ració'!$E18>0,IF(CàlculsEV!H17=0,\"No\",1),\"\")","v":""},{"$f":"IF('II_Plantejar Ració'!$E18>0,IF(CàlculsEV!I17>0,1,\"No\"),\"\")","v":""},{"$f":"IF('II_Plantejar Ració'!$E18>0,IF(CàlculsEV!J17>0,1,\"No\"),\"\")","v":""},{"$f":"IF('II_Plantejar Ració'!$E18>0,IF(CàlculsEV!K17>0,1,\"No\"),\"\")","v":""},{"$f":"IF('II_Plantejar Ració'!$E18>0,IF(CàlculsEV!L17>0,1,\"No\"),\"\")","v":""},{"$f":"IF('II_Plantejar Ració'!$E18>0,IF(CàlculsEV!M17>0,1,\"No\"),\"\")","v":""},{"$f":"IF('II_Plantejar Ració'!$E18>0,IF(CàlculsEV!N17>0,1,\"No\"),\"\")","v":""},{"$f":"IF('II_Plantejar Ració'!$E18>0,IF(CàlculsEV!O17>0,1,\"No\"),\"\")","v":""},{"$f":"IF('II_Plantejar Ració'!$E18>0,IF(CàlculsEV!P17>0,1,\"No\"),\"\")","v":""},{"$f":"IF('II_Plantejar Ració'!$E18>0,IF(CàlculsEV!Q17>0,1,\"No\"),\"\")","v":""},{"$f":"IF('II_Plantejar Ració'!$E18>0,IF(CàlculsEV!R17>0,1,\"No\"),\"\")","v":""},{"$f":"IF('II_Plantejar Ració'!$E18>0,IF(CàlculsEV!S17>0,1,\"No\"),\"\")","v":""},{"$f":"IF('II_Plantejar Ració'!$E18>0,IF(CàlculsEV!T17>0,1,\"No\"),\"\")","v":""},{"$f":"IF('II_Plantejar Ració'!$E18>0,IF(CàlculsEV!U17>0,1,\"No\"),\"\")","v":""},{"$f":"IF('II_Plantejar Ració'!$E18>0,IF(CàlculsEV!V17>0,1,\"No\"),\"\")","v":""},{"$f":"IF('II_Plantejar Ració'!$E18>0,IF(CàlculsEV!W17>0,1,\"No\"),\"\")","v":""},{"$f":"IF('II_Plantejar Ració'!$E18>0,IF(CàlculsEV!X17>0,1,\"No\"),\"\")","v":""},{"$f":"IF('II_Plantejar Ració'!$E18>0,IF(CàlculsEV!Y17>0,1,\"No\"),\"\")","v":""},{"$f":"IF('II_Plantejar Ració'!$E18>0,IF(CàlculsEV!Z17>0,1,\"No\"),\"\")","v":""},{"$f":"IF('II_Plantejar Ració'!$E18>0,IF(CàlculsEV!AA17>0,1,\"No\"),\"\")","v":""},{"$f":"IF('II_Plantejar Ració'!$E18>0,IF(CàlculsEV!AB17>0,1,\"No\"),\"\")","v":""},{"$f":"IF('II_Plantejar Ració'!$E18>0,IF(CàlculsEV!AC17>0,1,\"No\"),\"\")","v":""},{"$f":"IF('II_Plantejar Ració'!$E18>0,IF(CàlculsEV!AD17>0,1,\"No\"),\"\")","v":""},{"$f":"IF('II_Plantejar Ració'!$E18>0,IF(CàlculsEV!AE17>0,1,\"No\"),\"\")","v":""},{"$f":"IF('II_Plantejar Ració'!$E18>0,IF(CàlculsEV!AF17>0,1,\"No\"),\"\")","v":""},{"$f":"IF('II_Plantejar Ració'!$E18>0,IF(CàlculsEV!AG17>0,1,\"No\"),\"\")","v":""},{"$f":"IF('II_Plantejar Ració'!$E18>0,IF(CàlculsEV!AH17>0,1,\"No\"),\"\")","v":""},{"$f":"IF('II_Plantejar Ració'!$E18>0,IF(CàlculsEV!AI17>0,1,\"No\"),\"\")","v":""},{"$f":"IF('II_Plantejar Ració'!$E18>0,IF(CàlculsEV!AJ17>0,1,\"No\"),\"\")","v":""},{"$f":"IF('II_Plantejar Ració'!$E18>0,IF(CàlculsEV!AK17>0,1,\"No\"),\"\")","v":""},{"$f":"IF('II_Plantejar Ració'!$E18>0,IF(CàlculsEV!AL17>0,1,\"No\"),\"\")","v":""},{"$f":"IF('II_Plantejar Ració'!$E18>0,IF(CàlculsEV!AM17>0,1,\"No\"),\"\")","v":""},0,0,0,0,0,0,0,0,0,0,0,0,0,0,0,0,0,0,0,0,0,0,0,0,0,0,0,0,0,0,0,0,0,0,0]
[null,{"$f":"IF(OFFSET('Taula Concentrats'!$A$1,C18,0,1,1)=0,\"\",OFFSET('Taula Concentrats'!$A$1,C18,0,1,1))","v":"Urea"},76,{"$f":"OFFSET('Taula Concentrats'!$A$1,$C18,$D$2,1,1)","v":99},{"$f":"OFFSET('Taula Concentrats'!$A$1,$C18,$E$2,1,1)","v":0},{"$f":"OFFSET('Taula Concentrats'!$A$1,$C18,$F$2,1,1)","v":0.2},{"$f":"OFFSET('Taula Concentrats'!$A$1,$C18,$G$2,1,1)","v":71},{"$f":"OFFSET('Taula Concentrats'!$A$1,$C18,$H$2,1,1)","v":2557},{"$f":"OFFSET('Taula Concentrats'!$A$1,$C18,$I$2,1,1)","v":2},{"$f":"OFFSET('Taula Concentrats'!$A$1,$C18,$J$2,1,1)","v":9.9999999999999995E-7},{"$f":"OFFSET('Taula Concentrats'!$A$1,$C18,$K$2,1,1)","v":9.9999999999999995E-7},{"$f":"OFFSET('Taula Concentrats'!$A$1,$C18,$L$2,1,1)","v":9.9999999999999995E-7},{"$f":"OFFSET('Taula Concentrats'!$A$1,$C18,$M$2,1,1)","v":9.9999999999999995E-7},{"$f":"OFFSET('Taula Concentrats'!$A$1,$C18,$N$2,1,1)","v":9.9999999999999995E-7},{"$f":"OFFSET('Taula Concentrats'!$A$1,$C18,$O$2,1,1)","v":9.9999999999999995E-7},{"$f":"OFFSET('Taula Concentrats'!$A$1,$C18,$P$2,1,1)","v":9.9999999999999995E-7},{"$f":"OFFSET('Taula Concentrats'!$A$1,$C18,$Q$2,1,1)","v":9.9999999999999995E-7},{"$f":"OFFSET('Taula Concentrats'!$A$1,$C18,$R$2,1,1)","v":9.9999999999999995E-7},{"$f":"OFFSET('Taula Concentrats'!$A$1,$C18,$S$2,1,1)","v":9.9999999999999995E-7},{"$f":"OFFSET('Taula Concentrats'!$A$1,$C18,$T$2,1,1)","v":9.9999999999999995E-7},{"$f":"OFFSET('Taula Concentrats'!$A$1,$C18,$U$2,1,1)","v":9.9999999999999995E-7},{"$f":"OFFSET('Taula Concentrats'!$A$1,$C18,$V$2,1,1)","v":9.9999999999999995E-7},{"$f":"OFFSET('Taula Concentrats'!$A$1,$C18,$W$2,1,1)","v":9.9999999999999995E-7},{"$f":"OFFSET('Taula Concentrats'!$A$1,$C18,$X$2,1,1)","v":9.9999999999999995E-7},{"$f":"OFFSET('Taula Concentrats'!$A$1,$C18,$Y$2,1,1)","v":9.9999999999999995E-7},{"$f":"OFFSET('Taula Concentrats'!$A$1,$C18,$Z$2,1,1)","v":0},{"$f":"OFFSET('Taula Concentrats'!$A$1,$C18,$AA$2,1,1)","v":2870},{"$f":"OFFSET('Taula Concentrats'!$A$1,$C18,$AB$2,1,1)","v":9.9999999999999995E-7},{"$f":"OFFSET('Taula Concentrats'!$A$1,$C18,$AC$2,1,1)","v":0.99},{"$f":"OFFSET('Taula Concentrats'!$A$1,$C18,$AD$2,1,1)","v":9.9999999999999995E-7},{"$f":"OFFSET('Taula Concentrats'!$A$1,$C18,$AE$2,1,1)","v":9.9999999999999995E-7},{"$f":"OFFSET('Taula Concentrats'!$A$1,$C18,$AF$2,1,1)","v":9.9999999999999995E-7},{"$f":"OFFSET('Taula Concentrats'!$A$1,$C18,$AG$2,1,1)","v":9.9999999999999995E-7},{"$f":"OFFSET('Taula Concentrats'!$A$1,$C18,$AH$2,1,1)","v":9.9999999999999995E-7},{"$f":"OFFSET('Taula Concentrats'!$A$1,$C18,$AI$2,1,1)","v":9.9999999999999995E-7},{"$f":"OFFSET('Taula Concentrats'!$A$1,$C18,$AJ$2,1,1)","v":9.9999999999999995E-7},{"$f":"OFFSET('Taula Concentrats'!$A$1,$C18,$AK$2,1,1)","v":9.9999999999999995E-7},{"$f":"OFFSET('Taula Concentrats'!$A$1,$C18,$AL$2,1,1)","v":0},{"$f":"OFFSET('Taula Concentrats'!$A$1,$C18,$AM$2,1,1)","v":0},{"$f":"IF('II_Plantejar Ració'!$E19>0,IF(CàlculsEV!E18>=0,1,\"No\"),\"\")","v":""},{"$f":"IF('II_Plantejar Ració'!$E19>0,IF(CàlculsEV!F18>0,1,\"No\"),\"\")","v":""},{"$f":"IF('II_Plantejar Ració'!$E19>0,IF(CàlculsEV!G18>0,1,\"No\"),\"\")","v":""},{"$f":"IF('II_Plantejar Ració'!$E19>0,IF(CàlculsEV!H18=0,\"No\",1),\"\")","v":""},{"$f":"IF('II_Plantejar Ració'!$E19>0,IF(CàlculsEV!I18>0,1,\"No\"),\"\")","v":""},{"$f":"IF('II_Plantejar Ració'!$E19>0,IF(CàlculsEV!J18>0,1,\"No\"),\"\")","v":""},{"$f":"IF('II_Plantejar Ració'!$E19>0,IF(CàlculsEV!K18>0,1,\"No\"),\"\")","v":""},{"$f":"IF('II_Plantejar Ració'!$E19>0,IF(CàlculsEV!L18>0,1,\"No\"),\"\")","v":""},{"$f":"IF('II_Plantejar Ració'!$E19>0,IF(CàlculsEV!M18>0,1,\"No\"),\"\")","v":""},{"$f":"IF('II_Plantejar Ració'!$E19>0,IF(CàlculsEV!N18>0,1,\"No\"),\"\")","v":""},{"$f":"IF('II_Plantejar Ració'!$E19>0,IF(CàlculsEV!O18>0,1,\"No\"),\"\")","v":""},{"$f":"IF('II_Plantejar Ració'!$E19>0,IF(CàlculsEV!P18>0,1,\"No\"),\"\")","v":""},{"$f":"IF('II_Plantejar Ració'!$E19>0,IF(CàlculsEV!Q18>0,1,\"No\"),\"\")","v":""},{"$f":"IF('II_Plantejar Ració'!$E19>0,IF(CàlculsEV!R18>0,1,\"No\"),\"\")","v":""},{"$f":"IF('II_Plantejar Ració'!$E19>0,IF(CàlculsEV!S18>0,1,\"No\"),\"\")","v":""},{"$f":"IF('II_Plantejar Ració'!$E19>0,IF(CàlculsEV!T18>0,1,\"No\"),\"\")","v":""},{"$f":"IF('II_Plantejar Ració'!$E19>0,IF(CàlculsEV!U18>0,1,\"No\"),\"\")","v":""},{"$f":"IF('II_Plantejar Ració'!$E19>0,IF(CàlculsEV!V18>0,1,\"No\"),\"\")","v":""},{"$f":"IF('II_Plantejar Ració'!$E19>0,IF(CàlculsEV!W18>0,1,\"No\"),\"\")","v":""},{"$f":"IF('II_Plantejar Ració'!$E19>0,IF(CàlculsEV!X18>0,1,\"No\"),\"\")","v":""},{"$f":"IF('II_Plantejar Ració'!$E19>0,IF(CàlculsEV!Y18>0,1,\"No\"),\"\")","v":""},{"$f":"IF('II_Plantejar Ració'!$E19>0,IF(CàlculsEV!Z18>0,1,\"No\"),\"\")","v":""},{"$f":"IF('II_Plantejar Ració'!$E19>0,IF(CàlculsEV!AA18>0,1,\"No\"),\"\")","v":""},{"$f":"IF('II_Plantejar Ració'!$E19>0,IF(CàlculsEV!AB18>0,1,\"No\"),\"\")","v":""},{"$f":"IF('II_Plantejar Ració'!$E19>0,IF(CàlculsEV!AC18>0,1,\"No\"),\"\")","v":""},{"$f":"IF('II_Plantejar Ració'!$E19>0,IF(CàlculsEV!AD18>0,1,\"No\"),\"\")","v":""},{"$f":"IF('II_Plantejar Ració'!$E19>0,IF(CàlculsEV!AE18>0,1,\"No\"),\"\")","v":""},{"$f":"IF('II_Plantejar Ració'!$E19>0,IF(CàlculsEV!AF18>0,1,\"No\"),\"\")","v":""},{"$f":"IF('II_Plantejar Ració'!$E19>0,IF(CàlculsEV!AG18>0,1,\"No\"),\"\")","v":""},{"$f":"IF('II_Plantejar Ració'!$E19>0,IF(CàlculsEV!AH18>0,1,\"No\"),\"\")","v":""},{"$f":"IF('II_Plantejar Ració'!$E19>0,IF(CàlculsEV!AI18>0,1,\"No\"),\"\")","v":""},{"$f":"IF('II_Plantejar Ració'!$E19>0,IF(CàlculsEV!AJ18>0,1,\"No\"),\"\")","v":""},{"$f":"IF('II_Plantejar Ració'!$E19>0,IF(CàlculsEV!AK18>0,1,\"No\"),\"\")","v":""},{"$f":"IF('II_Plantejar Ració'!$E19>0,IF(CàlculsEV!AL18>0,1,\"No\"),\"\")","v":""},{"$f":"IF('II_Plantejar Ració'!$E19>0,IF(CàlculsEV!AM18>0,1,\"No\"),\"\")","v":""},0,0,0,0,0,0,0,0,0,0,0,0,0,0,0,0,0,0,0,0,0,0,0,0,0,0,0,0,0,0,0,0,0,0,0]
[null,{"$f":"IF(OFFSET('Taula Concentrats'!$A$1,C19,0,1,1)=0,\"\",OFFSET('Taula Concentrats'!$A$1,C19,0,1,1))","v":""},1,{"$f":"OFFSET('Taula Concentrats'!$A$1,$C19,$D$2,1,1)","v":0},{"$f":"OFFSET('Taula Concentrats'!$A$1,$C19,$E$2,1,1)","v":0},{"$f":"OFFSET('Taula Concentrats'!$A$1,$C19,$F$2,1,1)","v":0},{"$f":"OFFSET('Taula Concentrats'!$A$1,$C19,$G$2,1,1)","v":0},{"$f":"OFFSET('Taula Concentrats'!$A$1,$C19,$H$2,1,1)","v":0},{"$f":"OFFSET('Taula Concentrats'!$A$1,$C19,$I$2,1,1)","v":0},{"$f":"OFFSET('Taula Concentrats'!$A$1,$C19,$J$2,1,1)","v":0},{"$f":"OFFSET('Taula Concentrats'!$A$1,$C19,$K$2,1,1)","v":0},{"$f":"OFFSET('Taula Concentrats'!$A$1,$C19,$L$2,1,1)","v":0},{"$f":"OFFSET('Taula Concentrats'!$A$1,$C19,$M$2,1,1)","v":0},{"$f":"OFFSET('Taula Concentrats'!$A$1,$C19,$N$2,1,1)","v":0},{"$f":"OFFSET('Taula Concentrats'!$A$1,$C19,$O$2,1,1)","v":0},{"$f":"OFFSET('Taula Concentrats'!$A$1,$C19,$P$2,1,1)","v":0},{"$f":"OFFSET('Taula Concentrats'!$A$1,$C19,$Q$2,1,1)","v":0},{"$f":"OFFSET('Taula Concentrats'!$A$1,$C19,$R$2,1,1)","v":0},{"$f":"OFFSET('Taula Concentrats'!$A$1,$C19,$S$2,1,1)","v":0},{"$f":"OFFSET('Taula Concentrats'!$A$1,$C19,$T$2,1,1)","v":0},{"$f":"OFFSET('Taula Concentrats'!$A$1,$C19,$U$2,1,1)","v":0},{"$f":"OFFSET('Taula Concentrats'!$A$1,$C19,$V$2,1,1)","v":0},{"$f":"OFFSET('Taula Concentrats'!$A$1,$C19,$W$2,1,1)","v":0},{"$f":"OFFSET('Taula Concentrats'!$A$1,$C19,$X$2,1,1)","v":0},{"$f":"OFFSET('Taula Concentrats'!$A$1,$C19,$Y$2,1,1)","v":0},{"$f":"OFFSET('Taula Concentrats'!$A$1,$C19,$Z$2,1,1)","v":0},{"$f":"OFFSET('Taula Concentrats'!$A$1,$C19,$AA$2,1,1)","v":0},{"$f":"OFFSET('Taula Concentrats'!$A$1,$C19,$AB$2,1,1)","v":0},{"$f":"OFFSET('Taula Concentrats'!$A$1,$C19,$AC$2,1,1)","v":0},{"$f":"OFFSET('Taula Concentrats'!$A$1,$C19,$AD$2,1,1)","v":0},{"$f":"OFFSET('Taula Concentrats'!$A$1,$C19,$AE$2,1,1)","v":0},{"$f":"OFFSET('Taula Concentrats'!$A$1,$C19,$AF$2,1,1)","v":0},{"$f":"OFFSET('Taula Concentrats'!$A$1,$C19,$AG$2,1,1)","v":0},{"$f":"OFFSET('Taula Concentrats'!$A$1,$C19,$AH$2,1,1)","v":0},{"$f":"OFFSET('Taula Concentrats'!$A$1,$C19,$AI$2,1,1)","v":0},{"$f":"OFFSET('Taula Concentrats'!$A$1,$C19,$AJ$2,1,1)","v":0},{"$f":"OFFSET('Taula Concentrats'!$A$1,$C19,$AK$2,1,1)","v":0},{"$f":"OFFSET('Taula Concentrats'!$A$1,$C19,$AL$2,1,1)","v":0},{"$f":"OFFSET('Taula Concentrats'!$A$1,$C19,$AM$2,1,1)","v":0},{"$f":"IF('II_Plantejar Ració'!$E20>0,IF(CàlculsEV!E19>=0,1,\"No\"),\"\")","v":""},{"$f":"IF('II_Plantejar Ració'!$E20>0,IF(CàlculsEV!F19>0,1,\"No\"),\"\")","v":""},{"$f":"IF('II_Plantejar Ració'!$E20>0,IF(CàlculsEV!G19>0,1,\"No\"),\"\")","v":""},{"$f":"IF('II_Plantejar Ració'!$E20>0,IF(CàlculsEV!H19=0,\"No\",1),\"\")","v":""},{"$f":"IF('II_Plantejar Ració'!$E20>0,IF(CàlculsEV!I19>0,1,\"No\"),\"\")","v":""},{"$f":"IF('II_Plantejar Ració'!$E20>0,IF(CàlculsEV!J19>0,1,\"No\"),\"\")","v":""},{"$f":"IF('II_Plantejar Ració'!$E20>0,IF(CàlculsEV!K19>0,1,\"No\"),\"\")","v":""},{"$f":"IF('II_Plantejar Ració'!$E20>0,IF(CàlculsEV!L19>0,1,\"No\"),\"\")","v":""},{"$f":"IF('II_Plantejar Ració'!$E20>0,IF(CàlculsEV!M19>0,1,\"No\"),\"\")","v":""},{"$f":"IF('II_Plantejar Ració'!$E20>0,IF(CàlculsEV!N19>0,1,\"No\"),\"\")","v":""},{"$f":"IF('II_Plantejar Ració'!$E20>0,IF(CàlculsEV!O19>0,1,\"No\"),\"\")","v":""},{"$f":"IF('II_Plantejar Ració'!$E20>0,IF(CàlculsEV!P19>0,1,\"No\"),\"\")","v":""},{"$f":"IF('II_Plantejar Ració'!$E20>0,IF(CàlculsEV!Q19>0,1,\"No\"),\"\")","v":""},{"$f":"IF('II_Plantejar Ració'!$E20>0,IF(CàlculsEV!R19>0,1,\"No\"),\"\")","v":""},{"$f":"IF('II_Plantejar Ració'!$E20>0,IF(CàlculsEV!S19>0,1,\"No\"),\"\")","v":""},{"$f":"IF('II_Plantejar Ració'!$E20>0,IF(CàlculsEV!T19>0,1,\"No\"),\"\")","v":""},{"$f":"IF('II_Plantejar Ració'!$E20>0,IF(CàlculsEV!U19>0,1,\"No\"),\"\")","v":""},{"$f":"IF('II_Plantejar Ració'!$E20>0,IF(CàlculsEV!V19>0,1,\"No\"),\"\")","v":""},{"$f":"IF('II_Plantejar Ració'!$E20>0,IF(CàlculsEV!W19>0,1,\"No\"),\"\")","v":""},{"$f":"IF('II_Plantejar Ració'!$E20>0,IF(CàlculsEV!X19>0,1,\"No\"),\"\")","v":""},{"$f":"IF('II_Plantejar Ració'!$E20>0,IF(CàlculsEV!Y19>0,1,\"No\"),\"\")","v":""},{"$f":"IF('II_Plantejar Ració'!$E20>0,IF(CàlculsEV!Z19>0,1,\"No\"),\"\")","v":""},{"$f":"IF('II_Plantejar Ració'!$E20>0,IF(CàlculsEV!AA19>0,1,\"No\"),\"\")","v":""},{"$f":"IF('II_Plantejar Ració'!$E20>0,IF(CàlculsEV!AB19>0,1,\"No\"),\"\")","v":""},{"$f":"IF('II_Plantejar Ració'!$E20>0,IF(CàlculsEV!AC19>0,1,\"No\"),\"\")","v":""},{"$f":"IF('II_Plantejar Ració'!$E20>0,IF(CàlculsEV!AD19>0,1,\"No\"),\"\")","v":""},{"$f":"IF('II_Plantejar Ració'!$E20>0,IF(CàlculsEV!AE19>0,1,\"No\"),\"\")","v":""},{"$f":"IF('II_Plantejar Ració'!$E20>0,IF(CàlculsEV!AF19>0,1,\"No\"),\"\")","v":""},{"$f":"IF('II_Plantejar Ració'!$E20>0,IF(CàlculsEV!AG19>0,1,\"No\"),\"\")","v":""},{"$f":"IF('II_Plantejar Ració'!$E20>0,IF(CàlculsEV!AH19>0,1,\"No\"),\"\")","v":""},{"$f":"IF('II_Plantejar Ració'!$E20>0,IF(CàlculsEV!AI19>0,1,\"No\"),\"\")","v":""},{"$f":"IF('II_Plantejar Ració'!$E20>0,IF(CàlculsEV!AJ19>0,1,\"No\"),\"\")","v":""},{"$f":"IF('II_Plantejar Ració'!$E20>0,IF(CàlculsEV!AK19>0,1,\"No\"),\"\")","v":""},{"$f":"IF('II_Plantejar Ració'!$E20>0,IF(CàlculsEV!AL19>0,1,\"No\"),\"\")","v":""},{"$f":"IF('II_Plantejar Ració'!$E20>0,IF(CàlculsEV!AM19>0,1,\"No\"),\"\")","v":""},0,0,0,0,0,0,0,0,0,0,0,0,0,0,0,0,0,0,0,0,0,0,0,0,0,0,0,0,0,0,0,0,0,0,0]
["MINERALS",{"$f":"IF(OFFSET('Taula Minerals-aa'!$A$1,C20,0,1,1)=0,\"\",OFFSET('Taula Minerals-aa'!$A$1,C20,0,1,1))","v":"Carbonat de cobalt"},10,{"$f":"OFFSET('Taula Minerals-aa'!$A$1,$C20,D2,1,1)","v":100},{"$f":"OFFSET('Taula Minerals-aa'!$A$1,$C20,E2,1,1)","v":0},{"$f":"OFFSET('Taula Minerals-aa'!$A$1,$C20,F2,1,1)","v":0},{"$f":"OFFSET('Taula Minerals-aa'!$A$1,$C20,G2,1,1)","v":0},{"$f":"OFFSET('Taula Minerals-aa'!$A$1,$C20,H2,1,1)","v":0},{"$f":"OFFSET('Taula Minerals-aa'!$A$1,$C20,I2,1,1)","v":0},{"$f":"OFFSET('Taula Minerals-aa'!$A$1,$C20,J2,1,1)","v":0},{"$f":"OFFSET('Taula Minerals-aa'!$A$1,$C20,K2,1,1)","v":0},{"$f":"OFFSET('Taula Minerals-aa'!$A$1,$C20,L$2,1,1)","v":0},{"$f":"OFFSET('Taula Minerals-aa'!$A$1,$C20,M$2,1,1)","v":0},{"$f":"OFFSET('Taula Minerals-aa'!$A$1,$C20,N$2,1,1)","v":0},{"$f":"OFFSET('Taula Minerals-aa'!$A$1,$C20,O$2,1,1)","v":0},{"$f":"OFFSET('Taula Minerals-aa'!$A$1,$C20,P$2,1,1)","v":0},{"$f":"OFFSET('Taula Minerals-aa'!$A$1,$C20,Q$2,1,1)","v":49},{"$f":"OFFSET('Taula Minerals-aa'!$A$1,$C20,R$2,1,1)","v":0},{"$f":"OFFSET('Taula Minerals-aa'!$A$1,$C20,S$2,1,1)","v":0},{"$f":"OFFSET('Taula Minerals-aa'!$A$1,$C20,T$2,1,1)","v":0},{"$f":"OFFSET('Taula Minerals-aa'!$A$1,$C20,U$2,1,1)","v":0},{"$f":"OFFSET('Taula Minerals-aa'!$A$1,$C20,V$2,1,1)","v":0},{"$f":"OFFSET('Taula Minerals-aa'!$A$1,$C20,W$2,1,1)","v":0},{"$f":"OFFSET('Taula Minerals-aa'!$A$1,$C20,X$2,1,1)","v":0},{"$f":"OFFSET('Taula Minerals-aa'!$A$1,$C20,Y$2,1,1)","v":0},{"$f":"OFFSET('Taula Minerals-aa'!$A$1,$C20,Z$2,1,1)","v":0},{"$f":"OFFSET('Taula Minerals-aa'!$A$1,$C20,AA$2,1,1)","v":0},{"$f":"OFFSET('Taula Minerals-aa'!$A$1,$C20,AB$2,1,1)","v":0},{"$f":"OFFSET('Taula Minerals-aa'!$A$1,$C20,AC$2,1,1)","v":0},{"$f":"OFFSET('Taula Minerals-aa'!$A$1,$C20,AD$2,1,1)","v":0},{"$f":"OFFSET('Taula Minerals-aa'!$A$1,$C20,AE$2,1,1)","v":0},{"$f":"OFFSET('Taula Minerals-aa'!$A$1,$C20,AF$2,1,1)","v":0},{"$f":"OFFSET('Taula Minerals-aa'!$A$1,$C20,AG$2,1,1)","v":0},{"$f":"OFFSET('Taula Minerals-aa'!$A$1,$C20,AH$2,1,1)","v":0},{"$f":"OFFSET('Taula Minerals-aa'!$A$1,$C20,AI$2,1,1)","v":0},{"$f":"OFFSET('Taula Minerals-aa'!$A$1,$C20,AJ$2,1,1)","v":0},{"$f":"OFFSET('Taula Minerals-aa'!$A$1,$C20,AK$2,1,1)","v":0},{"$f":"OFFSET('Taula Minerals-aa'!$A$1,$C20,AL$2,1,1)","v":0},{"$f":"OFFSET('Taula Minerals-aa'!$A$1,$C20,AM$2,1,1)","v":0},{"$f":"SUM(AN3:AN19)","v":0},1,1,1,1,1,1,1,1,1,1,0,0,1,1,0,0,0,0,0,0,1,1,1,1,1,1,1,1,1,1,1,0,1,1,{"$f":"SUM(BW3:BW19)","v":1},1,1,1,1,1,1,1,1,1,1,1,1,1,1,1,1,1,1,1,1,1,1,1,1,1,1,1,1,{"$f":"SUM(CZ3:CZ19)","v":1},1,1,1,1,1]
[null,{"$f":"IF(OFFSET('Taula Minerals-aa'!$A$1,C21,0,1,1)=0,\"\",OFFSET('Taula Minerals-aa'!$A$1,C21,0,1,1))","v":"Fosfat bicàlcic"},3,{"$f":"OFFSET('Taula Minerals-aa'!$A$1,$C21,D2,1,1)","v":98.8},{"$f":"OFFSET('Taula Minerals-aa'!$A$1,$C21,E2,1,1)","v":0},{"$f":"OFFSET('Taula Minerals-aa'!$A$1,$C21,F2,1,1)","v":0},{"$f":"OFFSET('Taula Minerals-aa'!$A$1,$C21,G2,1,1)","v":0},{"$f":"OFFSET('Taula Minerals-aa'!$A$1,$C21,H2,1,1)","v":0},{"$f":"OFFSET('Taula Minerals-aa'!$A$1,$C21,I2,1,1)","v":0},{"$f":"OFFSET('Taula Minerals-aa'!$A$1,$C21,J2,1,1)","v":244},{"$f":"OFFSET('Taula Minerals-aa'!$A$1,$C21,K2,1,1)","v":122.4},{"$f":"OFFSET('Taula Minerals-aa'!$A$1,$C21,L$2,1,1)","v":5},{"$f":"OFFSET('Taula Minerals-aa'!$A$1,$C21,M$2,1,1)","v":1.2},{"$f":"OFFSET('Taula Minerals-aa'!$A$1,$C21,N$2,1,1)","v":0.8},{"$f":"OFFSET('Taula Minerals-aa'!$A$1,$C21,O$2,1,1)","v":11},{"$f":"OFFSET('Taula Minerals-aa'!$A$1,$C21,P$2,1,1)","v":0.4},{"$f":"OFFSET('Taula Minerals-aa'!$A$1,$C21,Q$2,1,1)","v":0},{"$f":"OFFSET('Taula Minerals-aa'!$A$1,$C21,R$2,1,1)","v":15},{"$f":"OFFSET('Taula Minerals-aa'!$A$1,$C21,S$2,1,1)","v":0},{"$f":"OFFSET('Taula Minerals-aa'!$A$1,$C21,T$2,1,1)","v":0},{"$f":"OFFSET('Taula Minerals-aa'!$A$1,$C21,U$2,1,1)","v":0},{"$f":"OFFSET('Taula Minerals-aa'!$A$1,$C21,V$2,1,1)","v":0},{"$f":"OFFSET('Taula Minerals-aa'!$A$1,$C21,W$2,1,1)","v":0},{"$f":"OFFSET('Taula Minerals-aa'!$A$1,$C21,X$2,1,1)","v":0},{"$f":"OFFSET('Taula Minerals-aa'!$A$1,$C21,Y$2,1,1)","v":0},{"$f":"OFFSET('Taula Minerals-aa'!$A$1,$C21,Z$2,1,1)","v":0},{"$f":"OFFSET('Taula Minerals-aa'!$A$1,$C21,AA$2,1,1)","v":0},{"$f":"OFFSET('Taula Minerals-aa'!$A$1,$C21,AB$2,1,1)","v":0},{"$f":"OFFSET('Taula Minerals-aa'!$A$1,$C21,AC$2,1,1)","v":0},{"$f":"OFFSET('Taula Minerals-aa'!$A$1,$C21,AD$2,1,1)","v":0},{"$f":"OFFSET('Taula Minerals-aa'!$A$1,$C21,AE$2,1,1)","v":0},{"$f":"OFFSET('Taula Minerals-aa'!$A$1,$C21,AF$2,1,1)","v":0},{"$f":"OFFSET('Taula Minerals-aa'!$A$1,$C21,AG$2,1,1)","v":0},{"$f":"OFFSET('Taula Minerals-aa'!$A$1,$C21,AH$2,1,1)","v":0},{"$f":"OFFSET('Taula Minerals-aa'!$A$1,$C21,AI$2,1,1)","v":0},{"$f":"OFFSET('Taula Minerals-aa'!$A$1,$C21,AJ$2,1,1)","v":836},{"$f":"OFFSET('Taula Minerals-aa'!$A$1,$C21,AK$2,1,1)","v":0},{"$f":"OFFSET('Taula Minerals-aa'!$A$1,$C21,AL$2,1,1)","v":0},{"$f":"OFFSET('Taula Minerals-aa'!$A$1,$C21,AM$2,1,1)","v":0},{"$f":"IF(AN20/BW20=1,\"\",AN2)","v":"UEB"},"","","","","","",{"$f":"IF(AU20/CD20=1,\"\", AU2)","v":""},"","","","Cl","Co","","","Zn","Iode","Se","Vit A","Vit D","Vit E","","","","","","","","","","","","Mo","",""]
[null,{"$f":"IF(OFFSET('Taula Minerals-aa'!$A$1,C22,0,1,1)=0,\"\",OFFSET('Taula Minerals-aa'!$A$1,C22,0,1,1))","v":"Carbonat càlcic"},2,{"$f":"OFFSET('Taula Minerals-aa'!$A$1,$C22,D2,1,1)","v":98},{"$f":"OFFSET('Taula Minerals-aa'!$A$1,$C22,E2,1,1)","v":0},{"$f":"OFFSET('Taula Minerals-aa'!$A$1,$C22,F2,1,1)","v":0},{"$f":"OFFSET('Taula Minerals-aa'!$A$1,$C22,G2,1,1)","v":0},{"$f":"OFFSET('Taula Minerals-aa'!$A$1,$C22,H2,1,1)","v":0},{"$f":"OFFSET('Taula Minerals-aa'!$A$1,$C22,I2,1,1)","v":0},{"$f":"OFFSET('Taula Minerals-aa'!$A$1,$C22,J2,1,1)","v":145.54},{"$f":"OFFSET('Taula Minerals-aa'!$A$1,$C22,K2,1,1)","v":0},{"$f":"OFFSET('Taula Minerals-aa'!$A$1,$C22,L$2,1,1)","v":14},{"$f":"OFFSET('Taula Minerals-aa'!$A$1,$C22,M$2,1,1)","v":0.7},{"$f":"OFFSET('Taula Minerals-aa'!$A$1,$C22,N$2,1,1)","v":0.7},{"$f":"OFFSET('Taula Minerals-aa'!$A$1,$C22,O$2,1,1)","v":0.7},{"$f":"OFFSET('Taula Minerals-aa'!$A$1,$C22,P$2,1,1)","v":0.2},{"$f":"OFFSET('Taula Minerals-aa'!$A$1,$C22,Q$2,1,1)","v":0},{"$f":"OFFSET('Taula Minerals-aa'!$A$1,$C22,R$2,1,1)","v":12},{"$f":"OFFSET('Taula Minerals-aa'!$A$1,$C22,S$2,1,1)","v":0},{"$f":"OFFSET('Taula Minerals-aa'!$A$1,$C22,T$2,1,1)","v":0},{"$f":"OFFSET('Taula Minerals-aa'!$A$1,$C22,U$2,1,1)","v":0},{"$f":"OFFSET('Taula Minerals-aa'!$A$1,$C22,V$2,1,1)","v":0},{"$f":"OFFSET('Taula Minerals-aa'!$A$1,$C22,W$2,1,1)","v":0},{"$f":"OFFSET('Taula Minerals-aa'!$A$1,$C22,X$2,1,1)","v":0},{"$f":"OFFSET('Taula Minerals-aa'!$A$1,$C22,Y$2,1,1)","v":0},{"$f":"OFFSET('Taula Minerals-aa'!$A$1,$C22,Z$2,1,1)","v":0},{"$f":"OFFSET('Taula Minerals-aa'!$A$1,$C22,AA$2,1,1)","v":0},{"$f":"OFFSET('Taula Minerals-aa'!$A$1,$C22,AB$2,1,1)","v":0},{"$f":"OFFSET('Taula Minerals-aa'!$A$1,$C22,AC$2,1,1)","v":0},{"$f":"OFFSET('Taula Minerals-aa'!$A$1,$C22,AD$2,1,1)","v":0},{"$f":"OFFSET('Taula Minerals-aa'!$A$1,$C22,AE$2,1,1)","v":0},{"$f":"OFFSET('Taula Minerals-aa'!$A$1,$C22,AF$2,1,1)","v":0},{"$f":"OFFSET('Taula Minerals-aa'!$A$1,$C22,AG$2,1,1)","v":0},{"$f":"OFFSET('Taula Minerals-aa'!$A$1,$C22,AH$2,1,1)","v":0},{"$f":"OFFSET('Taula Minerals-aa'!$A$1,$C22,AI$2,1,1)","v":0},{"$f":"OFFSET('Taula Minerals-aa'!$A$1,$C22,AJ$2,1,1)","v":955},{"$f":"OFFSET('Taula Minerals-aa'!$A$1,$C22,AK$2,1,1)","v":0},{"$f":"OFFSET('Taula Minerals-aa'!$A$1,$C22,AL$2,1,1)","v":0},{"$f":"OFFSET('Taula Minerals-aa'!$A$1,$C22,AM$2,1,1)","v":0}]
[null,{"$f":"IF(OFFSET('Taula Minerals-aa'!$A$1,C23,0,1,1)=0,\"\",OFFSET('Taula Minerals-aa'!$A$1,C23,0,1,1))","v":"Fosfat sòdic"},7,{"$f":"OFFSET('Taula Minerals-aa'!$A$1,$C23,D2,1,1)","v":100},{"$f":"OFFSET('Taula Minerals-aa'!$A$1,$C23,E2,1,1)","v":0},{"$f":"OFFSET('Taula Minerals-aa'!$A$1,$C23,F2,1,1)","v":0},{"$f":"OFFSET('Taula Minerals-aa'!$A$1,$C23,G2,1,1)","v":0},{"$f":"OFFSET('Taula Minerals-aa'!$A$1,$C23,H2,1,1)","v":0},{"$f":"OFFSET('Taula Minerals-aa'!$A$1,$C23,I2,1,1)","v":0},{"$f":"OFFSET('Taula Minerals-aa'!$A$1,$C23,J2,1,1)","v":0},{"$f":"OFFSET('Taula Minerals-aa'!$A$1,$C23,K2,1,1)","v":13.600000000000001},{"$f":"OFFSET('Taula Minerals-aa'!$A$1,$C23,L$2,1,1)","v":0},{"$f":"OFFSET('Taula Minerals-aa'!$A$1,$C23,M$2,1,1)","v":0},{"$f":"OFFSET('Taula Minerals-aa'!$A$1,$C23,N$2,1,1)","v":19},{"$f":"OFFSET('Taula Minerals-aa'!$A$1,$C23,O$2,1,1)","v":0},{"$f":"OFFSET('Taula Minerals-aa'!$A$1,$C23,P$2,1,1)","v":0},{"$f":"OFFSET('Taula Minerals-aa'!$A$1,$C23,Q$2,1,1)","v":0},{"$f":"OFFSET('Taula Minerals-aa'!$A$1,$C23,R$2,1,1)","v":0},{"$f":"OFFSET('Taula Minerals-aa'!$A$1,$C23,S$2,1,1)","v":0},{"$f":"OFFSET('Taula Minerals-aa'!$A$1,$C23,T$2,1,1)","v":0},{"$f":"OFFSET('Taula Minerals-aa'!$A$1,$C23,U$2,1,1)","v":0},{"$f":"OFFSET('Taula Minerals-aa'!$A$1,$C23,V$2,1,1)","v":0},{"$f":"OFFSET('Taula Minerals-aa'!$A$1,$C23,W$2,1,1)","v":0},{"$f":"OFFSET('Taula Minerals-aa'!$A$1,$C23,X$2,1,1)","v":0},{"$f":"OFFSET('Taula Minerals-aa'!$A$1,$C23,Y$2,1,1)","v":0},{"$f":"OFFSET('Taula Minerals-aa'!$A$1,$C23,Z$2,1,1)","v":0},{"$f":"OFFSET('Taula Minerals-aa'!$A$1,$C23,AA$2,1,1)","v":0},{"$f":"OFFSET('Taula Minerals-aa'!$A$1,$C23,AB$2,1,1)","v":0},{"$f":"OFFSET('Taula Minerals-aa'!$A$1,$C23,AC$2,1,1)","v":0},{"$f":"OFFSET('Taula Minerals-aa'!$A$1,$C23,AD$2,1,1)","v":0},{"$f":"OFFSET('Taula Minerals-aa'!$A$1,$C23,AE$2,1,1)","v":0},{"$f":"OFFSET('Taula Minerals-aa'!$A$1,$C23,AF$2,1,1)","v":0},{"$f":"OFFSET('Taula Minerals-aa'!$A$1,$C23,AG$2,1,1)","v":0},{"$f":"OFFSET('Taula Minerals-aa'!$A$1,$C23,AH$2,1,1)","v":0},{"$f":"OFFSET('Taula Minerals-aa'!$A$1,$C23,AI$2,1,1)","v":0},{"$f":"OFFSET('Taula Minerals-aa'!$A$1,$C23,AJ$2,1,1)","v":0},{"$f":"OFFSET('Taula Minerals-aa'!$A$1,$C23,AK$2,1,1)","v":0},{"$f":"OFFSET('Taula Minerals-aa'!$A$1,$C23,AL$2,1,1)","v":0},{"$f":"OFFSET('Taula Minerals-aa'!$A$1,$C23,AM$2,1,1)","v":0}]
[null,{"$f":"IF(OFFSET('Taula Minerals-aa'!$A$1,C24,0,1,1)=0,\"\",OFFSET('Taula Minerals-aa'!$A$1,C24,0,1,1))","v":""},1,{"$f":"OFFSET('Taula Minerals-aa'!$A$1,$C24,D2,1,1)","v":0},{"$f":"OFFSET('Taula Minerals-aa'!$A$1,$C24,E2,1,1)","v":0},{"$f":"OFFSET('Taula Minerals-aa'!$A$1,$C24,F2,1,1)","v":0},{"$f":"OFFSET('Taula Minerals-aa'!$A$1,$C24,G2,1,1)","v":0},{"$f":"OFFSET('Taula Minerals-aa'!$A$1,$C24,H2,1,1)","v":0},{"$f":"OFFSET('Taula Minerals-aa'!$A$1,$C24,I2,1,1)","v":0},{"$f":"OFFSET('Taula Minerals-aa'!$A$1,$C24,J2,1,1)","v":0},{"$f":"OFFSET('Taula Minerals-aa'!$A$1,$C24,K2,1,1)","v":0},{"$f":"OFFSET('Taula Minerals-aa'!$A$1,$C24,L$2,1,1)","v":0},{"$f":"OFFSET('Taula Minerals-aa'!$A$1,$C24,M$2,1,1)","v":0},{"$f":"OFFSET('Taula Minerals-aa'!$A$1,$C24,N$2,1,1)","v":0},{"$f":"OFFSET('Taula Minerals-aa'!$A$1,$C24,O$2,1,1)","v":0},{"$f":"OFFSET('Taula Minerals-aa'!$A$1,$C24,P$2,1,1)","v":0},{"$f":"OFFSET('Taula Minerals-aa'!$A$1,$C24,Q$2,1,1)","v":0},{"$f":"OFFSET('Taula Minerals-aa'!$A$1,$C24,R$2,1,1)","v":0},{"$f":"OFFSET('Taula Minerals-aa'!$A$1,$C24,S$2,1,1)","v":0},{"$f":"OFFSET('Taula Minerals-aa'!$A$1,$C24,T$2,1,1)","v":0},{"$f":"OFFSET('Taula Minerals-aa'!$A$1,$C24,U$2,1,1)","v":0},{"$f":"OFFSET('Taula Minerals-aa'!$A$1,$C24,V$2,1,1)","v":0},{"$f":"OFFSET('Taula Minerals-aa'!$A$1,$C24,W$2,1,1)","v":0},{"$f":"OFFSET('Taula Minerals-aa'!$A$1,$C24,X$2,1,1)","v":0},{"$f":"OFFSET('Taula Minerals-aa'!$A$1,$C24,Y$2,1,1)","v":0},{"$f":"OFFSET('Taula Minerals-aa'!$A$1,$C24,Z$2,1,1)","v":0},{"$f":"OFFSET('Taula Minerals-aa'!$A$1,$C24,AA$2,1,1)","v":0},{"$f":"OFFSET('Taula Minerals-aa'!$A$1,$C24,AB$2,1,1)","v":0},{"$f":"OFFSET('Taula Minerals-aa'!$A$1,$C24,AC$2,1,1)","v":0},{"$f":"OFFSET('Taula Minerals-aa'!$A$1,$C24,AD$2,1,1)","v":0},{"$f":"OFFSET('Taula Minerals-aa'!$A$1,$C24,AE$2,1,1)","v":0},{"$f":"OFFSET('Taula Minerals-aa'!$A$1,$C24,AF$2,1,1)","v":0},{"$f":"OFFSET('Taula Minerals-aa'!$A$1,$C24,AG$2,1,1)","v":0},{"$f":"OFFSET('Taula Minerals-aa'!$A$1,$C24,AH$2,1,1)","v":0},{"$f":"OFFSET('Taula Minerals-aa'!$A$1,$C24,AI$2,1,1)","v":0},{"$f":"OFFSET('Taula Minerals-aa'!$A$1,$C24,AJ$2,1,1)","v":0},{"$f":"OFFSET('Taula Minerals-aa'!$A$1,$C24,AK$2,1,1)","v":0},{"$f":"OFFSET('Taula Minerals-aa'!$A$1,$C24,AL$2,1,1)","v":0},{"$f":"OFFSET('Taula Minerals-aa'!$A$1,$C24,AM$2,1,1)","v":0}]
[null,{"$f":"IF(OFFSET('Taula Minerals-aa'!$A$1,C25,0,1,1)=0,\"\",OFFSET('Taula Minerals-aa'!$A$1,C25,0,1,1))","v":""},1,{"$f":"OFFSET('Taula Minerals-aa'!$A$1,$C25,D2,1,1)","v":0},{"$f":"OFFSET('Taula Minerals-aa'!$A$1,$C25,E2,1,1)","v":0},{"$f":"OFFSET('Taula Minerals-aa'!$A$1,$C25,F2,1,1)","v":0},{"$f":"OFFSET('Taula Minerals-aa'!$A$1,$C25,G2,1,1)","v":0},{"$f":"OFFSET('Taula Minerals-aa'!$A$1,$C25,H2,1,1)","v":0},{"$f":"OFFSET('Taula Minerals-aa'!$A$1,$C25,I2,1,1)","v":0},{"$f":"OFFSET('Taula Minerals-aa'!$A$1,$C25,J2,1,1)","v":0},{"$f":"OFFSET('Taula Minerals-aa'!$A$1,$C25,K2,1,1)","v":0},{"$f":"OFFSET('Taula Minerals-aa'!$A$1,$C25,L$2,1,1)","v":0},{"$f":"OFFSET('Taula Minerals-aa'!$A$1,$C25,M$2,1,1)","v":0},{"$f":"OFFSET('Taula Minerals-aa'!$A$1,$C25,N$2,1,1)","v":0},{"$f":"OFFSET('Taula Minerals-aa'!$A$1,$C25,O$2,1,1)","v":0},{"$f":"OFFSET('Taula Minerals-aa'!$A$1,$C25,P$2,1,1)","v":0},{"$f":"OFFSET('Taula Minerals-aa'!$A$1,$C25,Q$2,1,1)","v":0},{"$f":"OFFSET('Taula Minerals-aa'!$A$1,$C25,R$2,1,1)","v":0},{"$f":"OFFSET('Taula Minerals-aa'!$A$1,$C25,S$2,1,1)","v":0},{"$f":"OFFSET('Taula Minerals-aa'!$A$1,$C25,T$2,1,1)","v":0},{"$f":"OFFSET('Taula Minerals-aa'!$A$1,$C25,U$2,1,1)","v":0},{"$f":"OFFSET('Taula Minerals-aa'!$A$1,$C25,V$2,1,1)","v":0},{"$f":"OFFSET('Taula Minerals-aa'!$A$1,$C25,W$2,1,1)","v":0},{"$f":"OFFSET('Taula Minerals-aa'!$A$1,$C25,X$2,1,1)","v":0},{"$f":"OFFSET('Taula Minerals-aa'!$A$1,$C25,Y$2,1,1)","v":0},{"$f":"OFFSET('Taula Minerals-aa'!$A$1,$C25,Z$2,1,1)","v":0},{"$f":"OFFSET('Taula Minerals-aa'!$A$1,$C25,AA$2,1,1)","v":0},{"$f":"OFFSET('Taula Minerals-aa'!$A$1,$C25,AB$2,1,1)","v":0},{"$f":"OFFSET('Taula Minerals-aa'!$A$1,$C25,AC$2,1,1)","v":0},{"$f":"OFFSET('Taula Minerals-aa'!$A$1,$C25,AD$2,1,1)","v":0},{"$f":"OFFSET('Taula Minerals-aa'!$A$1,$C25,AE$2,1,1)","v":0},{"$f":"OFFSET('Taula Minerals-aa'!$A$1,$C25,AF$2,1,1)","v":0},{"$f":"OFFSET('Taula Minerals-aa'!$A$1,$C25,AG$2,1,1)","v":0},{"$f":"OFFSET('Taula Minerals-aa'!$A$1,$C25,AH$2,1,1)","v":0},{"$f":"OFFSET('Taula Minerals-aa'!$A$1,$C25,AI$2,1,1)","v":0},{"$f":"OFFSET('Taula Minerals-aa'!$A$1,$C25,AJ$2,1,1)","v":0},{"$f":"OFFSET('Taula Minerals-aa'!$A$1,$C25,AK$2,1,1)","v":0},{"$f":"OFFSET('Taula Minerals-aa'!$A$1,$C25,AL$2,1,1)","v":0},{"$f":"OFFSET('Taula Minerals-aa'!$A$1,$C25,AM$2,1,1)","v":0}]
[null,null,null,null,{"$f":"SUMPRODUCT(E3:E25,'II_Plantejar Ració'!$E$4:$E$26)","v":0},{"$f":"SUMPRODUCT(F3:F25,'II_Plantejar Ració'!$E$4:$E$26)","v":0.87504904028865849},{"$f":"SUMPRODUCT(G3:G25,'II_Plantejar Ració'!$E$4:$E$26)","v":65.606449388475156},{"$f":"SUMPRODUCT(H3:H25,'II_Plantejar Ració'!$E$4:$E$26)","v":-67.759747043600001},{"$f":"SUMPRODUCT(I3:I25,'II_Plantejar Ració'!$E$4:$E$26)/SUM('II_Plantejar Ració'!$E$4:$E$26)","v":2},{"$f":"SUMPRODUCT(J3:J25,'II_Plantejar Ració'!$E$4:$E$26)","v":0.63635000000000008},{"$f":"SUMPRODUCT(K3:K25,'II_Plantejar Ració'!$E$4:$E$26)","v":0.66572000000000009},{"$f":"SUMPRODUCT(L3:L25,'II_Plantejar Ració'!$E$4:$E$26)","v":0.623},{"$f":"SUMPRODUCT(M3:M25,'II_Plantejar Ració'!$E$4:$E$26)","v":4.0939999999999994},{"$f":"SUMPRODUCT(N3:N25,'II_Plantejar Ració'!$E$4:$E$26)","v":1.0680000000000001},{"$f":"SUMPRODUCT(O3:O25,'II_Plantejar Ració'!$E$4:$E$26)","v":0.17800000000000002},{"$f":"SUMPRODUCT(P3:P25,'II_Plantejar Ració'!$E$4:$E$26)","v":0},{"$f":"SUMPRODUCT(Q3:Q25,'II_Plantejar Ració'!$E$4:$E$26)","v":0},{"$f":"SUMPRODUCT(R3:R25,'II_Plantejar Ració'!$E$4:$E$26)","v":8.9},{"$f":"SUMPRODUCT(S3:S25,'II_Plantejar Ració'!$E$4:$E$26)","v":6.23},{"$f":"SUMPRODUCT(T3:T25,'II_Plantejar Ració'!$E$4:$E$26)","v":0},{"$f":"SUMPRODUCT(U3:U25,'II_Plantejar Ració'!$E$4:$E$26)","v":0},{"$f":"SUMPRODUCT(V3:V25,'II_Plantejar Ració'!$E$4:$E$26)","v":0},{"$f":"SUMPRODUCT(W3:W25,'II_Plantejar Ració'!$E$4:$E$26)","v":0},{"$f":"SUMPRODUCT(X3:X25,'II_Plantejar Ració'!$E$4:$E$26)","v":0},{"$f":"SUMPRODUCT(Y3:Y25,'II_Plantejar Ració'!$E$4:$E$26)","v":0},{"$f":"SUMPRODUCT(Z3:Z25,'II_Plantejar Ració'!$E$4:$E$26)","v":40.850999999999999},{"$f":"SUMPRODUCT(AA3:AA25,'II_Plantejar Ració'!$E$4:$E$26)","v":43.61},{"$f":"SUMPRODUCT(AB3:AB25,'II_Plantejar Ració'!$E$4:$E$26)","v":15.536019280571155},{"$f":"SUMPRODUCT(AC3:AC25,'II_Plantejar Ració'!$E$4:$E$26)/SUM('II_Plantejar Ració'!$E$4:$E$26)","v":0.73319999999999996},{"$f":"SUMPRODUCT(AD3:AD25,'II_Plantejar Ració'!$E$4:$E$26)","v":638.19194399999992},{"$f":"SUMPRODUCT(AE3:AE25,'II_Plantejar Ració'!$E$4:$E$26)","v":45.39},{"$f":"SUMPRODUCT(AF3:AF25,'II_Plantejar Ració'!$E$4:$E$26)","v":151.30000000000001},{"$f":"SUMPRODUCT(AG3:AG25,'II_Plantejar Ració'!$E$4:$E$26)","v":335.37869999999998},{"$f":"SUMPRODUCT(AH3:AH25,'II_Plantejar Ració'!$E$4:$E$26)","v":231.4},{"$f":"SUMPRODUCT(AI3:AI25,'II_Plantejar Ració'!$E$4:$E$26)","v":44.7136},{"$f":"SUMPRODUCT(AJ3:AJ25,'II_Plantejar Ració'!$E$4:$E$26)","v":19.580000000000002},{"$f":"SUMPRODUCT(AK3:AK25,'II_Plantejar Ració'!$E$4:$E$26)","v":0},{"$f":"SUMPRODUCT(AL3:AL25,'II_Plantejar Ració'!$E$4:$E$26)/SUM('II_Plantejar Ració'!$E$4:$E$26)","v":0.58855484528181679},{"$f":"SUMPRODUCT(AM3:AM25,'II_Plantejar Ració'!$E$4:$E$26)","v":558.93341098445148}]
[null,null,null,null,{"$f":"SUMPRODUCT(E8:E19,'II_Plantejar Ració'!$E$9:$E$20)","v":0},{"$f":"SUMPRODUCT(F8:F19,'II_Plantejar Ració'!$E$9:$E$20)","v":0}]
[null,null,null,null,{"$f":"E26-E27","v":0},{"$f":"F26-F27","v":0.87504904028865849}]
[null,null,null,null,{"$f":"IF(I_Necessitats!B14=\"UFL\",1,2)","v":2}]
[]
[]
[]
[]
[]
[]
[]
[null,{"$f":"CàlculsEV!B3","v":"Poma residu deshidratat, NRC"}]
[null,{"$f":"CàlculsEV!B4","v":"Polpes (cítrics) ensitjades"}]
[null,{"$f":"CàlculsEV!B5","v":""}]
[null,{"$f":"CàlculsEV!B6","v":""}]
[null,{"$f":"CàlculsEV!B7","v":""}]
[null,{"$f":"CàlculsEV!B8","v":""}]
[null,{"$f":"CàlculsEV!B9","v":"Ordi gra"}]
[null,{"$f":"CàlculsEV!B10","v":"Colza, turtó "}]
[null,{"$f":"CàlculsEV!B11","v":"Blat de moro gra"}]
[null,{"$f":"CàlculsEV!B12","v":"Soja tortó 44"}]
[null,{"$f":"CàlculsEV!B13","v":"Mandioca"}]
[null,{"$f":"CàlculsEV!B14","v":"Ordi bagàs cerveseria sec"}]
[null,{"$f":"CàlculsEV!B15","v":"Cotó, gra"}]
[null,{"$f":"CàlculsEV!B16","v":"Llevat cerveseria"}]
[null,{"$f":"CàlculsEV!B17","v":"Grassa vegetal, mantega de porc (tots els tipus)"}]
[null,{"$f":"CàlculsEV!B18","v":"Urea"}]
[null,{"$f":"CàlculsEV!B19","v":""}]

{"sheet":"Apunts Cria","index":5,"n_rows":31,"n_cols":17,"rows_kept":31,"cut":false,"hidden":false,"merged":[[18,4,18,5],[25,3,25,7],[26,3,26,7],[19,4,19,5],[21,3,21,6],[22,3,22,5],[20,1,20,6],[10,7,10,8],[11,7,11,8],[14,1,14,7],[16,1,16,7],[17,4,17,5],[28,11,28,12],[29,11,29,12],[30,11,30,16],[7,1,7,5],[0,1,0,19],[1,1,5,19],[11,11,11,13],[11,15,11,16],[12,11,13,11],[12,12,12,14],[12,15,13,15],[12,16,13,16],[8,11,10,16],[7,11,7,16],[7,7,7,9],[9,7,9,8]]}
[null,"Cria vedells per engreix o reposició (Guia)"]
[null,"Del naixement al deslletament (6 mesos lleteres; 8,5 mesos altres). Objectiu: pes final de la cria tres vegades el pes al naixement. Després de la cria: mascles a engreix, femelles a reposició (creixement de 700 a 1.000 g/dia, potencial elevat creixement esquelet i muscles). Objectiu reposició: si part precoç, creixement alt. Objectiu engreix: si edat sacrifici precoç, creixement alt. Increment volum rumen: més farratges que concentrats. Concentrat ric en energia assegura un augment de pes alt després del deslletament.  La cria té tres períodes: 1) Calostre; 2) Fins deslletament; 3) Postdeslletament\n"]
[]
[]
[]
[]
[]
[null,"1.- Període CALOSTRE. Exemple o recomanació INRA\n",null,null,null,null,null,"Dades per a la cria",null,null,null,"2.- Període fins deslletament"]
[null,null,null,null,null,null,null,"Pes naixement, kg",null,45,null,"Setmana deslletament 8ena. Objectiu: doblar pes en néixer"]
[null,null,null,null,null,null,null,"Temps, mesos",null,4]
[null,null,null,null,null,null,null,"Pes final, kg",null,{"$f":"J9*3","v":135}]
[null,null,null,null,null,null,null,"Creixement mitjà, g/dia",null,{"$f":"1000*(J11-J9)/(J10*30.5)","v":737.70491803278685},null,"Pes objectiu al deslletament",null,null,{"$f":"2*J9","v":90},"kg"]
[null,null,null,null,null,null,null,null,null,null,null,"Tipus  aliment","Composició %",null,null,"Subm. al dia","Tª ºC"]
[null,null,null,null,null,null,null,null,null,null,null,null,"Llet entera","Aliment alletament","Aigua"]
[null,"3.- Període postdeslletament",null,null,null,null,null,null,null,null,null,"A",100,0,0,2,40]
[null,"Temps, dies",{"$f":"J10*30.5-8*7","v":66},{"$f":"C16/30.5","v":2.1639344262295084},"mesos",null,null,null,null,null,null,"B",0,13,87,2,40]
[null,"Càlcul aportacions diàries de farratges i concentrat",null,null,null,null,null,null,null,null,null,"C",0,22,78,1,40]
[null,"Farratges (bona qualitat)","MS %","UE","Composició a la ració",null,"kg MS/dia","Kg fresc/dia",null,null,null,"D",75,12.5,12.5,1,40]
[null,"Fenc",0.85,1.1000000000000001,0.32,null,{"$f":"(C26-C27)*E19","v":0.54349058745574996},{"$f":"G19/C19","v":0.63940069112441178},null,null,null,null,null,"Quantitat (kg) tipus aliment"]
[null,"Ensitjat",0.33,1.2,{"$f":"1-E19","v":0.67999999999999994},null,{"$f":"(C26-C27)*E20","v":1.1549174983434687},{"$f":"G20/C20","v":3.499749994980208},null,null,null,"Setmana","Nº dies","A","B","C","D"]
[null,"kg mescla concentrats (75 a 80% cereals; resta turtós) 1,16 UFL i 120 PDI ",null,null,null,null,null,{"$f":"IF(J12<901,1.5,3)","v":1.5},null,null,null,1,1,6,6,3,3]
[null,"CI inici període, UE",{"$f":"0.039*(J11-8*7*J12/1000)^0.9","v":2.3205042425704452},"0,039 x (Pes final - Δ kg/dia x 7 x 8)0,9",null,null,null,null,null,null,null,2,7,8,8,4,4]
[null,"CI, final període, UE",{"$f":"0.039*J11^0.9","v":3.2237770458565289},"0,039 x Pes final0,9",null,null,null,null,null,null,null,"3*",7,8,8,5,5]
[null,"CI, mitjana",{"$f":"AVERAGE(C22:C23)","v":2.7721406442134873},null,null,null,null,null,null,null,null,4,7,8,8,5,5]
[null,"UE mescla farratgera",{"$f":"D19*E19+D20*E20","v":1.1679999999999999},null,null,null,null,null,null,null,null,5,7,8,8,5,5]
[null,"Kg MS farratgera",{"$f":"C24/C25","v":2.3734080857992188},"kg MS mescla farratgera = CI/(UE mescla farratgera)",null,null,null,null,null,null,null,6,7,8,8,5,5]
[null,null,{"$f":"0.45*H21","v":0.67500000000000004},"kg MS mescla farratgera que deixa de menjar si incoporem concentrat Sg= 0,45",null,null,null,null,null,null,null,7,7,6,6,3.5,3.5]
[null,"FENC, kg",{"$f":"H19","v":0.63940069112441178},null,null,null,null,null,null,null,null,8,7,3,3,2,2]
[null,"ENSITJAT, kg",{"$f":"H20","v":3.499749994980208},null,null,null,null,null,null,null,null,"kg llet entera",null,{"$f":"SUMPRODUCT(M21:M28,N21:N28)","v":349},0,0,{"$f":"SUMPRODUCT(M21:M28,Q21:Q28)*M18/100","v":157.125}]
[null,"MESCLA CONCENTRAT, kg",{"$f":"H21","v":1.5},null,null,null,null,null,null,null,null,"kg aliment alletament",null,0,{"$f":"N29*N16/100","v":45.37},{"$f":"SUMPRODUCT(M21:M28,P21:P28)*N17/100","v":46.09},{"$f":"SUMPRODUCT(M21:M28,Q21:Q28)*N18/100","v":26.1875}]
[null,null,null,null,null,null,null,null,null,null,null,"*  A la tercera setmana s'introdueix fenc ben conservat"]

{"sheet":"NR","index":6,"n_rows":52,"n_cols":77,"rows_kept":52,"cut":false,"hidden":false,"merged":[[28,0,28,6],[29,0,29,6],[22,0,22,6],[23,0,23,6],[24,0,24,6],[25,0,25,6],[26,0,26,6],[27,0,27,6]]}
[null,null,null,null,null,null,null,null,null,null,null,null,null,null,null,null,null,null,null,null,null,null,null,null,null,null,null,null,null,null,null,null,null,null,null,null,null,null,"ok","ok"]
[null,"Pvinicial","Pvfinal","d1","d2","CDinicial %PV","CDfinal %Pv","Lipinicial %Pvbuit","Lipfinal %Pvbuit","recEN_mant Kcla/KgPV0,75","Pv adult","Pv t","GMD","Pes v t","ΔPv t","Pvbuit inicial","Pv buit final","c1","c0","Pvbuit t1","Pv buit t2","Dif pv buit","Lip_corp_i","Lip_corp_t","b1","b0","Lip_corp t1","Lip_corp t2","Dif Lip_corp","Mdel t1","Mdel t2","Dif Mdel","Prot_corp_t1","Prot_corp_t2","Dif Prot_corp ","q","km","EN mant","NecEN_guany","Ep","kpf","kf","kmf","NecUFL_mant","NecUFLguany","EfPDI","BPR máx","BPR mín","MOND g/kg MS","CI MSI","NecPDI_PEF","NecPDI_Uendo","NecPDI_epidèrmiques","NecPDI_guany","Itip","c","UFV","PDI","CI UEB","Pabs","Caabs","Mgabs","Cl","K","Na","S","Co","Cu","Mo","Iode","Fe","Mn","Se","Zn","Vit A","Vit D","Vit E"]
["1.-Vedells Engreix (finalització) gran format tardans (Xarolés, p.e)",300,800,1.1028,3.7000000000000002E-3,16,11,8,16,102,{"$f":"B3*EXP(D3)","v":903.77684284297129},{"$f":"IF(I_Necessitats!$C$6=1,I_Necessitats!$C$10,\"\")","v":600},{"$f":"IF(I_Necessitats!$C$6=1,I_Necessitats!$C$11,\"\")","v":1.03},{"$f":"IF(L3=\"\",\"\",L3+M3)","v":601.03},{"$f":"IF(L3=\"\",\"\",E3*L3*LN(K3/L3))","v":0.90942925915692163},{"$f":"B3*(100-F3)/100","v":252},{"$f":"C3*(100-G3)/100","v":712},{"$f":"LN(Q3/P3)/LN(C3/B3)","v":1.0589496802947975},{"$f":"EXP(LN(P3)-R3*LN(B3))","v":0.60014166668340529},{"$f":"IF(L3=\"\",\"\",S3*L3^R3)","v":525.02037573516213},{"$f":"IF(M3=\"\",\"\",S3*N3^R3)","v":525.97483944081853},{"$f":"IF(L3=\"\",\"\",U3-T3)","v":0.95446370565639427},{"$f":"H3*P3/100","v":20.16},{"$f":"I3*Q3/100","v":113.92},{"$f":"LN(X3/W3)/LN(Q3/P3)","v":1.66735470604674},{"$f":"EXP(LN(X3)-Y3*LN(Q3))","v":1.9975793277195834E-3},{"$f":"IF(L3=\"\",\"\",Z3*T3^Y3)","v":68.549225778688808},{"$f":"IF(M3=\"\",\"\",Z3*U3^Y3)","v":68.757136616549559},{"$f":"IF(L3=\"\",\"\",AB3-AA3)","v":0.20791083786075149},{"$f":"IF(L3=\"\",\"\",T3-AA3)","v":456.47114995647331},{"$f":"IF(L3=\"\",\"\",U3-AB3)","v":457.21770282426894},{"$f":"IF(L3=\"\",\"\",AE3-AD3)","v":0.74655286779562857},{"$f":"IF(L3=\"\",\"\",0.1436*AD3^1.0723)","v":102.05713167657947},{"$f":"IF(L3=\"\",\"\",0.1436*AE3^1.0723)","v":102.2361232398418},{"$f":"IF(L3=\"\",\"\",AH3-AG3)","v":0.17899156326232912},{"$f":"IF(M3=\"\",\"\",IF(M3>1,0.6,0.62-0.262*EXP(-3.175*M3)))","v":0.6},{"$f":"IF(L3=\"\",\"\",0.287*AJ3+0.554)","v":0.72620000000000007},{"$f":"IF(L3=\"\",\"\",(J3*L3^0.75)/1000)","v":12.365554888620929},{"$f":"IF(L3=\"\",\"\",5.48*AI3+9.39*AC3)","v":2.9331565341900201},{"$f":"IF(L3=\"\",\"\",5.48*AI3/(5.48*AI3+9.39*AC3))","v":0.33440893973578134},{"$f":"IF(L3=\"\",\"\",0.35+0.25*(1-AN3)^2)","v":0.46075286487591166},{"$f":"IF(L3=\"\",\"\",0.78*0.6+0.006)","v":0.47399999999999998},{"$f":"IF(L3=\"\",\"\",(AK3*AP3*1.5)/(AP3+0.5*AK3))","v":0.6168058774339984},{"$f":"IF(L3=\"\",\"\",AM3/AO3*AQ3/1.76)","v":2.2310177829200373},{"$f":"IF(L3=\"\",\"\",AL3/AK3*AQ3/1.76)","v":5.9675106195967951},{"$f":"IF(L3=\"\",\"\",IF(L3<550,0.64,0.47))","v":0.47},{"$f":"IF(L3=\"\",\"\",IF(L3<550,-2,-6.6))","v":-6.6},{"$f":"IF(L3=\"\",\"\",IF(L3<550,-7.5,-13.3))","v":-13.3},{"$f":"IF(L3=\"\",\"\",IF(L3<550,262,240))","v":240},{"$f":"IF(L3=\"\",\"\",95*L3^0.75/1000)","v":11.516938376656748},{"$f":"IF(AX3=\"\",\"\",(AX3*(0.5*(5.7+0.074*AW3)))/AT3)","v":287.43337693230558},{"$f":"IF(L3=\"\",\"\",0.312*L3)","v":187.2},{"$f":"IF(L3=\"\",\"\",(0.2*L3^0.6)/AT3)","v":19.761635655333862},{"$f":"IF(AI3=\"\",\"\",AI3*1000/AT3)","v":380.83311332410454},0.28399999999999997,0.54,{"$f":"IF(L3=\"\",\"\",AR3+AS3)","v":8.1985284025168319},{"$f":"IF(L3=\"\",\"\",AY3+AZ3+BA3+BB3)","v":875.22812591174397},{"$f":"IF(L3=\"\",\"\",BC3*L3^BD3)","v":8.9850400081400625},{"$f":"IF(L3=\"\",\"\",0.025*L3+(((1.2+((4.655*K3^0.22)*(L3^-0.22)))*M3)))","v":21.482831304016059},{"$f":"IF(L3=\"\",\"\",0.015*L3+(((9.83*(K3^0.22)*(L3^-0.22)*M3))))","v":20.079774805258406},{"$f":"IF(L3=\"\",\"\",(0.003*L3+0.45*M3))","v":2.2635000000000001},{"$f":"IF(L3=\"\",\"\",(0.003*L3+0.45*M3)/0.16)","v":14.146875},{"$f":"IF(L3=\"\",\"\",((2.6*AX3)+0.038*L3+1.6*M3)/0.9)","v":60.435599754786161},{"$f":"IF(L3=\"\",\"\",(0.015*L3+1.4*M3)/0.99)","v":10.547474747474748},{"$f":"IF(BP3=\"\",\"\",2*AX3)","v":23.033876753313496},{"$f":"IF(BP3=\"\",\"\",0.11*AX3)","v":1.2668632214322424},{"$f":"IF(L3=\"\",\"\",(0.0071*L3+1.15*M3)/0.04)","v":136.11250000000001},null,{"$f":"IF(L3=\"\",\"\",0.006*L3)","v":3.6},{"$f":"IF(M3=\"\",\"\",34*M3/0.1)","v":350.2},{"$f":"IF(M3=\"\",\"\",(0.002*L3+0.7*M3)/0.0075)","v":256.13333333333333},{"$f":"IF(BP3=\"\",\"\",0.3*AX3)","v":3.4550815129970243},{"$f":"IF(L3=\"\",\"\",(0.045*L3+24*M3)/0.15)","v":344.8},{"$f":"IF(L3=\"\",\"\",110*L3)","v":66000},{"$f":"IF(L3=\"\",\"\",16*L3)","v":9600},{"$f":"IF(L3=\"\",\"\",2.6*L3)","v":1560}]
["2.-Vedells Engreix (finalització)  tardans (Limousins, p.e)",330,730,1.1028,3.7000000000000002E-3,15,10.8,8,15,98,{"$f":"B4*EXP(D4)","v":994.15452712726835},{"$f":"IF(I_Necessitats!$C$6=2,I_Necessitats!$C$10,\"\")","v":""},{"$f":"IF(I_Necessitats!$C$6=2,I_Necessitats!$C$11,\"\")","v":""},{"$f":"IF(L4=\"\",\"\",L4+M4)","v":""},{"$f":"IF(L4=\"\",\"\",E4*L4*LN(K4/L4))","v":""},{"$f":"B4*(100-F4)/100","v":280.5},651.16,{"$f":"LN(Q4/P4)/LN(C4/B4)","v":1.0607464814051075},{"$f":"EXP(LN(P4)-R4*LN(B4))","v":0.59762404884316622},{"$f":"IF(L4=\"\",\"\",S4*L4^R4)","v":""},{"$f":"IF(M4=\"\",\"\",S4*N4^R4)","v":""},{"$f":"IF(L4=\"\",\"\",U4-T4)","v":""},{"$f":"H4*P4/100","v":22.44},97.673999999999992,{"$f":"LN(X4/W4)/LN(Q4/P4)","v":1.7464050658015879},{"$f":"EXP(LN(X4)-Y4*LN(Q4))","v":1.1910788018160768E-3},{"$f":"IF(L4=\"\",\"\",Z4*T4^Y4)","v":""},{"$f":"IF(M4=\"\",\"\",Z4*U4^Y4)","v":""},{"$f":"IF(L4=\"\",\"\",AB4-AA4)","v":""},{"$f":"IF(L4=\"\",\"\",T4-AA4)","v":""},{"$f":"IF(L4=\"\",\"\",U4-AB4)","v":""},{"$f":"IF(L4=\"\",\"\",AE4-AD4)","v":""},{"$f":"IF(L4=\"\",\"\",0.1436*AD4^1.0723)","v":""},{"$f":"IF(L4=\"\",\"\",0.1436*AE4^1.0723)","v":""},{"$f":"IF(L4=\"\",\"\",AH4-AG4)","v":""},{"$f":"IF(M4=\"\",\"\",IF(M4>1,0.6,0.62-0.262*EXP(-3.175*M4)))","v":""},{"$f":"IF(L4=\"\",\"\",0.287*AJ4+0.554)","v":""},{"$f":"IF(L4=\"\",\"\",(J4*L4^0.75)/1000)","v":""},{"$f":"IF(L4=\"\",\"\",5.48*AI4+9.39*AC4)","v":""},{"$f":"IF(L4=\"\",\"\",5.48*AI4/(5.48*AI4+9.39*AC4))","v":""},{"$f":"IF(L4=\"\",\"\",0.35+0.25*(1-AN4)^2)","v":""},{"$f":"IF(L4=\"\",\"\",0.78*0.6+0.006)","v":""},{"$f":"IF(L4=\"\",\"\",(AK4*AP4*1.5)/(AP4+0.5*AK4))","v":""},{"$f":"IF(L4=\"\",\"\",AM4/AO4*AQ4/1.76)","v":""},{"$f":"IF(L4=\"\",\"\",AL4/AK4*AQ4/1.76)","v":""},{"$f":"IF(L4=\"\",\"\",IF(L4<550,0.64,0.47))","v":""},{"$f":"IF(L4=\"\",\"\",IF(L4<550,-2,-6.6))","v":""},{"$f":"IF(L4=\"\",\"\",IF(L4<550,-7.5,-13.3))","v":""},{"$f":"IF(L4=\"\",\"\",IF(L4<550,262,240))","v":""},"",{"$f":"IF(AX4=\"\",\"\",(AX4*(0.5*(5.7+0.074*AW4)))/AT4)","v":""},"","","",0.22,0.56999999999999995,"","","",{"$f":"IF(L4=\"\",\"\",0.025*L4+(((1.2+((4.655*K4^0.22)*(L4^-0.22))))*M4))","v":""},"",{"$f":"IF(L4=\"\",\"\",(0.003*L4+0.45*M4)/0.16)","v":""},"","","",{"$f":"IF(BP4=\"\",\"\",2*AX4)","v":""},{"$f":"IF(BP4=\"\",\"\",0.11*AX4)","v":""},"",null,"","","",{"$f":"IF(BP4=\"\",\"\",0.3*AX4)","v":""},"","","",""]
["3.-Vedells Engreix (finalització)  precocitat mitjana (vaques rústiques)",250,680,1.4077999999999999,3.7629999999999999E-3,18,12,10,19.5,100,1021.7385517823345,{"$f":"IF(I_Necessitats!$C$6=3,I_Necessitats!$C$10,\"\")","v":""},{"$f":"IF(I_Necessitats!$C$6=3,I_Necessitats!$C$11,\"\")","v":""},"","",205,598.4,1.070572973541702,0.55537214745381425,"","","",20.5,116.68799999999999,1.6234116378034613,3.6209767752185414E-3,"","","","","","","","","","","","","","","","","","","","","","","","","","","","",0.23300000000000001,0.57499999999999996,"","","",{"$f":"IF(L5=\"\",\"\",0.025*L5+(((1.2+((4.655*K5^0.22)*(L5^-0.22)))*M5)))","v":""},"","","","","","","","",null,"","","","","","","",""]
["4.-Vedells Engreix (finalització)  precocitat alta (vaques lleteres)",200,550,1.4077999999999999,3.7629999999999999E-3,20,12,7.5,21,95,{"$f":"B6*EXP(D6)","v":817.39084142586762},{"$f":"IF(I_Necessitats!$C$6=4,I_Necessitats!$C$10,\"\")","v":""},{"$f":"IF(I_Necessitats!$C$6=4,I_Necessitats!$C$11,\"\")","v":""},"","",{"$f":"B6*(100-F6)/100","v":160},{"$f":"C6*(100-G6)/100","v":484},{"$f":"LN(Q6/P6)/LN(C6/B6)","v":1.0942171746822404},{"$f":"EXP(LN(P6)-R6*LN(B6))","v":0.48561650828981223},"","","",{"$f":"H6*P6/100","v":12},{"$f":"I6*Q6/100","v":101.64},{"$f":"LN(X6/W6)/LN(Q6/P6)","v":1.9301735479060855},{"$f":"EXP(LN(X6)-Y6*LN(Q6))","v":6.6810874924829323E-4},"","","","","","","","","","","","","","","","","","","","","","","","","","","","",0.157,0.65200000000000002,"","","","","","","","","","","","",null,"","","","","","","",""]
["5.-Bous tardans Engreix (finalització) de 20 a 33 mesos",500,750,0.629,3.5000000000000001E-3,12,10,11,16.5,106,{"$f":"B7*EXP(D7)","v":937.86695358875579},{"$f":"IF(I_Necessitats!$C$6=5,I_Necessitats!$C$10,\"\")","v":""},{"$f":"IF(I_Necessitats!$C$6=5,I_Necessitats!$C$11,\"\")","v":""},"","",{"$f":"B7*(100-F7)/100","v":440},675,{"$f":"LN(Q7/P7)/LN(C7/B7)","v":1.0554248821974188},{"$f":"EXP(LN(P7)-R7*LN(B7))","v":0.62358057424616431},"","","",{"$f":"H7*P7/100","v":48.4},111.375,{"$f":"LN(X7/W7)/LN(Q7/P7)","v":1.9474857158171002},{"$f":"EXP(LN(X7)-Y7*LN(Q7))","v":3.4415892281846515E-4},"","","","","","","","","","","","","","","","","","","","","","","","","","","","",0.2205,0.6,"","","","","","","","","","","","",null,"","","","","","","",""]
["6.-Bous precoces Engreix (finalització) de 24 a 28 mesos",540,660,0.629,3.5000000000000001E-3,13,11,16,21.2,108,1012.8963098758563,{"$f":"IF(I_Necessitats!$C$6=6,I_Necessitats!$C$10,\"\")","v":""},{"$f":"IF(I_Necessitats!$C$6=6,I_Necessitats!$C$11,\"\")","v":""},"","",469.8,587.4,1.1132614357328656,0.426623144468049,"","","",75.168000000000006,124.52879999999999,2.2596857048659671,6.8920648659404643E-5,"","","","","","","","","","","","","","","","","","","","","","","","","","","","",0.24249999999999999,0.6,"","","","","","","","","","","","",null,"","","","","","","",""]
["7.-Vedelles tardanes Engreix (finalització)  de 15 a 30 mesos",450,700,0.61739999999999995,3.5000000000000001E-3,13,10,13,18,106,834.34549800259833,{"$f":"IF(I_Necessitats!$C$6=7,I_Necessitats!$C$10,\"\")","v":""},{"$f":"IF(I_Necessitats!$C$6=7,I_Necessitats!$C$11,\"\")","v":""},"","",391.5,630,1.0767293766720827,0.54442731971748293,"","","",50.895000000000003,113.4,1.6840423272600518,2.1898031737106927E-3,"","","","","","","","","","","","","","","","","","","","","","","","","","","","",0.2205,0.6,"","","","","","","","","","","","",null,"","","","","","","",""]
["8.-Vedells tardans Creixement  de 8 a 24 mesos",300,540,1.1140000000000001,2.5000000000000001E-3,16,12,8,11,94,913.95604058383685,{"$f":"IF(I_Necessitats!$C$6=8,I_Necessitats!$C$10,\"\")","v":""},{"$f":"IF(I_Necessitats!$C$6=8,I_Necessitats!$C$11,\"\")","v":""},"","",252,475.2,1.0791443876030082,0.53484635613701059,"","","",20.16,52.271999999999998,1.5020500979887643,4.9827214589203243E-3,"","","","","","","","","","","","","","","","","","","","","","","","","","","","",3.4590000000000003E-2,0.9,"","","","","","","","","","","","",null,"","","","","","","",""]
["9.-Vedells precoces Creixement de 6 a 24 mesos",200,520,1.5013000000000001,2.5000000000000001E-3,20,13,7.5,18,94,897.50381095966964,{"$f":"IF(I_Necessitats!$C$6=9,I_Necessitats!$C$10,\"\")","v":""},{"$f":"IF(I_Necessitats!$C$6=9,I_Necessitats!$C$11,\"\")","v":""},"","",160,452.4,1.0877870007912813,0.50244608307753336,"","","",12,81.432000000000002,1.8422885252734345,1.0436534033345067E-3,"","","","","","","","","","","","","","","","","","","","","","","","","","","","",3.1150000000000001E-2,0.9,"","","","","","","","","","","","",null,"","","","","","","",""]
["10.-Vedelles tardanes Creixement de 8 a 28 mesos",300,600,1.1140000000000001,2.5000000000000001E-3,18,13,9,14,94,913.95604058383685,{"$f":"IF(I_Necessitats!$C$6=10,I_Necessitats!$C$10,\"\")","v":""},{"$f":"IF(I_Necessitats!$C$6=10,I_Necessitats!$C$11,\"\")","v":""},"","",246,522,1.0853914912306448,0.50383551168200769,"","","",22.14,73.08,1.5872811107930809,3.5488813836110746E-3,"","","","","","","","","","","","","","","","","","","","","","","","","","","","",3.4590000000000003E-2,0.9,"","","","","","","","","","","","",null,"","","","","","","",""]
["11.-Vedelles lleteres Creixement de 6 a 24 mesos",150,600,1.5013000000000001,2.5000000000000001E-3,20,13,9,21,94,673.12785821975217,{"$f":"IF(I_Necessitats!$C$6=11,I_Necessitats!$C$10,\"\")","v":""},{"$f":"IF(I_Necessitats!$C$6=11,I_Necessitats!$C$11,\"\")","v":""},"","",120,522,1.0605077004806829,0.59077173527844518,"","","",10.8,109.62,1.5763241609572423,5.7011192121906463E-3,"","","","","","","","","","","","","","","","","","","","","","","","","","","","",3.9149999999999997E-2,0.9,"","","","","","","","","","","","",null,"","","","","","","",""]
[]
[{"$f":"I_Necessitats!C6","v":1}]
[{"$f":"IF($A$15=1,A3,IF($A$15=2,A4,IF($A$15=3,A5,IF($A$15=4,A6,IF($A$15=5,A7,IF($A$15=6,A8,IF($A$15=7,A9,IF($A$15=8,A10,IF($A$15=9,A11,IF($A$15=10,A12,A13))))))))))","v":"1.-Vedells Engreix (finalització) gran format tardans (Xarolés, p.e)"},{"$f":"IF($A$15=1,B3,IF($A$15=2,B4,IF($A$15=3,B5,IF($A$15=4,B6,IF($A$15=5,B7,IF($A$15=6,B8,IF($A$15=7,B9,IF($A$15=8,B10,IF($A$15=9,B11,IF($A$15=10,B12,B13))))))))))","v":300},{"$f":"IF($A$15=1,C3,IF($A$15=2,C4,IF($A$15=3,C5,IF($A$15=4,C6,IF($A$15=5,C7,IF($A$15=6,C8,IF($A$15=7,C9,IF($A$15=8,C10,IF($A$15=9,C11,IF($A$15=10,C12,C13))))))))))","v":800},null,null,null,null,null,null,null,{"$f":"IF($A$15=1,K3,IF($A$15=2,K4,IF($A$15=3,K5,IF($A$15=4,K6,IF($A$15=5,K7,IF($A$15=6,K8,IF($A$15=7,K9,IF($A$15=8,K10,IF($A$15=9,K11,IF($A$15=10,K12,K13))))))))))","v":903.77684284297129},{"$f":"SUM(L3:L13)","v":600},{"$f":"SUM(M3:M13)","v":1.03},601.03,0.90942925915692163,2976.8,6309.5599999999995,11.842732584631831,5.965285095876891,525.02037573516213,525.97483944081853,0.95446370565639427,314.66300000000001,1095.6298000000002,19.366502600513517,2.535700185724761E-2,{"$f":"SUM(AA3:AA13)","v":68.549225778688808},{"$f":"SUM(AB3:AB13)","v":68.757136616549559},0.20791083786075149,456.47114995647331,457.21770282426894,0.74655286779562857,102.05713167657947,102.2361232398418,0.17899156326232912,0.6,0.72620000000000007,12.365554888620929,2.9331565341900201,0.33440893973578134,0.46075286487591166,0.47399999999999998,0.6168058774339984,2.2310177829200373,5.9675106195967951,0.47,-6.6,-13.3,240,11.516938376656748,287.43337693230558,187.2,19.761635655333862,380.83311332410454,1.7169799999999997,7.737000000000001,8.1985284025168319,875.22812591174397,8.9850400081400625,21.482831304016059,20.079774805258406,2.2635000000000001,14.146875,60.435599754786161,10.547474747474748,23.033876753313496,1.2668632214322424,136.11250000000001,0,3.6,350.2,256.13333333333333,3.4550815129970243,344.8,66000,9600,1560]
[null,null,null,null,null,null,null,null,null,null,null,null,null,null,null,null,null,null,null,null,null,null,null,null,null,null,null,null,null,null,null,null,null,null,null,null,null,null,null,null,null,null,null,null,null,null,null,null,null,null,null,{"$f":"AZ16/AY16","v":0.65128135778082619}]
[]
[]
["Farratge i complementació"]
["Pinso i palla"]
[]
["Dades orientatives: Vedelles precoces de 350 a 600 kg; GPV de 0,8 a 1,2 kg; Pv adult = 700 kg"]
["Dades orientatives: Vedelles carn gran format (Llemosina, Blonda) de 450 a 600 kg; GPV de 0,8 a 1,2 kg.; Pv adult = 850 kg"]
["Dades orientatives: Vedelles carn tardanes (Xarolés i creuaments) de 450 a 600 kg; GPV de 0,8 a 1,2 kg; Pv adult = 850 kg\n"]
["Dades orientatives: Vedells frisons de 150 a 650 kg; GPV de 0,8 a 1,6 kg. Pv adult = 750 kg\n"]
["Dades orientatives: Vedells altres lleteres i creuaments Xarolés de 200 a 550 kg; GPV d'1 a 1,6 kg; Pv adult = 750 kg\n"]
["Dades orientatives: Vedells rústiques de 250 a 800 kg; GPV d'1 a 2 kg; Pv adult = 750 kg",null,null,null,null,null,null,"Padult",{"$f":"450*EXP(I9*(1-EXP(-J9*B9)))","v":29546986111.798729},{"$f":"J9*I28*LN((D9*EXP(I9))/I28)","v":-20644405017598.027},null,{"$f":"(I28-D9)/B9","v":65659969.135958508}]
["Dades orientatives: Vedells carn gran format (Llemosina, Blonda) de 300 a 650 kg; GPV d'1 a 2 kg; Pv adult = 900 kg\n\n"]
["Dades orientatives: Vedells carn tardanes  (Xarolés i creuaments alletants) de 300 a 700 kg; GPV d'1 a 2 kg; Pv adult = 900 kg\n"]
[]
[]
[]
["Pes naixement 47 kg. Deslletament a 6-8 mesos. Vedell de 15 mesos Pv = 550 kg. Guany mitjà diari 1.400 g. IC (4,6) Rendiment a la canal 65-70%. Rendiment carnisser 79-85% carn.",null,null,null,null,null,null,null,null,null,null,null,null,null,null,null,null,null,null,null,null,null,"Charolais"]
["Pes naixement 42 kg. Deslletament a 7-8 mesos. Vedell de 15 mesos Pv = 550 kg Guany mitjà diari 1.500 g. Rendiment canal 70%. Rendiment carnisser 73% carn.",null,null,null,null,null,null,null,null,null,null,null,null,null,null,null,null,null,null,null,null,null,"Limousin"]
["Guany mitjà diari 1.500 a 1.700 g. Aprofitament dels vedells en escorxador de 65 fins a 68 %. Aprofitament de carn neta 75% fins a 80 %.",null,null,null,null,null,null,null,null,null,null,null,null,null,null,null,null,null,null,null,null,null,"Blonde d’Aquitaine"]
["Guany mitjà diari:  1.400 g. Vedell a  12 mesos (480 kg); Vedell 15-16 mesos (650 kg); Precoç; Edat al primer part 32 mesos; Rendiment canal 66%. ",null,null,null,null,null,null,null,null,null,null,null,null,null,null,null,null,null,null,null,null,null,"Blanc blau belga"]
["Pes naixement 47 kg. Guany mitjà diari: 1.300 a 1.400 g. Vedell a 12 mesos (510 kg); Rendiments canal de 57 a 60%. ",null,null,null,null,null,null,null,null,null,null,null,null,null,null,null,null,null,null,null,null,null,"Fleckvieh-Simmenthal"]
["Guany mitjà diari: 1.560 g. IC (4,1) fins 460 kg.; Guany mitjà diari: 1.580 g. IC (4,3) fins 550 kg. Rendiment canal: 60%. Rendiment carnisser 73% carn, 8,8% greix, 18,1% os. Producció de añojo (anoll): cicle curt (14 mesos i 500 kg), cicle mitjà (18 mesos i 600 kg). Guany mitjà diari:1.400 g. IC (4,2) fins 460 kg.; Guany mitjà diari:1.530 g. IC (4,3) fins 550 kg.; Rendiment canal: 64%. Rendiment carnisser 76,9% carn, 7,1% greix, 16% os.",null,null,null,null,null,null,null,null,null,null,null,null,null,null,null,null,null,null,null,null,null,"Rubia Gallega"]
["Vedells 9-10 mesos (300-350 kg), Vedells 12 mesos (430 kg). Anoll pesat (550-600 kg). Guany mitjà diari:1.540 g. IC (4,3) fins 300 kg.; Guany mitjà diari:1.670 g. IC (4,1) fins 460 kg.; Guany mitjà diari:1.750 g. IC (4,3) fins 550 kg.",null,null,null,null,null,null,null,null,null,null,null,null,null,null,null,null,null,null,null,null,null,"Pirinenca"]
["Vedells “pastero”  5-6 mesos (120-130 kg).  ",null,null,null,null,null,null,null,null,null,null,null,null,null,null,null,null,null,null,null,null,null,"Tudanca"]
["Vedell 12 mesos (323 kg), Guany mitjà diari:1.940 g. IC (3,6) fins 300 kg.; Guany mitjà diari:1.350 g. IC (4,4) fins 460 kg.; Guany mitjà diari:1.590 g. IC (4,6) fins 550 kg.",null,null,null,null,null,null,null,null,null,null,null,null,null,null,null,null,null,null,null,null,null,"Avileña-Negra Iberica"]
["Vedell 12 mesos (393 kg). Guany mitjà diari:1.360 g. IC (5,1) fins 300 kg.; Guany mitjà diari:1.510 g. IC (4,8) fins 460 kg.; Guany mitjà diari:1.400 g. IC (5,1) fins 550 kg.",null,null,null,null,null,null,null,null,null,null,null,null,null,null,null,null,null,null,null,null,null,"Retinto"]
["Vedell pastero 5-9 mesos (pesos escassos i variables). Guany mitjà diari:1.200 g. IC (4,1) fins 300 kg.; Guany mitjà diari:1.240 g. IC (4,6) fins 460 kg.; Guany mitjà diari:1.280 g. IC (4,9) fins 550 kg. Rendiment canal: 56%. ",null,null,null,null,null,null,null,null,null,null,null,null,null,null,null,null,null,null,null,null,null,"Morucha"]
["Pes mitjà vaques 600-700 kg, mascles 800-1.100 kg. Pes viu sacrifici 550 kg.  Guany mitjà diari:1.850 g. IC (3,9) fins 300 kg.; Guany mitjà diari: 1.690 g. IC (4,1) fins 460 kg.; Guany mitjà diari: 1.740 g. IC (4,2) fins 550 kg. Rendiment canal: 60,9%. Rendiment carnisser: 71,7% carn, 10% greix, 18,3% os.",null,null,null,null,null,null,null,null,null,null,null,null,null,null,null,null,null,null,null,null,null,"Bruna, Parda"]
[]
["Frisona-Holstein; Bruna Suïssa; Jersey; Ayshire;  Guernsey; Menorquina; Shorthorn; Tarentaise;  Normanda; Montbeliarda; Abondance; Danesa  vermella; Bretona; Simental o Fleckvieh, etc."]
["Blonde d’Aquitaine; Charolaise; Blanc blau belga;  Limousin; Hereford; Aberdeen angus;  Shorthorn  Durhan; Piamontesa; Rubia Gallega;  Asturiana de los  valles; Retinta; Bruna; etc.",null,null,null,null,null,null,null,null,null,null,null,null,null,null,null,null,null,null,null,null,null,"Llet "]
["Brunes, Aubrac, Salers, Retinta, Avilenya,  Morucha, Cachena, Tudanca, Asturiana de los montes, etc.",null,null,null,null,null,null,null,null,null,null,null,null,null,null,null,null,null,null,null,null,null,"Carn"]
[null,null,null,null,null,null,null,null,null,null,null,null,null,null,null,null,null,null,null,null,null,null,"Rústiques"]
[]
["Fase d’engreix (del deslletament endavant): En el punt d’inflexió el creixement és màxim, el pes a la pubertat és 2/3 del pes adult. Si l’alimentació és adequada les vedelles de raça lletera arriben a la pubertat entre 9 i 11 mesos, i els vedells entre 11 i 12 mesos. A les races de carn el període és més llarg. "]

{"sheet":"I_Necessitats","index":7,"n_rows":39,"n_cols":15,"rows_kept":39,"cut":false,"hidden":false,"merged":[[3,9,9,13],[41,0,62,5],[41,6,51,9],[52,6,62,9],[46,10,56,13],[17,4,17,5],[18,4,18,5],[3,14,9,16],[10,9,13,16],[0,9,0,16],[2,0,3,8],[4,1,4,6],[1,9,1,13],[1,14,1,16],[0,0,1,8],[10,3,10,5],[11,3,11,4],[11,5,11,6],[11,1,11,2],[12,1,12,2],[7,1,7,2],[8,1,8,2],[9,3,9,5]]}
["Producció de carn: Engreix i finalització",null,null,null,null,null,null,null,null,"Guies"]
[null,null,null,null,null,null,null,null,null,"Característiques d'algunes races",null,null,null,null,"Races de llet, carn, rústiques"]
[null,null,null,null,null,null,null,null,null,7,null,null,null,null,1]
[null,null,null,null,null,null,null,null,null,{"$f":"IF(J3=1,NR!A34,IF(J3=2,NR!A35,IF(J3=3,NR!A36,IF(J3=4,NR!A37,IF(J3=5,NR!A38,IF(J3=6,NR!A39,IF(J3=7,NR!A40,IF(J3=8,NR!A41,IF(J3=9,NR!A42,IF(J3=10,NR!A43,IF(J3=11,NR!A44,IF(J3=12,NR!A45))))))))))))","v":"Vedells 9-10 mesos (300-350 kg), Vedells 12 mesos (430 kg). Anoll pesat (550-600 kg). Guany mitjà diari:1.540 g. IC (4,3) fins 300 kg.; Guany mitjà diari:1.670 g. IC (4,1) fins 460 kg.; Guany mitjà diari:1.750 g. IC (4,3) fins 550 kg."},null,null,null,null,{"$f":"IF(O3=1,NR!A47,IF(O3=2,NR!A48,IF(O3=3,NR!A49)))","v":"Frisona-Holstein; Bruna Suïssa; Jersey; Ayshire;  Guernsey; Menorquina; Shorthorn; Tarentaise;  Normanda; Montbeliarda; Abondance; Danesa  vermella; Bretona; Simental o Fleckvieh, etc."}]
[null,"Elegir tipus de boví"]
[null,null,1]
[null,"Dades orientatives"]
[null,"Pes viu inicial a partir de",null,{"$f":"NR!B16","v":300}]
[null,"Pes viu final fins a ",null,{"$f":"NR!C16","v":800}]
[null,"Pes inici",600,"Per al pes inicial: GMD, kg/dia al voltant de...",null,null,{"$f":"NR!O16","v":0.90942925915692163}]
[null,"GMD, kg/dia",1.03,"Període racionament, temps en dies",null,null,30,null,null,"Fase d’engreix (del deslletament endavant): En el punt d’inflexió el creixement és màxim, el pes a la pubertat és 2/3 del pes adult. Si l’alimentació és adequada les vedelles de raça lletera arriben a la pubertat entre 9 i 11 mesos, i els vedells entre 11 i 12 mesos. A les races de carn el període és més llarg. "]
[null,{"$f":"IF(C11>1.15*G10,\"GMD excessiu\",IF(C11<0.85*G10,\"GMD tan baix?\",\"GMD normal\"))","v":"GMD normal"},null,"Possible pes final assolit",null,{"$f":"IF(C10+C11*G11>D9*1.2,\"Temps excessiu\",C10+C11*G11)","v":630.9}]
[null,"Necessitats Totals"]
[null,{"$f":"IF(C6>=8,\"UFL\",\"UFV\")","v":"UFV"},{"$f":"NR!BE16","v":8.1985284025168319},null,"Dades per al racionament"]
[null,"PDI",{"$f":"NR!BF16","v":875.22812591174397},null,"Elegir modalitat racionament"]
[null,"Ca",{"$f":"NR!BI16","v":20.079774805258406},null,1]
[null,"P",{"$f":"NR!BH165","v":0}]
[null,"CI, UEB",{"$f":"NR!BG16","v":8.9850400081400625},null,"Tolerància càlculs (%)",null,12.5,null,{"$f":"E16","v":1}]
[null,"Mg",{"$f":"NR!BJ16","v":2.2635000000000001},null,"Mínim % MS Farratge",null,40]
[null,"Cl",{"$f":"NR!BK16","v":14.146875},null,null,null,"                                                                                                                                 "]
[null,"K",{"$f":"NR!BL16","v":60.435599754786161}]
[null,"Na",{"$f":"NR!BM16","v":10.547474747474748}]
[null,"S",{"$f":"NR!BN16","v":23.033876753313496}]
[null,"Co",{"$f":"NR!BO16","v":1.2668632214322424}]
[null,"Cu",{"$f":"NR!BP16","v":136.11250000000001}]
[null,"Mo",{"$f":"NR!BQ16","v":0}]
[null,"Iode",{"$f":"NR!BR16","v":3.6}]
[null,"Fe",{"$f":"NR!BS16","v":350.2}]
[null,"Mn",{"$f":"NR!BT16","v":256.13333333333333}]
[null,"Se",{"$f":"NR!BU16","v":3.4550815129970243}]
[null,"Zn",{"$f":"NR!BV16","v":344.8}]
[null,"Vit A",{"$f":"NR!BW16","v":66000}]
[null,"Vit D",{"$f":"NR!BX16","v":9600}]
[null,"Vit E",{"$f":"NR!BY16","v":1560}]
[null,"Gproteïnes/EfPDI",{"$f":"NR!AI16*1000/NR!AT16","v":380.83311332410454}]
[null,"CI, MSI",{"$f":"NR!AX16","v":11.516938376656748}]
[null,"EfPDI",{"$f":"NR!AT16","v":0.47}]
[null,"BPR màxim",{"$f":"NR!AU16","v":-6.6}]
[null,"BPR mínim",{"$f":"NR!AV16","v":-13.3}]

{"sheet":"II_Plantejar Ració","index":8,"n_rows":81,"n_cols":15,"rows_kept":81,"cut":false,"hidden":false,"merged":[[27,4,27,6],[32,4,32,5],[9,12,9,13],[7,13,7,14],[8,12,8,13],[9,7,9,9],[16,7,16,9],[17,7,17,9],[15,7,15,9],[19,11,21,11],[19,12,21,12],[10,7,10,9],[18,7,18,11],[14,7,14,9],[10,11,10,12],[11,7,11,9],[0,0,0,6],[1,0,2,0],[1,1,1,2],[1,3,1,5],[2,7,3,9],[0,7,1,14],[12,7,12,9],[13,7,13,9],[4,7,4,9],[5,7,5,9],[6,7,6,9],[7,7,7,9],[8,7,8,9]]}
["Selecció d'ingredients, límits d'incorporació i preu",null,null,null,null,null,null,"Full no protegit. Només s'han de seleccionar els ingredients, i per a cadascun d'ells afegir les quantitats mínimes i màximes, que mai no han de ser negatives, i el preu de cadacun d'ells"]
[null,"Límits d'incorporació",null,"Càlculs",null,null,"Preu Ingredient"]
[null,"kg mín","kg màx","kg fresc","kg MS","% fresc ració","€/kg fresc","kg fresc total"]
[null,0,100,1,{"$f":"D4*CàlculsEV!D3/100","v":0.89},{"$f":"(D4*100)/$K$4","v":100},0.04,null,null,null,{"$f":"SUM(D4:D26)","v":1},{"$f":"K22","v":89},"%MS"]
[0,0,5,0,{"$f":"D5*CàlculsEV!D4/100","v":0},0,0.03,"kg farratge fresc total",null,null,{"$f":"SUM(D4:D8)","v":1}]
[0,0,0,0,{"$f":"D6*CàlculsEV!D5/100","v":0},0,0.03,"kg concentrat fresc total",null,null,{"$f":"K4-K5","v":0}]
[0,0,0,0,{"$f":"D7*CàlculsEV!D6/100","v":0},0,0.01,"Aportacions totals UE",null,null,{"$f":"SUMPRODUCT($E$4:$E$8,CàlculsEV!E3:E7)","v":0},{"$f":"L23","v":{"$error":"#DIV/0!"}},"UE/kg MS"]
[0,0,0,0,{"$f":"D8*CàlculsEV!D7/100","v":0},0,0.03,"kg MS total",null,null,{"$f":"SUM(E4:E26)","v":0.89},{"$f":"I_Necessitats!C36","v":11.516938376656748},{"$f":"K8-L8","v":-10.626938376656748},"<--- Diferència MSI real i calculada"]
[0,0,0,0,{"$f":"D9*CàlculsEV!D8/100","v":0},0,0.21,"kg MS total farratge",null,null,{"$f":"SUM(E4:E8)","v":0.89},null,{"$f":"I_Necessitats!E18","v":"Tolerància càlculs (%)"},null,{"$f":"I_Necessitats!G18","v":12.5}]
[0,0,4,0,{"$f":"D10*CàlculsEV!D9/100","v":0},0,0.21,"kg MS total concentrat",null,null,{"$f":"K8-K9","v":0},{"$f":"K7/K9","v":0},{"$f":"I_Necessitats!E19","v":"Mínim % MS Farratge"},null,{"$f":"I_Necessitats!G19","v":40}]
[0,0,6,0,{"$f":"D11*CàlculsEV!D10/100","v":0},0,0.3,"% MS farratge a la ració",null,null,{"$f":"(K9*100)/K8","v":100}]
[0,0,8,0,{"$f":"D12*CàlculsEV!D11/100","v":0},0,0.64300000000000002,"PCO",null,null,{"$f":"(K10)/K8","v":0},"Auxiliar càlcul Sg","A",{"$f":"IF(N17-0.85<0,1,1-(1.26*(N17-0.85)^0.84))","v":1}]
[0,0,2,0,{"$f":"D13*CàlculsEV!D12/100","v":0},0,0.15,"Relació UF/UEB farratge",null,null,{"$f":"SUMPRODUCT($E$4:$E$8,CàlculsEV!$F$3:$F$7)/SUMPRODUCT($E$4:$E$8,CàlculsEV!$E$3:$E$7)","v":{"$error":"#DIV/0!"}},null,"D",{"$f":"(1/N17)-N12","v":{"$error":"#DIV/0!"}}]
[0,0,0,0,{"$f":"D14*CàlculsEV!D13/100","v":0},0,0.12,"Taxa de substitució global",null,null,{"$f":"(0.86/N17)*(1-N15*EXP(-N14/(1-K12)))","v":{"$error":"#DIV/0!"}},null,"B",{"$f":"N17/(2.04*N13)","v":{"$error":"#DIV/0!"}}]
[0,0,0,0,{"$f":"D15*CàlculsEV!D14/100","v":0},0,0.312,null,null,null,null,null,"K",{"$f":"N17*N13*EXP(N14/0.7)","v":{"$error":"#DIV/0!"}}]
[0,0,0,0,{"$f":"D16*CàlculsEV!D15/100","v":0},0,0.215,"VALOR FUNCIÓ OBJECTIU €/ració",null,null,{"$f":"SUMPRODUCT(D4:D26,G4:G26)","v":0.04},null,"UEc",{"$f":"0.86*(1-N15*EXP(-N14/(1-K12)))","v":{"$error":"#DIV/0!"}},{"$f":"N16/N17","v":{"$error":"#DIV/0!"}}]
[0,0,0.5,0,{"$f":"D17*CàlculsEV!D16/100","v":0},0,0.14599999999999999,"COST PART FARRATGERA",null,null,{"$f":"SUMPRODUCT(D4:D8,G4:G8)","v":0.04},null,"UEf",{"$f":"K7/K9","v":0}]
[null,0,0.2,0,{"$f":"D18*CàlculsEV!D17/100","v":0},0,0.13600000000000001,"COST PART CONCENTRADA",null,null,{"$f":"K16-K17","v":0}]
[0,0,0.3,0,{"$f":"D19*CàlculsEV!D18/100","v":0},0,0.438,"Paràmetres nutritius, límits, valors finals"]
[0,0,0,0,{"$f":"D20*CàlculsEV!D19/100","v":0},0,0.6,"Paràmetres","Mínim","Màxim","Valor","Valor/kg MS o %","En alguns ingredients de la ració no hi consten els nutrients ..."]
[0,0,1,0,{"$f":"D21*CàlculsEV!D20/100","v":0},0,0.28999999999999998,"MSI (kg/dia)",0,999,{"$f":"K8","v":0.89}]
[0,0,1,0,{"$f":"D22*CàlculsEV!D21/100","v":0},0,6.7000000000000004E-2,"%MS ració",0,999,{"$f":"SUMPRODUCT(F4:F26,CàlculsEV!D3:D25)/100","v":89}]
[null,0,0,0,{"$f":"D23*CàlculsEV!D22/100","v":0},0,0.28499999999999998,"UEB",{"$f":"0.7*I_Necessitats!C18","v":6.2895280056980436},{"$f":"I_Necessitats!C18","v":8.9850400081400625},{"$f":"CàlculsEV!E26+0.86*(1-'II_Plantejar Ració'!N15*EXP(-'II_Plantejar Ració'!N14/(1-'II_Plantejar Ració'!K12)))","v":{"$error":"#DIV/0!"}},{"$f":"K23/$K$8","v":{"$error":"#DIV/0!"}},{"$f":"CàlculsEV!AN$21","v":"UEB"}]
[null,0,0,0,{"$f":"D24*CàlculsEV!D23/100","v":0},0,0.01,{"$f":"I_Necessitats!B14","v":"UFV"},{"$f":"IF(I_Necessitats!E16=2,I_Necessitats!C14,I_Necessitats!C14*B47/B48)","v":7.6449927892226643},{"$f":"IF(I_Necessitats!E16=2,I_Necessitats!C14,I_Necessitats!C14*B47/B48)","v":7.6449927892226643},{"$f":"CàlculsEV!F26","v":0.87504904028865849},{"$f":"K24/$K$8","v":0.98320116886366116},{"$f":"CàlculsEV!AO$21","v":""}]
[null,0,0,0,{"$f":"D25*CàlculsEV!D24/100","v":0},0,0.01,"PDI",{"$f":"((100-$O$9)/100)*(G32+(G33+M8*0.5*(5.7+0.074*B57)/B79)*G34/B79)","v":493.3707347173202},{"$f":"(100+$O$9)/100*(G32+(G33+M8*0.5*(5.7+0.074*B57)/B79)*G34/B79)","v":634.33380177941171},{"$f":"CàlculsEV!G26","v":65.606449388475156},{"$f":"K25/$K$8","v":73.715111672443996},{"$f":"CàlculsEV!AP$21","v":""}]
[null,0,0,0,{"$f":"D26*CàlculsEV!D25/100","v":0},0,0.01,"BPR",{"$f":"ABS(I_Necessitats!C39)","v":13.3},{"$f":"ABS(I_Necessitats!C38)","v":6.6},{"$f":"CàlculsEV!H26","v":-67.759747043600001},{"$f":"ABS(K26/K21)","v":76.134547240000003},{"$f":"CàlculsEV!AQ$21","v":""}]
[null,null,null,null,null,{"$f":"SUM(F4:F26)","v":100},null,"NI",{"$f":"CàlculsEV!I26","v":2},{"$f":"CàlculsEV!I26","v":2},{"$f":"K21*100/I_Necessitats!C10","v":0.14833333333333334},{"$f":"K27","v":0.14833333333333334},{"$f":"CàlculsEV!AR$21","v":""}]
["Efecte NI",null,null,null,{"$f":"I_Necessitats!B7","v":"Dades orientatives"},null,null,"Ca",{"$f":"((100-$O$9)/100)*I_Necessitats!C16","v":17.569802954601105},{"$f":"(100+$O$9)/100*I_Necessitats!C16","v":22.589746655915707},{"$f":"CàlculsEV!J26","v":0.63635000000000008},{"$f":"K28/$K$8","v":0.71500000000000008},{"$f":"CàlculsEV!AS$21","v":""}]
["NIref",{"$f":"J27","v":2},null,null,null,"CI",{"$f":"I_Necessitats!C18","v":8.9850400081400625},"P",{"$f":"((100-$O$9)/100)*I_Necessitats!C17","v":0},{"$f":"(100+$O$9)/100*I_Necessitats!C17","v":0},{"$f":"CàlculsEV!K26","v":0.66572000000000009},0.74800000000000011,{"$f":"CàlculsEV!AT21","v":""}]
["NI % PV",{"$f":"K27","v":0.14833333333333334},null,null,null,"UFV",{"$f":"I_Necessitats!C14","v":8.1985284025168319},"Mg",{"$f":"((100-$O$9)/100)*I_Necessitats!C19","v":1.9805625},{"$f":"(100+$O$9)/100*I_Necessitats!C19","v":2.5464375000000001},{"$f":"CàlculsEV!L26","v":0.623},0.7,{"$f":"CàlculsEV!AU21","v":""}]
["dMOm",{"$f":"76-2.74*B30","v":75.593566666666661},null,null,null,"PDI",{"$f":"I_Necessitats!C15","v":875.22812591174397},"K",{"$f":"((100-$O$9)/100)*I_Necessitats!C21","v":52.881149785437891},{"$f":"(100+$O$9)/100*I_Necessitats!C21","v":67.990049724134437},{"$f":"CàlculsEV!M26","v":4.0939999999999994},4.5999999999999996,{"$f":"CàlculsEV!AV21","v":""}]
["Δ dMO_NI ",{"$f":"-2.74*(B30-B29)/100","v":5.0735666666666672E-2},null,null,null,"NecPDI_PUendo",{"$f":"B68","v":187.2},"Na",{"$f":"((100-$O$9)/100)*I_Necessitats!C22","v":9.2290404040404042},{"$f":"(100+$O$9)/100*I_Necessitats!C22","v":11.865909090909092},{"$f":"CàlculsEV!N26","v":1.0680000000000001},1.2,{"$f":"CàlculsEV!AW21","v":""}]
["Efecte %Co (PCO)",null,null,null,"PDI - NecPDI_PUendo",null,{"$f":"G31-G32","v":688.02812591174393},"S",{"$f":"((100-$O$9)/100)*I_Necessitats!C23","v":20.154642159149308},{"$f":"(100+$O$9)/100*I_Necessitats!C23","v":25.913111347477685},{"$f":"CàlculsEV!O26","v":0.17800000000000002},0.2,{"$f":"CàlculsEV!AX21","v":""}]
["PCO",{"$f":"K12","v":0},null,null,null,"EfPDI",{"$f":"I_Necessitats!C37","v":0.47},"Cl",{"$f":"((100-$O$9)/100)*I_Necessitats!C20","v":12.378515625},{"$f":"(100+$O$9)/100*I_Necessitats!C20","v":15.915234374999999},{"$f":"CàlculsEV!P26","v":0},0,{"$f":"CàlculsEV!AY21","v":"Cl"}]
["Δ dMO_CO ",{"$f":"IF(B34=0,0,(-6.5/(1+(0.35/B34)^3))/100)","v":0},null,null,null,null,null,"Co",{"$f":"((100-$O$9)/100)*I_Necessitats!C24","v":1.1085053187532121},{"$f":"(100+$O$9)/100*I_Necessitats!C24","v":1.4252211241112727},{"$f":"CàlculsEV!Q26","v":0},0,{"$f":"CàlculsEV!AZ21","v":"Co"}]
["Efecte balanç proteic rumen",null,null,null,null,null,null,"Cu",{"$f":"((100-$O$9)/100)*I_Necessitats!C25","v":119.09843750000002},{"$f":"(100+$O$9)/100*I_Necessitats!C25","v":153.12656250000001},{"$f":"CàlculsEV!R26","v":8.9},10,{"$f":"CàlculsEV!AN$21","v":"UEB"}]
["MNT ingerida",{"$f":"L45","v":49},null,null,null,null,null,"Mn",{"$f":"((100-$O$9)/100)*I_Necessitats!C29","v":224.11666666666667},{"$f":"(100+$O$9)/100*I_Necessitats!C29","v":288.14999999999998},{"$f":"CàlculsEV!S26","v":6.23},7,{"$f":"CàlculsEV!BB21","v":""}]
["MOrD o MOF",{"$f":"L57","v":628.0150685218556},null,null,null,null,null,"Zn",{"$f":"((100-$O$9)/100)*I_Necessitats!C31","v":301.7},{"$f":"(100+$O$9)/100*I_Necessitats!C27","v":4.05},{"$f":"CàlculsEV!T26","v":0},0,{"$f":"CàlculsEV!BC21","v":"Zn"}]
["MNrD_rumen (MNF) fermentades rumen",{"$f":"B37*L56","v":28.839187418809022},null,null,null,null,null,"Iode",{"$f":"((100-$O$9)/100)*I_Necessitats!C27","v":3.15},{"$f":"(100+$O$9)/100*I_Necessitats!C27","v":4.05},{"$f":"CàlculsEV!U26","v":0},0,{"$f":"CàlculsEV!BD21","v":"Iode"}]
["MN alim_duodè (PIA) no ferm a rumen",{"$f":"B37*(1-L56)","v":20.160812581190978},null,null,null,null,null,"Se",{"$f":"((100-$O$9)/100)*I_Necessitats!C30","v":3.023196323872396},{"$f":"(100+$O$9)/100*I_Necessitats!C30","v":3.8869667021216525},{"$f":"CàlculsEV!V26","v":0},0,{"$f":"CàlculsEV!BE21","v":"Se"}]
["MN microbiana intestí ( 41,7 + 71,9 x 10^-3 x MOrD_rumen + 8,40 x PCO)",{"$f":"41.7+(B38*71.9*10^-3)+6.4*B34","v":86.854283426721423},null,null,null,null,null,"Vit A",{"$f":"((100-$O$9)/100)*I_Necessitats!C32","v":57750},{"$f":"(100+$O$9)/100*I_Necessitats!C32","v":74250},{"$f":"CàlculsEV!W26","v":0},0,{"$f":"CàlculsEV!BF21","v":"Vit A"}]
["MN endogena",14.2,null,null,null,null,null,"Vit D",{"$f":"((100-$O$9)/100)*I_Necessitats!C33","v":8400},{"$f":"(100+$O$9)/100*I_Necessitats!C33","v":10800},{"$f":"CàlculsEV!X26","v":0},0,{"$f":"CàlculsEV!BG21","v":"Vit D"}]
["BPR ració",{"$f":"B37-(B40+B41+B42)","v":-72.215096007912408},null,null,null,null,null,"Vit E",{"$f":"((100-$O$9)/100)*I_Necessitats!C34","v":1365},{"$f":"(100+$O$9)/100*I_Necessitats!C34","v":1755},{"$f":"CàlculsEV!Y26","v":0},0,{"$f":"CàlculsEV!BH21","v":"Vit E"}]
["BPR ref",{"$f":"-L26","v":-76.134547240000003},null,null,null,null,null,"AG",null,null,{"$f":"CàlculsEV!Z26","v":40.850999999999999},45.9,{"$f":"CàlculsEV!BI21","v":""}]
["Δ dMO_BPR",{"$f":"(0.06*(B43-B44))/100","v":2.3516707392525573E-3},null,null,null,null,null,"MNT_PB",null,null,{"$f":"CàlculsEV!AA26","v":43.61},49,{"$f":"CàlculsEV!BJ21","v":""}]
[null,null,null,null,null,null,null,"PDIA",null,null,{"$f":"CàlculsEV!AB26","v":15.536019280571155},17.456201438843994,{"$f":"CàlculsEV!BK21","v":""}]
["∑ dMO x PMO",{"$f":"K47","v":0.73319999999999996},null,null,null,null,null,"dMO",null,{"$f":"B48","v":0.78628733740591916},{"$f":"CàlculsEV!AC26","v":0.73319999999999996},{"$f":"J47","v":0.78628733740591916},{"$f":"CàlculsEV!BL21","v":""}]
["Efecte total interaccions",{"$f":"B47+(B32+B35+B45)","v":0.78628733740591916},null,null,null,null,null,"MOD",null,null,{"$f":"CàlculsEV!AD26","v":638.19194399999992},{"$f":"K48/$K$8","v":717.06959999999992},{"$f":"CàlculsEV!BM21","v":""}]
[null,null,null,null,null,null,null,"EE",null,null,{"$f":"CàlculsEV!AE26","v":45.39},{"$f":"K49/($K$8*10)","v":5.0999999999999996},{"$f":"CàlculsEV!BN21","v":""}]
["MODc_rumen (MOF corregida)",{"$f":"B38*B48/B47","v":673.48649219700724},null,null,null,null,null,"FB",null,null,{"$f":"CàlculsEV!AF26","v":151.30000000000001},{"$f":"K50/$K$8","v":170},{"$f":"CàlculsEV!BO21","v":""}]
["PANDI",{"$f":"0.193*B40","v":3.8910368281698586},null,null,null,null,null,"NDF",null,null,{"$f":"CàlculsEV!AG26","v":335.37869999999998},376.83,{"$f":"CàlculsEV!BP21","v":""}]
["dr",{"$f":"(B40-B51)/B40","v":0.80699999999999994},null,null,null,null,null,"ADF",null,null,{"$f":"CàlculsEV!AH26","v":231.4},260,{"$f":"CàlculsEV!BQ21","v":""}]
["PDIA",{"$f":"B37*(1-L56)*B52","v":16.269775753021118},null,null,null,null,null,"Lignina",null,null,{"$f":"CàlculsEV!AI26","v":44.7136},50.24,{"$f":"CàlculsEV!BR21","v":""}]
["MN microbianes_duodè (corregida)",{"$f":"40.7+75.6*10^-3*B50+8.07*B34-0.0114*B43","v":92.438830904583952},null,null,null,null,null,"cendres",null,null,{"$f":"CàlculsEV!AJ26","v":19.580000000000002},22,{"$f":"CàlculsEV!BS21","v":""}]
["PDI = PDIA + MN microbianes_duodè x 0,8 x 0,8",{"$f":"B53+B54*0.8*0.8","v":75.430627531954855},null,null,null,null,null,"Mo",null,null,{"$f":"CàlculsEV!AK26","v":0},0,{"$f":"CàlculsEV!BT21","v":"Mo"}]
["flux de N duodenal endogen (Actualització)",null,null,null,null,null,null,"DT_N",null,null,{"$f":"CàlculsEV!AL26","v":0.58855484528181679},{"$f":"K56","v":0.58855484528181679},{"$f":"CàlculsEV!BU21","v":""}]
["MOND = MO - MODc_rumen",{"$f":"L58-B50","v":238.48241012020537},null,null,null,null,null,"MOF",null,null,{"$f":"CàlculsEV!AM26","v":558.93341098445148},{"$f":"K57/K21","v":628.0150685218556},{"$f":"CàlculsEV!BV21","v":""}]
["N duodenal endo, g MNT/kg MSI = 14,2 x MSI",{"$f":"14.2*K8","v":12.638},null,null,null,null,null,"MO",null,null,{"$f":"K48/L47","v":811.65232306231928},{"$f":"K58/K21","v":911.96890231721261},{"$f":"CàlculsEV!AN$21","v":"UEB"}]
["PÈRDUES FECALS ENDÒGENES (PEF)  i (NEC_PDI Actualització)",null,null,null,null,null,null,"PDI/UFL",{"$f":"((100-$O$9)/100)*I_Necessitats!C15/I_Necessitats!C14","v":93.410008793490135},{"$f":"((100+$O$9)/100)*I_Necessitats!C15/I_Necessitats!C14","v":120.09858273448734},{"$f":"K25/K24","v":74.974597271523322},{"$f":"K59","v":74.974597271523322}]
["MNND = 0,163 x MN alim_duodè + 0,20 x MN mic_duodè + 5,7 + 0,074 x MOND",{"$f":"0.163*B40+0.2*B54+5.7+0.074*B57","v":45.121676980546113}]
["PEF (proteïnes endogenes fecals) = 5,7 + 0,074 x MOND",{"$f":"5.7+0.074*B57","v":23.347698348895197}]
["Nec PDI_PEF = MSI x [0,5 x (5,7 + 0,074 x MOND)]/EfPDI",{"$f":"K8*(0.5*(5.7+0.074*B57))/B79","v":17.288907616086604}]
["PÈRDUES ENDÒGENES URINÀRIES i (NEC_PDI Actualització)"]
["log10 NU (N urinari g/dia) log10 NU = - 1,17 + 1,00 x log10 Pv",{"$f":"-1.17+LOG10(I_Necessitats!C10)","v":1.6081512503836435}]
["NU",{"$f":"10^B64","v":40.56497852351891}]
["NUNP microbià/NU =  0,3325/(1 + (NU/0,203))",{"$f":"0.3325/(1+(B65/0.203))","v":1.6556499106537973E-3}]
["NU endo",{"$f":"0.05*I_Necessitats!C10","v":30}]
["Nec PDI_NU endo",{"$f":"0.312*I_Necessitats!C10","v":187.2}]
["PÈRDUES NITROGENADES PER L’EPIDERMIS i (Nec_PDI Actualització)"]
["P epidèrmiques (0,2 g PDI/kg Pv0,60)",{"$f":"0.2*I_Necessitats!C10^0.6","v":9.2879687580069152}]
["Nec PDI_P epidèrmiques = 0,2 x Pv0,60/EffPDI",{"$f":"B70/B79","v":15.455541120751329}]
["Nec_PDI no productives",{"$f":"B62+B68+B71","v":219.9444487368379}]
["Eficàcia de la síntesi proteica en lactació"]
["PDI disponible = PDI ingerida - Nec PDI_NU endògenes",{"$f":"K25-B68","v":-121.59355061152483}]
["EfPDI = ∑ despeses prot/PDI disponible = 0,67xEXP(-0,007x(PDI-100)",{"$f":"0.67*EXP(-0.007*(L25-100))","v":0.80534594518668567}]
["Bal EN",{"$f":"K24-G30","v":-7.3234793622281735}]
["bal Proteïna ",{"$f":"K25-G31","v":-809.62167652326877}]
["Guany Proteïna",{"$f":"I_Necessitats!C35","v":380.83311332410454}]
["EfPDI = (PEF + P epid + MP + bal Prote)/(PDI disponible)",{"$f":"IF(B76>0,(B61+B70+B78+B77)/B74,(B61+B70+B78)/(B74+ABS(B77)))","v":0.60094749743420217}]
[]
["NUcal=0,79xBPR/6,25 + (PDI/6,25) x (1-E·fPDI)+Nuendo + NUNPmic + 0,47X bal N",{"$f":"(0.79*B43/6.25+(K25/6.25)*(1-B79)+B67/6.25+(B41/6.25)+0.47*ABS(B77)/6.25)/I_Necessitats!C10","v":0.12440185689582248}]

{"sheet":"III_Resultat Ració","index":9,"n_rows":59,"n_cols":10,"rows_kept":59,"cut":false,"hidden":false,"merged":[[1,6,1,8],[0,5,0,6],[8,9,10,9]]}
["Explotació:","Data",{"$f":"TODAY()","v":"2024-10-02"},"Pes inicial",{"$f":"I_Necessitats!C10","v":600},"Temps en dies",null,{"$f":"I_Necessitats!G11","v":30}]
[{"$f":"NR!A16","v":"1.-Vedells Engreix (finalització) gran format tardans (Xarolés, p.e)"},"GPV, kg/dia",{"$f":"I_Necessitats!C11","v":1.03},"Pes final",{"$f":"I_Necessitats!F12","v":630.9}]
[]
["INGREDIENTS","kg/dia","% MF","kg/tona ","COST",null,"NUTRIENTS","ANÀLISI"]
[{"$f":"IF(B5=\"\",\"\",CàlculsEV!B3)","v":"Poma residu deshidratat, NRC"},{"$f":"IF('II_Plantejar Ració'!D4=0,\"\",'II_Plantejar Ració'!D4)","v":1},{"$f":"IF('II_Plantejar Ració'!D4=0,\"\",'II_Plantejar Ració'!F4)","v":100},{"$f":"IF('II_Plantejar Ració'!D4=0,\"\",('II_Plantejar Ració'!D4*1000)/('II_Plantejar Ració'!$K$4))","v":1000},{"$f":"IF('II_Plantejar Ració'!D4=0,\"\",'II_Plantejar Ració'!G4*B5)","v":0.04},null,"MSI (kg/dia)",{"$f":"'II_Plantejar Ració'!K21","v":0.89},"Kg"]
[{"$f":"IF(B6=\"\",\"\",CàlculsEV!B4)","v":""},{"$f":"IF('II_Plantejar Ració'!D5=0,\"\",'II_Plantejar Ració'!D5)","v":""},{"$f":"IF('II_Plantejar Ració'!D5=0,\"\",'II_Plantejar Ració'!F5)","v":""},{"$f":"IF('II_Plantejar Ració'!D5=0,\"\",('II_Plantejar Ració'!D5*1000)/('II_Plantejar Ració'!$K$4))","v":""},{"$f":"IF('II_Plantejar Ració'!D5=0,\"\",'II_Plantejar Ració'!G5*B6)","v":""},null,"%MS ració",{"$f":"'II_Plantejar Ració'!K22","v":89},{"$f":"IF('II_Plantejar Ració'!L23=1,\"g\",\"%\")","v":{"$error":"#DIV/0!"}}]
[{"$f":"IF(B7=\"\",\"\",CàlculsEV!B5)","v":""},{"$f":"IF('II_Plantejar Ració'!D6=0,\"\",'II_Plantejar Ració'!D6)","v":""},{"$f":"IF('II_Plantejar Ració'!D6=0,\"\",'II_Plantejar Ració'!F6)","v":""},{"$f":"IF('II_Plantejar Ració'!D6=0,\"\",('II_Plantejar Ració'!D6*1000)/('II_Plantejar Ració'!$K$4))","v":""},{"$f":"IF('II_Plantejar Ració'!D6=0,\"\",'II_Plantejar Ració'!G6*B7)","v":""},null,"UEB",{"$f":"'II_Plantejar Ració'!L23","v":{"$error":"#DIV/0!"}},"UEB/kg MS"]
[{"$f":"IF(B8=\"\",\"\",CàlculsEV!B6)","v":""},{"$f":"IF('II_Plantejar Ració'!D7=0,\"\",'II_Plantejar Ració'!D7)","v":""},{"$f":"IF('II_Plantejar Ració'!D7=0,\"\",'II_Plantejar Ració'!F7)","v":""},{"$f":"IF('II_Plantejar Ració'!D7=0,\"\",('II_Plantejar Ració'!D7*1000)/('II_Plantejar Ració'!$K$4))","v":""},{"$f":"IF('II_Plantejar Ració'!D7=0,\"\",'II_Plantejar Ració'!G7*B8)","v":""},null,"UFV",{"$f":"'II_Plantejar Ració'!L24","v":0.98320116886366116},"UFV/kg MS"]
[{"$f":"IF(B9=\"\",\"\",CàlculsEV!B7)","v":""},{"$f":"IF('II_Plantejar Ració'!D8=0,\"\",'II_Plantejar Ració'!D8)","v":""},{"$f":"IF('II_Plantejar Ració'!D8=0,\"\",'II_Plantejar Ració'!F8)","v":""},{"$f":"IF('II_Plantejar Ració'!D8=0,\"\",('II_Plantejar Ració'!D8*1000)/('II_Plantejar Ració'!$K$4))","v":""},{"$f":"IF('II_Plantejar Ració'!D8=0,\"\",'II_Plantejar Ració'!G8*B9)","v":""},null,"PDI",{"$f":"'II_Plantejar Ració'!L25","v":73.715111672443996},"g/kg MS",{"$f":"'II_Plantejar Ració'!M20","v":"En alguns ingredients de la ració no hi consten els nutrients ..."}]
[{"$f":"IF(B10=\"\",\"\",CàlculsEV!B8)","v":""},{"$f":"IF('II_Plantejar Ració'!D9=0,\"\",'II_Plantejar Ració'!D9)","v":""},{"$f":"IF('II_Plantejar Ració'!D9=0,\"\",'II_Plantejar Ració'!F9)","v":""},{"$f":"IF('II_Plantejar Ració'!D9=0,\"\",('II_Plantejar Ració'!D9*1000)/('II_Plantejar Ració'!$K$4))","v":""},{"$f":"IF('II_Plantejar Ració'!D9=0,\"\",'II_Plantejar Ració'!G9*B10)","v":""},null,"BPR",{"$f":"'II_Plantejar Ració'!L26","v":76.134547240000003},"g PDI/kg MS"]
[{"$f":"IF(B11=\"\",\"\",CàlculsEV!B9)","v":""},{"$f":"IF('II_Plantejar Ració'!D10=0,\"\",'II_Plantejar Ració'!D10)","v":""},{"$f":"IF('II_Plantejar Ració'!D10=0,\"\",'II_Plantejar Ració'!F10)","v":""},{"$f":"IF('II_Plantejar Ració'!D10=0,\"\",('II_Plantejar Ració'!D10*1000)/('II_Plantejar Ració'!$K$4))","v":""},{"$f":"IF('II_Plantejar Ració'!D10=0,\"\",'II_Plantejar Ració'!G10*B11)","v":""},null,"NI",{"$f":"'II_Plantejar Ració'!L27","v":0.14833333333333334},"% Pv"]
[{"$f":"IF(B12=\"\",\"\",CàlculsEV!B10)","v":""},{"$f":"IF('II_Plantejar Ració'!D11=0,\"\",'II_Plantejar Ració'!D11)","v":""},{"$f":"IF('II_Plantejar Ració'!D11=0,\"\",'II_Plantejar Ració'!F11)","v":""},{"$f":"IF('II_Plantejar Ració'!D11=0,\"\",('II_Plantejar Ració'!D11*1000)/('II_Plantejar Ració'!$K$4))","v":""},{"$f":"IF('II_Plantejar Ració'!D11=0,\"\",'II_Plantejar Ració'!G11*B12)","v":""},null,"Ca",{"$f":"'II_Plantejar Ració'!L28","v":0.71500000000000008},"g/kg MS",{"$f":"'II_Plantejar Ració'!M28","v":""}]
[{"$f":"IF(B13=\"\",\"\",CàlculsEV!B11)","v":""},{"$f":"IF('II_Plantejar Ració'!D12=0,\"\",'II_Plantejar Ració'!D12)","v":""},{"$f":"IF('II_Plantejar Ració'!D12=0,\"\",'II_Plantejar Ració'!F12)","v":""},{"$f":"IF('II_Plantejar Ració'!D12=0,\"\",('II_Plantejar Ració'!D12*1000)/('II_Plantejar Ració'!$K$4))","v":""},{"$f":"IF('II_Plantejar Ració'!D12=0,\"\",'II_Plantejar Ració'!G12*B13)","v":""},null,"P",{"$f":"'II_Plantejar Ració'!L29","v":0.74800000000000011},"g/kg MS",{"$f":"'II_Plantejar Ració'!M29","v":""}]
[{"$f":"IF(B14=\"\",\"\",CàlculsEV!B12)","v":""},{"$f":"IF('II_Plantejar Ració'!D13=0,\"\",'II_Plantejar Ració'!D13)","v":""},{"$f":"IF('II_Plantejar Ració'!D13=0,\"\",'II_Plantejar Ració'!F13)","v":""},{"$f":"IF('II_Plantejar Ració'!D13=0,\"\",('II_Plantejar Ració'!D13*1000)/('II_Plantejar Ració'!$K$4))","v":""},{"$f":"IF('II_Plantejar Ració'!D13=0,\"\",'II_Plantejar Ració'!G13*B14)","v":""},null,"Mg",{"$f":"'II_Plantejar Ració'!L30","v":0.7},"g/kg MS",{"$f":"'II_Plantejar Ració'!M30","v":""}]
[{"$f":"IF(B15=\"\",\"\",CàlculsEV!B13)","v":""},{"$f":"IF('II_Plantejar Ració'!D14=0,\"\",'II_Plantejar Ració'!D14)","v":""},{"$f":"IF('II_Plantejar Ració'!D14=0,\"\",'II_Plantejar Ració'!F14)","v":""},{"$f":"IF('II_Plantejar Ració'!D14=0,\"\",('II_Plantejar Ració'!D14*1000)/('II_Plantejar Ració'!$K$4))","v":""},{"$f":"IF('II_Plantejar Ració'!D14=0,\"\",'II_Plantejar Ració'!G14*B15)","v":""},null,"K",{"$f":"'II_Plantejar Ració'!L31","v":4.5999999999999996},"g/kg MS",{"$f":"'II_Plantejar Ració'!M31","v":""}]
[{"$f":"IF(B16=\"\",\"\",CàlculsEV!B14)","v":""},{"$f":"IF('II_Plantejar Ració'!D15=0,\"\",'II_Plantejar Ració'!D15)","v":""},{"$f":"IF('II_Plantejar Ració'!D15=0,\"\",'II_Plantejar Ració'!F15)","v":""},{"$f":"IF('II_Plantejar Ració'!D15=0,\"\",('II_Plantejar Ració'!D15*1000)/('II_Plantejar Ració'!$K$4))","v":""},{"$f":"IF('II_Plantejar Ració'!D15=0,\"\",'II_Plantejar Ració'!G15*B16)","v":""},null,"Na",{"$f":"'II_Plantejar Ració'!L32","v":1.2},"g/kg MS",{"$f":"'II_Plantejar Ració'!M32","v":""}]
[{"$f":"IF(B17=\"\",\"\",CàlculsEV!B15)","v":""},{"$f":"IF('II_Plantejar Ració'!D16=0,\"\",'II_Plantejar Ració'!D16)","v":""},{"$f":"IF('II_Plantejar Ració'!D16=0,\"\",'II_Plantejar Ració'!F16)","v":""},{"$f":"IF('II_Plantejar Ració'!D16=0,\"\",('II_Plantejar Ració'!D16*1000)/('II_Plantejar Ració'!$K$4))","v":""},{"$f":"IF('II_Plantejar Ració'!D16=0,\"\",'II_Plantejar Ració'!G16*B17)","v":""},null,"S",{"$f":"'II_Plantejar Ració'!L33","v":0.2},"g/kg MS",{"$f":"'II_Plantejar Ració'!M33","v":""}]
[{"$f":"IF(B18=\"\",\"\",CàlculsEV!B16)","v":""},{"$f":"IF('II_Plantejar Ració'!D17=0,\"\",'II_Plantejar Ració'!D17)","v":""},{"$f":"IF('II_Plantejar Ració'!D17=0,\"\",'II_Plantejar Ració'!F17)","v":""},{"$f":"IF('II_Plantejar Ració'!D17=0,\"\",('II_Plantejar Ració'!D17*1000)/('II_Plantejar Ració'!$K$4))","v":""},{"$f":"IF('II_Plantejar Ració'!D17=0,\"\",'II_Plantejar Ració'!G17*B18)","v":""},null,"Cl",{"$f":"'II_Plantejar Ració'!L34","v":0},"g/kg MS",{"$f":"'II_Plantejar Ració'!M34","v":"Cl"}]
[{"$f":"IF(B19=\"\",\"\",CàlculsEV!B17)","v":""},{"$f":"IF('II_Plantejar Ració'!D18=0,\"\",'II_Plantejar Ració'!D18)","v":""},{"$f":"IF('II_Plantejar Ració'!D18=0,\"\",'II_Plantejar Ració'!F18)","v":""},{"$f":"IF('II_Plantejar Ració'!D18=0,\"\",('II_Plantejar Ració'!D18*1000)/('II_Plantejar Ració'!$K$4))","v":""},{"$f":"IF('II_Plantejar Ració'!D18=0,\"\",'II_Plantejar Ració'!G18*B19)","v":""},null,"Co",{"$f":"'II_Plantejar Ració'!L35","v":0},"mg/kg MS",{"$f":"'II_Plantejar Ració'!M35","v":"Co"}]
[{"$f":"IF(B20=\"\",\"\",CàlculsEV!B18)","v":""},{"$f":"IF('II_Plantejar Ració'!D19=0,\"\",'II_Plantejar Ració'!D19)","v":""},{"$f":"IF('II_Plantejar Ració'!D19=0,\"\",'II_Plantejar Ració'!F19)","v":""},{"$f":"IF('II_Plantejar Ració'!D19=0,\"\",('II_Plantejar Ració'!D19*1000)/('II_Plantejar Ració'!$K$4))","v":""},{"$f":"IF('II_Plantejar Ració'!D19=0,\"\",'II_Plantejar Ració'!G19*B20)","v":""},null,"Cu",{"$f":"'II_Plantejar Ració'!L36","v":10},"mg/kg MS",{"$f":"'II_Plantejar Ració'!M36","v":"UEB"}]
[{"$f":"IF(B21=\"\",\"\",CàlculsEV!B19)","v":""},{"$f":"IF('II_Plantejar Ració'!D20=0,\"\",'II_Plantejar Ració'!D20)","v":""},{"$f":"IF('II_Plantejar Ració'!D20=0,\"\",'II_Plantejar Ració'!F20)","v":""},{"$f":"IF('II_Plantejar Ració'!D20=0,\"\",('II_Plantejar Ració'!D20*1000)/('II_Plantejar Ració'!$K$4))","v":""},{"$f":"IF('II_Plantejar Ració'!D20=0,\"\",'II_Plantejar Ració'!G20*B21)","v":""},null,"Mn",{"$f":"'II_Plantejar Ració'!L37","v":7},"mg/kg MS",{"$f":"'II_Plantejar Ració'!M37","v":""}]
[{"$f":"IF(B22=\"\",\"\",CàlculsEV!B20)","v":""},{"$f":"IF('II_Plantejar Ració'!D21=0,\"\",'II_Plantejar Ració'!D21)","v":""},{"$f":"IF('II_Plantejar Ració'!D21=0,\"\",'II_Plantejar Ració'!F21)","v":""},{"$f":"IF('II_Plantejar Ració'!D21=0,\"\",('II_Plantejar Ració'!D21*1000)/('II_Plantejar Ració'!$K$4))","v":""},{"$f":"IF('II_Plantejar Ració'!D21=0,\"\",'II_Plantejar Ració'!G21*B22)","v":""},null,"Zn",{"$f":"'II_Plantejar Ració'!L38","v":0},"mg/kg MS",{"$f":"'II_Plantejar Ració'!M38","v":"Zn"}]
[{"$f":"IF(B23=\"\",\"\",CàlculsEV!B21)","v":""},{"$f":"IF('II_Plantejar Ració'!D22=0,\"\",'II_Plantejar Ració'!D22)","v":""},{"$f":"IF('II_Plantejar Ració'!D22=0,\"\",'II_Plantejar Ració'!F22)","v":""},{"$f":"IF('II_Plantejar Ració'!D22=0,\"\",('II_Plantejar Ració'!D22*1000)/('II_Plantejar Ració'!$K$4))","v":""},{"$f":"IF('II_Plantejar Ració'!D22=0,\"\",'II_Plantejar Ració'!G22*B23)","v":""},null,"Iode",{"$f":"'II_Plantejar Ració'!L39","v":0},"mg/kg MS",{"$f":"'II_Plantejar Ració'!M39","v":"Iode"}]
[{"$f":"IF(B24=\"\",\"\",CàlculsEV!B22)","v":""},{"$f":"IF('II_Plantejar Ració'!D23=0,\"\",'II_Plantejar Ració'!D23)","v":""},{"$f":"IF('II_Plantejar Ració'!D23=0,\"\",'II_Plantejar Ració'!F23)","v":""},{"$f":"IF('II_Plantejar Ració'!D23=0,\"\",('II_Plantejar Ració'!D23*1000)/('II_Plantejar Ració'!$K$4))","v":""},{"$f":"IF('II_Plantejar Ració'!D23=0,\"\",'II_Plantejar Ració'!G23*B24)","v":""},null,"Se",{"$f":"'II_Plantejar Ració'!L40","v":0},"mg/kg MS",{"$f":"'II_Plantejar Ració'!M40","v":"Se"}]
[{"$f":"IF(B25=\"\",\"\",CàlculsEV!B23)","v":""},{"$f":"IF('II_Plantejar Ració'!D24=0,\"\",'II_Plantejar Ració'!D24)","v":""},{"$f":"IF('II_Plantejar Ració'!D24=0,\"\",'II_Plantejar Ració'!F24)","v":""},{"$f":"IF('II_Plantejar Ració'!D24=0,\"\",('II_Plantejar Ració'!D24*1000)/('II_Plantejar Ració'!$K$4))","v":""},{"$f":"IF('II_Plantejar Ració'!D24=0,\"\",'II_Plantejar Ració'!G24*B25)","v":""},null,"Vit A",{"$f":"'II_Plantejar Ració'!L41","v":0},"UI",{"$f":"'II_Plantejar Ració'!M41","v":"Vit A"}]
[{"$f":"IF(B26=\"\",\"\",CàlculsEV!B24)","v":""},{"$f":"IF('II_Plantejar Ració'!D25=0,\"\",'II_Plantejar Ració'!D25)","v":""},{"$f":"IF('II_Plantejar Ració'!D25=0,\"\",'II_Plantejar Ració'!F25)","v":""},{"$f":"IF('II_Plantejar Ració'!D25=0,\"\",('II_Plantejar Ració'!D25*1000)/('II_Plantejar Ració'!$K$4))","v":""},{"$f":"IF('II_Plantejar Ració'!D25=0,\"\",'II_Plantejar Ració'!G25*B26)","v":""},null,"Vit D",{"$f":"'II_Plantejar Ració'!L42","v":0},"UI",{"$f":"'II_Plantejar Ració'!M42","v":"Vit D"}]
[{"$f":"IF(B27=\"\",\"\",CàlculsEV!B25)","v":""},{"$f":"IF('II_Plantejar Ració'!D26=0,\"\",'II_Plantejar Ració'!D26)","v":""},{"$f":"IF('II_Plantejar Ració'!D26=0,\"\",'II_Plantejar Ració'!F26)","v":""},{"$f":"IF('II_Plantejar Ració'!D26=0,\"\",('II_Plantejar Ració'!D26*1000)/('II_Plantejar Ració'!$K$4))","v":""},{"$f":"IF('II_Plantejar Ració'!D26=0,\"\",'II_Plantejar Ració'!G26*B27)","v":""},null,"Vit E",{"$f":"'II_Plantejar Ració'!L43","v":0},"UI",{"$f":"'II_Plantejar Ració'!M43","v":"Vit E"}]
["TOTAL",{"$f":"SUM(B5:B27)","v":1},{"$f":"SUM(C5:C27)","v":100},{"$f":"SUM(D5:D27)","v":1000},{"$f":"'II_Plantejar Ració'!K16","v":0.04},null,"AG",{"$f":"'II_Plantejar Ració'!L44","v":45.9},"g/kg MS",{"$f":"'II_Plantejar Ració'!M44","v":""}]
[null,null,null,null,null,null,"MNT_PB",{"$f":"'II_Plantejar Ració'!L45","v":49},"g/kg MS",{"$f":"'II_Plantejar Ració'!M45","v":""}]
[null,"Fa %",{"$f":"'II_Plantejar Ració'!K11","v":100},"% greix s/MS",{"$f":"'II_Plantejar Ració'!L49","v":5.0999999999999996},null,"PDIA",{"$f":"'II_Plantejar Ració'!L46","v":17.456201438843994},"g/kg MS",{"$f":"'II_Plantejar Ració'!M46","v":""}]
[null,"Co %",{"$f":"'II_Plantejar Ració'!K12*100","v":0},null,null,null,"dMO",{"$f":"'II_Plantejar Ració'!L47","v":0.78628733740591916},null,{"$f":"'II_Plantejar Ració'!M47","v":""}]
[null,null,null,null,null,null,"MOD",{"$f":"'II_Plantejar Ració'!L48","v":717.06959999999992},"g/kg MS",{"$f":"'II_Plantejar Ració'!M48","v":""}]
[null,null,null,null,null,null,"EE",{"$f":"'II_Plantejar Ració'!L49","v":5.0999999999999996},"%",{"$f":"'II_Plantejar Ració'!M49","v":""}]
[null,null,null,null,null,null,"FB",{"$f":"'II_Plantejar Ració'!L50","v":170},"g/kg MS",{"$f":"'II_Plantejar Ració'!M50","v":""}]
[null,null,null,null,null,null,"NDF",{"$f":"'II_Plantejar Ració'!L51","v":376.83},"g/kg MS",{"$f":"'II_Plantejar Ració'!M51","v":""}]
[null,null,null,null,null,null,"ADF",{"$f":"'II_Plantejar Ració'!L52","v":260},"g/kg MS",{"$f":"'II_Plantejar Ració'!M52","v":""}]
[null,null,null,null,null,null,"Lignina",{"$f":"'II_Plantejar Ració'!L53","v":50.24},"g/kg MS",{"$f":"'II_Plantejar Ració'!M53","v":""}]
[null,null,null,null,null,null,"cendres",{"$f":"'II_Plantejar Ració'!L54","v":22},"g/kg MS",{"$f":"'II_Plantejar Ració'!M54","v":""}]
[null,null,null,null,null,null,"Mo",{"$f":"'II_Plantejar Ració'!L55","v":0},"mg/kg MS",{"$f":"'II_Plantejar Ració'!M55","v":"Mo"}]
[null,null,null,null,null,null,"DT_N",{"$f":"'II_Plantejar Ració'!L56","v":0.58855484528181679},null,{"$f":"'II_Plantejar Ració'!M56","v":""}]
[null,null,null,null,null,null,"MOF",{"$f":"'II_Plantejar Ració'!L57","v":628.0150685218556},"g/kg MS",{"$f":"'II_Plantejar Ració'!M57","v":""}]
[null,null,null,null,null,null,"MO",{"$f":"'II_Plantejar Ració'!L58","v":911.96890231721261},"g/kg MS",{"$f":"'II_Plantejar Ració'!M58","v":"UEB"}]
[null,null,null,null,null,null,"PDI/UFL",{"$f":"'II_Plantejar Ració'!L59","v":74.974597271523322},"g",{"$f":"'II_Plantejar Ració'!M58","v":"UEB"}]
[]
[]
[]
[]
[]
[]
[]
[]
[]
[]
[]
[]
[]
[]
[]
[{"$f":"IF(B59=\"\",\"\",CàlculsEV!B26)","v":""},{"$f":"IF('II_Plantejar Ració'!D27=0,\"\",'II_Plantejar Ració'!D27)","v":""}]