{"text_format":"1","workbook":"xlsx","n_sheets":10,"sheets":["Paràmetres","Taula Farratges","Taula Concentrats","Taula Minerals-aa","CàlculsEV","Apunts Cria","NR","I_Necessitats","II_Plantejar Ració","III_Resultat Ració"],"not_rendered":{"charts":0,"images":7,"macros":1,"external_links":0,"defined_names":283,"comments":0,"pivot_tables":0},"unopened":[],"bounds":{"document_bytes":16777216,"sheet_cells":100000,"rows_first":2000,"rows_last":500,"rows_between":2000,"halvings":0,"cell_chars":16384,"cell_head_chars":4096},"cells_cut":0,"cells_raw":0,"read":"whole","date_system":"1900"}

{"sheet":"Paràmetres","index":0,"n_rows":42,"n_cols":3,"rows_kept":42,"cut":false,"hidden":true,"merged":[]}
["COMPONENTS","POSICIÓ","PARÀMETRES DE CÀLCUL"]
[{"$f":"'Taula Farratges'!B$1","v":"MS %"},1,2]
[{"$f":"'Taula Farratges'!C$1","v":"UFL"},{"$f":"1+B2","v":2},1]
[{"$f":"'Taula Farratges'!D$1","v":"UFV"},3,1]
[{"$f":"'Taula Farratges'!E1","v":"MNT_PB"},4,1]
[{"$f":"'Taula Farratges'!F1","v":"PDIA"},5,1]
[{"$f":"'Taula Farratges'!G1","v":"PDI"},6,1]
[{"$f":"'Taula Farratges'!H1","v":"BPR"},7,1]
[{"$f":"'Taula Farratges'!I1","v":"UEL"},8,1]
[{"$f":"'Taula Farratges'!J1","v":"UEB"},9,1]
[{"$f":"'Taula Farratges'!K1","v":"UEM"},10,1]
[{"$f":"'Taula Farratges'!L1","v":"NI ref"},11,1]
[{"$f":"'Taula Farratges'!M1","v":"dMO"},12,1]
[{"$f":"'Taula Farratges'!N1","v":"MOD"},13,1]
[{"$f":"'Taula Farratges'!O1","v":"EE"},14,1]
[{"$f":"'Taula Farratges'!P1","v":"FB"},15,1]
[{"$f":"'Taula Farratges'!Q1","v":"NDF"},16,1]
[{"$f":"'Taula Farratges'!R1","v":"ADF"},17,1]
[{"$f":"'Taula Farratges'!S1","v":"Lignina"},18,1]
[{"$f":"'Taula Farratges'!T1","v":"cendres"},19,1]
[{"$f":"'Taula Farratges'!U1","v":"Ca"},20,1]
[{"$f":"'Taula Farratges'!V1","v":"P"},21,1]
[{"$f":"'Taula Farratges'!W1","v":"Mg"},22,1]
[{"$f":"'Taula Farratges'!X1","v":"Cl"},23,1]
[{"$f":"'Taula Farratges'!Y1","v":"K"},24,1]
[{"$f":"'Taula Farratges'!Z1","v":"Na"},25,1]
[{"$f":"'Taula Farratges'!AA1","v":"S"},26,1]
[{"$f":"'Taula Farratges'!AB1","v":"Co"},27,1]
[{"$f":"'Taula Farratges'!AC1","v":"Cu"},28,1]
[{"$f":"'Taula Farratges'!AD1","v":"Mo"},29,1]
[{"$f":"'Taula Farratges'!AE1","v":"Iode"},30,1]
[{"$f":"'Taula Farratges'!AF1","v":"Fe"},31,1]
[{"$f":"'Taula Farratges'!AG1","v":"Mn"},32,1]
[{"$f":"'Taula Farratges'!AH1","v":"Se"},33,1]
[{"$f":"'Taula Farratges'!AI1","v":"Zn"},34,1]
[{"$f":"'Taula Farratges'!AJ1","v":"Vit A"},35,1]
[{"$f":"'Taula Farratges'!AK1","v":"Vit D"},36,1]
[{"$f":"'Taula Farratges'!AL1","v":"Vit E"},37,1]
[{"$f":"'Taula Farratges'!AM1","v":"AG"},38,1]
[{"$f":"'Taula Farratges'!AN1","v":"DT_N"},39,1]
[{"$f":"'Taula Farratges'!AO1","v":"PF"},40,1]
[{"$f":"'Taula Farratges'!AP1","v":"MOF"},41,1]

{"sheet":"Taula Farratges","index":1,"n_rows":399,"n_cols":42,"rows_kept":399,"cut":false,"hidden":false,"merged":[]}
["Farratges","MS %","UFL","UFV","MNT_PB","PDIA","PDI","BPR","UEL","UEB","UEM","NI ref","dMO","MOD","EE","FB","NDF","ADF","Lignina","cendres","Ca","P","Mg","Cl","K","Na","S","Co","Cu","Mo","Iode","Fe","Mn","Se","Zn","Vit A","Vit D","Vit E","AG","DT_N","PF","MOF"]
[]
["VERD Raigràs italià Fulla tardor/hivern",16.600000000000001,0.98752542301286184,0.96862343900373249,190,37.049999999999997,83.729305252851219,43.996299718419976,0.99084854862359462,0.98292252314240713,0.97878066167451971,2.7532019636685905,0.75792000000000004,649.53744000000006,41,238,531.31999999999994,265,null,143,2.2800000000000002,2.5799999999999996,null,null,null,null,null,null,null,null,null,null,null,null,null,null,null,null,27.18,0.74,null,566.53268820000017]
["VERD Raigràs italià Fulla primavera",15.1,1.1000000000000001,1.0989935399169917,191,34.379999999999995,86.075046066243218,44.124884807494979,0.97089801460888281,0.94946304619472999,0.93585147423185366,2.8794962811112788,0.81287000000000009,704.7582900000001,43,178,462.91999999999996,203,null,133,2,2.4,1.7,null,30,3,null,null,8.1,null,null,null,85.1,null,null,null,null,null,27.285,0.76,null,628.16571895000016]
["VERD Raigràs italià Espiga a 10 cm",15.8,1.0735144194744679,1.0694268732466976,168,26.459999999999994,77.846214502419187,31.104514855970013,0.99103463889108023,0.98323915467272305,0.97919111815687709,2.7520478788609646,0.79571999999999987,705.0079199999999,39,188,474.32,213,null,114,1.8,2.1,1.7,null,30,3,1,null,8.1,null,null,null,85.1,null,null,null,null,null,24.87,0.79,null,636.23762369999986]
["VERD Raigràs italià 1 setmana abans inici espigat",16.399999999999999,0.95689870666779997,0.92793230273629967,112,22.68,69.968842313824013,-17.036897495350015,1.0571012443135424,1.1012950217887776,1.1379992516516921,2.3679987801502724,0.73790000000000011,663.37210000000005,33,230,522.20000000000005,257,null,101,1.8,1.7999999999999998,1.7,null,30,3,1,null,6,null,null,null,80,null,23,80000,30,20,18.989999999999998,0.73,null,597.03612650000002]
["VERD Raigràs italià Inici espigat",16.5,0.93684956106994044,0.90410248855808739,105,21.262500000000003,67.8124260345312,-21.595384802955007,1.0672228531944756,1.1204338752740313,1.1648766033788691,2.3133616315295407,0.72816999999999998,654.62482999999997,32,238,531.31999999999994,265,null,101,1.8,1.7999999999999998,1.7,null,30,3,1,null,5,null,null,null,80,null,23,80000,30,20,18.254999999999999,0.73,null,589.36557444999994]
["VERD Raigràs italià Espigat",17.8,0.88184075870700551,0.83779666868101732,88,19.14,63.382896942944008,-34.052214303349999,1.0914348948575481,1.1674392075396804,1.2323083649584736,2.1867747686788919,0.69764999999999999,629.97794999999996,30,265,562.09999999999991,293,null,97,1.8,1.5,null,null,null,null,null,null,5,null,null,null,79.599999999999994,null,23.8,80000,30,20,16.47,0.71,null,565.53844649999996]
["VERD Raigràs italià Final espigat",20.399999999999999,0.85440088506958656,0.80318318028193669,80,17.400000000000002,60.325511947001601,-38.918934249190016,1.0967717953522336,1.178039486138192,1.2478010418173731,2.1596238097367575,0.67756000000000005,617.93472000000008,29,284,583.76,313,null,88,1.8,1.5,2.2999999999999998,null,26,1.5,null,null,null,null,null,null,null,null,null,80000,30,20,15.629999999999999,0.71,null,554.22718010000017]
["VERD Raigràs italià Inici floració",24,0.83423945067046223,0.77936346043230376,70,15.225000000000003,57.342206399603207,-45.480477313380007,1.0940999515278929,1.1727215793467025,1.2400153550274735,2.1731834438964874,0.66587000000000007,608.60518000000002,28,293,594.02,322,null,86,1.8,1.2,null,null,null,null,null,null,null,null,null,null,null,null,null,80000,30,20,14.579999999999998,0.71,null,546.73821020000003]
["VERD Raigràs italià Floració",27.5,0.80685367113340589,0.74696978180239471,60,13.500000000000004,54.399338757356801,-52.284078594370001,1.094509341268644,1.1735349707846756,1.2412044528855173,2.1711014921501279,0.64962999999999993,595.06107999999995,27,307,609.98,337,null,84,1.8,1.2,null,null,null,null,null,null,null,null,null,null,null,null,null,80000,30,20,13.530000000000001,0.7,null,534.27091229999985]
["VERD Blat de moro Pastós",30.7,1.3365193726351559,1.2976569692461448,77.400000000000006,13.932,58.791469320032924,-42.365192088735554,1.0287076803514683,1.0491399436253608,1.0663920128792077,1.4,0.72046413502109707,687.46687763713089,23.8,208,454.4,243.9,29.5,45.8,0.84000000000000008,1.6099999999999999,null,null,null,null,1.1000000000000001,null,null,null,null,160,null,null,null,80000,30,20,15.356999999999999,0.76,null,630.30865213818572]
["VERD Civada Inici allargament tiges",14.9,1.064086631371385,1.0648547254219185,120,26.1,78.540947235026891,-13.57775696030404,1.020791556789022,1.0349885040559215,1.047364373208719,2.5729162731279134,0.81001137656427757,712,34,230,522.20000000000005,257,null,121,2,2.64,null,null,null,null,null,null,null,null,null,null,null,null,null,80000,30,20,19.829999999999998,0.74,null,646.83945702787264]
["VERD Civada Inici espigat",20.6,0.91333093057134518,0.87419395222156171,102,19.89,65.217582265828071,-21.950791599748623,1.0602585729914722,1.1072336004065757,1.1463038738332441,2.3508433507354152,0.7104972375690608,643,32,302,604.28,331,null,95,1.8,2.31,null,null,null,null,null,null,null,null,null,null,null,null,null,80000,30,20,17.939999999999998,0.74,null,578.03604450276248]
["VERD Civada Floració",17.7,0.82294203192554172,0.76625553664384183,101,18.9375,59.893045182320009,-17.979191347374989,1.1028559437781433,1.1902323151561571,1.2657544233897913,2.1289918406971013,0.66,594,32,333,639.61999999999989,364,null,100,1.6,1.98,null,null,null,null,null,null,null,null,null,null,null,null,null,80000,30,20,17.835000000000001,0.75,null,526.55342624999992]
["VERD Civada Lletós-pastós",31.8,0.73565844803415192,0.65655065623404674,67,12.5625,48.699708160190347,-40.323714689952581,1.1023148702224652,1.189143269883159,1.2641450199268489,2.1317022946299837,0.58943965517241381,547,25,270,567.79999999999995,298,null,72,1.4000000000000001,1.6500000000000001,null,null,null,null,null,null,null,null,null,null,null,null,null,80000,30,20,14.265000000000001,0.75,null,482.66640737068963]
["VERD Civada Pastós",38.299999999999997,0.70725373323244844,0.62325068836847375,63,12.285,46.824005315001301,-42.668014084259411,1.0852102252608484,1.1551863027804197,1.2145329392128961,2.2187795429159296,0.56989247311827962,530,25,263,559.81999999999994,291,null,70,1.2000000000000002,1.6500000000000001,null,null,null,null,null,null,null,null,null,null,null,null,null,80000,30,20,13.844999999999999,0.74,null,464.78461869623663]
["VERD Triticale Lletós-pastós",40.51,0.78663088364503642,0.71307400675309951,71.900000000000006,13.481250000000001,51.742682232248974,-38.677291137998182,1.0463959657475401,1.0813694287603073,1.1103630076712525,2.4269367955393735,0.61026200873362446,574.92783842794756,14.8,299,618.40000000000009,350.09999999999997,43.5,57.9,1.1599999999999999,0.99,2.7,null,25,1.7,3,null,8.6,0.44,null,null,43.9,null,24.1,80000,30,20,14.779499999999999,0.75,null,510.88026617521825]
["VERD Alfals Inici botons florals",19.829999999999998,0.89545070680381955,0.84539321239714582,196.70000000000002,33.930750000000003,74.375738644794566,59.446436105308493,0.97832950718065281,0.96181498260220788,0.95159725192721134,2.8318501700856706,0.67482600000000004,585.20910720000006,22.6,277.39999999999998,442.1,334.4,74.3,132.79999999999998,5.4300000000000006,1.75,null,null,null,null,null,null,8.8000000000000007,1.3,null,null,26.7,null,32.299999999999997,120000,20,100,20.313500000000001,0.77,null,502.67821828500007]
["VERD Alfals Vegetatiu 30 cm",14.4,1.0579703950352333,1.0379178369075921,246,40.589999999999989,87.137906090886389,95.114082554989992,0.93430199369735301,0.89049322326002445,0.86227914358067548,3.1251838337790021,0.75198999999999994,654.9832899999999,33,201,489.14,259,null,129,4.95,3.15,null,null,null,null,null,null,8.8000000000000007,1.3,null,null,26.7,null,32.299999999999997,120000,20,100,25.49,0.78,null,568.78883789999986]
["VERD Enclova fulla, 1r any",11,1.096854529391851,1.0923154153996353,233.5,47.283749999999998,101.47599610799841,71.579615456252483,0.94406749113829702,0.90593437062390314,0.88129249746648941,3.0577598782129622,0.78986500000000004,687.81444199999999,27,163.5,249.60000000000002,234.1,null,129.19999999999999,3.3,2.0999999999999996,null,null,null,null,null,null,null,null,null,null,null,null,null,null,null,null,24.177499999999998,0.73,null,598.12774052500004]
["VERD Enclova tija fulla, 1r any",11.5,1.0185842087953727,0.99799522826140863,186,37.665000000000006,91.197186063974414,37.935959275039991,0.9882329889956053,0.97848114339409076,0.97303159891575208,2.7694689902423741,0.75451499999999994,664.04865150000001,27,198.5,280.5,269.89999999999998,null,119.9,3.3,2.0999999999999996,null,null,null,null,null,null,null,null,null,null,null,null,null,null,null,null,19.189999999999998,0.73,null,583.78359840000007]
["VERD Enclova gemmes florals, 1r any",11.91,0.97166206695584478,0.94000581377256476,170.3,34.48575000000001,87.26725566060513,27.647897405304509,1.0028017402943088,1.00343500554711,1.0055373170303181,2.6799411559202033,0.72744699999999995,645.68195719999994,27,225.3,323.89999999999998,304.20000000000005,null,112.4,3.5999999999999996,2.0999999999999996,null,null,null,null,null,null,null,null,null,null,null,null,null,null,null,null,17.541499999999999,0.73,null,567.47013344499987]
["VERD Enclova Botons florals, 1r any",13.77,0.96614085568473185,0.93053932906038217,168.9,34.202249999999999,86.945352644738875,26.685902117595493,1.0007309591481519,0.99985588272857107,1.0008442882212805,2.6925075872814803,0.71795299999999995,645.15256579999993,27,234.7,348.5,330.4,null,101.4,3.5999999999999996,2.0999999999999996,null,null,null,null,null,null,null,null,null,null,null,null,null,null,null,null,17.394500000000001,0.73,null,566.63557555499983]
["VERD Enclova Inici Floració, 1r any",14.5,0.91962154275921515,0.87567449613502713,167,32.564999999999998,84.172959866843513,28.742562708057012,1.0100190345863349,1.0159941012896332,1.0220874989156672,2.636546129937039,0.69512699999999994,620.33133479999992,23,257.3,366,334.09999999999997,null,107.6,3.5999999999999996,2.0999999999999996,null,null,null,null,null,null,null,null,null,null,null,null,null,null,null,null,17.195,0.74,null,541.96713896999984]
["VERD Enclova Floració, 1r any",14.92,0.88969990351872497,0.84135662913691533,162.39999999999998,31.667999999999999,82.562520454548491,26.453311789767998,1.0178496754832842,1.0297714065984536,1.0403919149130092,2.5901593438934505,0.68209799999999998,604.61166719999994,23,270.2,390.09999999999997,346.3,null,113.6,2.6999999999999997,3.5,null,null,null,null,null,null,null,null,null,null,null,null,null,null,null,null,16.711999999999996,0.74,null,526.4629792799999]
["VERD Enclova Fructificació, 1r any",18.93,0.77401946656011245,0.70503347951194739,130.80000000000001,25.506,74.013164041958419,6.7995561844399965,1.0561333578065242,1.0994802235470891,1.1354676663546046,2.3732783588410475,0.61816499999999996,549.4868684999999,21,333.5,519.6,450.7,null,111.1,2.6999999999999997,3.5,null,null,null,null,null,null,null,null,null,null,null,null,null,null,null,null,13.393999999999998,0.74,null,474.58197239999993]
["VERD Enclova fulla, 2n any",11,1.0997475678808939,1.0955739358757886,240.5,48.701250000000002,102.77599704931104,76.873207735451487,0.93857706228682003,0.89722712927592585,0.87054930247213902,3.0954948008925363,0.790269,686.98084170000004,27,163.1,272.8,253.29999999999998,null,130.69999999999999,3.3,2.0999999999999996,null,null,null,null,null,null,null,null,null,null,null,null,null,null,null,null,24.912499999999998,0.73,null,595.57430131500007]
["VERD Enclova tija fulla, 2n any",10.029999999999999,1.027185590826025,1.0072223154339977,206.5,41.816250000000004,95.042085967479366,53.379631300813486,0.97340769944599659,0.95361978058004249,0.9411371114222743,2.8633243838941782,0.75512100000000004,662.46765330000005,27,197.89999999999998,311.2,290.39999999999998,null,122.69999999999999,3.3,2.0999999999999996,null,null,null,null,null,null,null,null,null,null,null,null,null,null,null,null,21.342499999999998,0.73,null,577.12612933500009]
["VERD Enclova gemmes florals,2n any",12.06,0.94147987825051005,0.90301862075432326,177.39999999999998,35.923499999999997,87.760272637741451,34.307042753528975,1.0059539503059134,1.0089040219475649,1.012728492916573,2.6609114472156188,0.70946900000000002,628.16385259999993,27,243.1,360.20000000000005,330.5,null,114.60000000000001,3.5999999999999996,2.0999999999999996,null,null,null,null,null,null,null,null,null,null,null,null,null,null,null,null,18.286999999999995,0.73,null,546.93960009]
["VERD Enclova Botons Florals, 2n any",12.51,0.89511695047393725,0.84831034371938674,168.9,34.202249999999999,85.027463789994556,29.682603453133499,1.0212578557591314,1.0358175124197606,1.0484744022230137,2.5701923041798236,0.68644100000000008,605.6468943000001,27,265.89999999999998,382.29999999999995,352.40000000000003,null,117.69999999999999,3.5999999999999996,2.0999999999999996,null,null,null,null,null,null,null,null,null,null,null,null,null,null,null,null,17.394500000000001,0.73,null,524.95683653499998]
["VERD Enclova Inici Floració, 2n any",15.37,0.86881967024630535,0.81422239885418368,151.5,29.5425,80.223350325455058,18.721171366476486,1.0317230795400663,1.0545743042255284,1.0737438177302745,2.5097055696390158,0.66603899999999994,598.43604149999999,23,286.10000000000002,406,371.5,null,101.5,3.5999999999999996,2.0999999999999996,null,null,null,null,null,null,null,null,null,null,null,null,null,null,null,null,15.567499999999999,0.74,null,521.819591565]
["VERD Enclova Floració, 2n any",17.12,0.83214342113550244,0.77228576567026164,141.1,27.514499999999998,77.408014276619213,12.25538394278249,1.0404074604954003,1.0703623520467973,1.0952454344255966,2.4604355836793905,0.64896999999999994,579.98448899999994,23,303,452.59999999999997,406.5,null,106.30000000000001,2.6999999999999997,3.5,null,null,null,null,null,null,null,null,null,null,null,null,null,null,null,null,14.475499999999997,0.74,null,504.70954182499997]
["VERD Enclova Fructificació, 2n any",20.03,0.77143119127727278,0.69909135051730531,135.39999999999998,26.402999999999995,74.793560372722553,10.385749417620975,1.0522008612083678,1.0921340283508449,1.1252497728173221,2.3948290458003165,0.60968100000000003,548.65193190000002,21,341.9,491.1,452.9,null,100.1,2.6999999999999997,3.5,null,null,null,null,null,null,null,null,null,null,null,null,null,null,null,null,13.876999999999995,0.74,null,472.04799141000001]
["VERD Enclova Botons",11,0.98714581306540561,0.96685370267084725,199,40.297499999999999,86.213032515440005,49.554763844624986,0.98284221180709641,0.96937985564538043,0.96129936913126734,2.8032691232892639,0.753,637.79100000000005,27,200,488,230,null,153,3.3,2.0999999999999996,null,null,null,null,null,null,null,null,null,null,null,null,null,120000,20,100,20.555,0.73,null,554.17574625000009]
["VERD Enclova Floració",13.5,0.85663511928844371,0.80590339975096426,155,30.225000000000001,70.915031325385598,22.204400792085,1.0336253408704008,1.0580151174918615,1.0784116566464967,2.4988424625369929,0.67320999999999998,586.36590999999999,23,279,578.05999999999995,305.05,null,129,3.5999999999999996,2.0999999999999996,null,null,null,null,null,null,null,null,null,null,null,null,null,120000,20,100,15.934999999999999,0.74,null,509.39637284999998]
["VERD Enclova Final floració",15.3,0.8276145296713725,0.76722137641537558,152,29.64,68.692100739392004,20.916130304700008,1.0414164228237595,1.0722099432557681,1.0977756576883742,2.4547646150194544,0.64694999999999991,574.49159999999995,21,305,607.70000000000005,329.75,null,112,2.6999999999999997,3.5,null,null,null,null,null,null,null,null,null,null,null,null,null,120000,20,100,15.619999999999997,0.74,null,496.43768699999998]
["ENSITJAT prefenificat Raigràs italià 1 setmana abans inici espigat",33.5,0.91540389584190662,0.87232923811261709,123,17,67,5,1.05,1.07,1.35,2,0.73,649.70000000000005,36,246,510,275,null,110,1.8399999999999999,1.56,null,null,null,null,null,null,null,null,null,null,null,null,null,8000,200,5,19,0.79,80,588.49475000000007]
["ENSITJAT prefenificat Raigràs italià Inici espigat",33.5,0.88,0.82,117,16,65,1,1.06,1.08,1.39,1.9,0.70604299999999998,631.9,35,254,520,283,null,110,1.8399999999999999,1.56,null,null,null,null,null,null,null,null,null,null,null,null,null,8000,200,5,19,0.79,80,570.04267528000003]
["ENSITJAT prefenificat Raigràs italià Final espigat",33.5,0.78,0.71,95,12,59,-14,1.1100000000000001,1.18,1.62,1.7,0.66,594.66,33,297,571,327,null,99,1.8399999999999999,1.38,null,null,null,null,null,null,null,null,null,null,null,null,null,8000,200,5,17,0.79,80,534.52604999999994]
["ERGI 1 cicle Moises 22","25,1",0.74670181622832865,0.65885449177336208,157.69999999999999,15.375750000000002,58.724595429552274,52.112429016324569,1.18797069610672,1.3193625830036513,1.462790434868382,1.8422193470014041,0.59056435643564353,527.96453465346531,31.099999999999998,362.37623762376239,626,324.5,34.799999999999997,106,0.8,1.2,null,null,null,null,null,null,null,null,null,null,null,null,null,null,null,null,21.859100000000002,0.85,95,362.48360199826726]
["ENSITJAT Prat natural pla, gramínies en gran part",48,0.9301076693133391,0.86569319205113415,114.3,15.087599999999998,51.530586601789764,-5.2529299494965009,1.1317898668132078,1.2295663735641016,1.6383431146859011,1.6448208043647601,0.66871099999999994,599.16505599999994,22.200000000000003,311.3,584.20000000000005,385,null,104,3.48,1.8199999999999998,null,null,null,null,null,null,null,null,null,null,null,null,null,8000,200,5,18.256900000000002,0.78,115,535.97955423500002]
["ENSITJAT Blat de moro Lletós",28.5,0.9421569564891038,0.88957697028723326,78.099999999999994,13.667499999999999,49.998667512565987,-39.596976739999988,1.0806638363566192,1.1912972600163021,1.3455328310010872,1.4,0.69,651.22199999999987,33.299999999999997,232.60000000000002,488.2,278.39999999999998,30.4,56.2,1.4400000000000002,1.6099999999999999,null,null,null,null,null,null,null,null,null,null,null,null,null,null,null,null,24,0.75,100,588.34459999999979]
["ENSITJAT Blat de moro Lletós-pastós",28.5,0.97874640109961941,0.93392943082914304,78.099999999999994,13.667499999999999,51.607525824622435,-41.05332562000001,1.0422094841063054,1.1525629360024265,1.2846865364851052,1.4,0.71,670.09799999999996,33.299999999999997,232.60000000000002,488.2,278.39999999999998,30.4,56.2,1.4400000000000002,1.6099999999999999,null,null,null,null,null,null,null,null,null,null,null,null,null,null,null,null,24,0.75,125,608.59979999999996]
["ENSITJAT Blat de moro Pastós",30,0.99626128521090906,0.95403421579894565,77,13.475,54.028817866378347,-42.654494748000005,1.0132958896376021,1.1164911620910118,1.2785238674835691,1.4,0.71699999999999997,680.21789999999999,34.4,216.5,450.90000000000003,287.5,29.3,51.3,1.2000000000000002,1.54,null,null,null,null,null,null,null,null,null,null,null,null,null,null,null,null,24,0.75,80,619.39491999999996]
["ENSITJAT Blat de moro Pastós-vidriós",32,0.98314239284985649,0.9382032061594856,75.900000000000006,13.282500000000001,52.116471121566136,-42.990022427770683,1.0041912879324348,1.0985757184935629,1.2844202105596523,1.4,0.71019108280254772,673.68726114649678,32.1,203.70000000000002,432.70000000000005,244.4,22.9,51.4,1.2000000000000002,1.6099999999999999,null,null,null,null,null,null,null,null,null,null,null,null,null,null,null,null,24,0.75,100,612.58723821656042]
["ENSITJAT Blat de moro Vidriós",32,0.96401164680448415,0.91546345893534753,76,13.299999999999999,51.899042023992166,-42.136330275541724,1.0206141424357025,1.114790276307644,1.3042568239789341,1.4,0.70080464625132,663.52183907074982,32,202,432.40000000000003,244.4,26.5,53.2,1.2400000000000002,1.6099999999999999,null,null,null,null,null,null,null,null,null,null,null,null,null,null,null,null,24,0.75,80,601.75702747624086]
["EBM moises","34,14",0.98808080236555607,0.94290828761407897,75,13.125,61.634504780935735,-33.746101220212083,0.98247497084668678,1.0681765949795914,1.2844202105596523,1.4,0.71019108280254772,677.38025477707004,35,174.8201438848921,420,256.90000000000003,null,46.2,1.2000000000000002,1.6099999999999999,null,null,null,null,null,null,null,null,null,null,null,null,null,null,null,null,24,0.75,100,474.63284033674654]
["ENSITJAT Civada Lletós-pastós",31,0.66424114835938342,0.56952073627037447,96.6,18.933599999999998,47.975074691200007,-17.511236205000014,1.1549554187208375,1.2826605891057561,1.7912244332565892,1.5044350611183899,0.56000000000000005,508.70400000000012,45,333.40000000000003,600.1,385.3,49.3,91.6,2.16,1.8479999999999999,null,null,null,null,null,null,5,0.13,null,null,30,null,null,5000,200,5,19,0.72,80,433.84195000000011]
["ENSITJAT Ordi Lletós-pastós",30.5,0.72142021600330664,0.63401319082140295,98.800000000000011,19.364800000000002,51.132219780851621,-18.30719856887097,1.1474959575885495,1.2652874217455174,1.7453927636691655,1.5439395050877607,0.5903225806451613,540.14516129032256,40.700000000000003,278.39999999999998,533.29999999999995,328.5,42.9,85,2.12,1.7820000000000003,null,null,null,null,null,null,null,null,null,null,null,null,null,5000,200,5,19,0.72,80,466.94295645161293]
["Ensitjat ordi SG","26,9",0.74918194232366153,0.66350645419255394,110.5,21.658000000000001,66.705219971200009,-5.0262812050000001,1.1320998835554406,1.2332216943167953,1.697639149822314,1.5873696362417089,0.6,554.22,30,320.90000000000003,584.19900000000007,366.27300000000002,null,76.3,1.6,1.32,null,null,null,null,null,null,null,null,null,null,null,null,null,null,null,null,19,0.72,80,399.39195000000001]
["ENSITJAT Sorgo Pastós",24,0.89466117374478127,0.84489885255540476,102.30000000000001,26.495700000000003,67.487942194560006,-32.548440628999984,1.1262973537643675,1.2160280172855182,1.6084066051897921,1.6754350740838606,0.70099999999999996,644.7097,25,293.39999999999998,586.4,346.8,42.400000000000006,80.3,2.2399999999999998,1.5840000000000001,null,null,null,null,null,null,null,null,null,null,null,null,null,5000,200,5,19,0.63,80,572.0089099999999]
["ENSITJAT Triticale lletós",28.1,0.71854288407494793,0.63150931772761865,99.800000000000011,19.560800000000004,51.202394224206458,-17.39059613661291,1.1462933363591252,1.2627982133356292,1.7422302525507003,1.5467420771610727,0.5903225806451613,537.6067741935484,46.6,329.3,589.70000000000005,373.5,46.2,89.3,1.9600000000000002,1.9139999999999999,null,null,null,null,null,null,null,null,null,null,null,null,null,5000,200,5,19,0.72,80,464.20856935483874]
["ENSITJAT prefenificat Alfals Inici botons florals",45,0.98073229696217212,0.93754372825724863,213.6,22.321199999999997,62.683776417288968,81.82328754478597,0.97973765917405842,0.95479769802657022,1.0999907166650131,2.4498214383965466,0.70985600000000004,621.97582720000003,20.8,247.2,407.2,320.09999999999997,64.3,123.80000000000001,3.84,1.8199999999999998,null,null,null,null,null,null,null,null,null,null,null,null,null,3000,200,5,26.498799999999999,0.83,80,550.69141106000006]
["ENSITJAT prefenificat Alfals abans floració",43,0.94785679034806092,0.90465843911301136,198.2,21.801999999999992,61.325852381925756,64.24775046004099,0.99374219105851747,0.9777668498437726,1.1210232216881295,2.4038581784818929,0.7073060000000001,605.02955239999994,18.700000000000003,249.7,424.6,336.1,65.900000000000006,144.60000000000002,3.84,1.8199999999999998,null,null,null,null,null,null,null,null,null,null,null,null,null,3000,200,5,25.220600000000001,0.8,80,534.66271960999995]
["ENSITJAT prefenificat Alfals rebrots floració",47,1.0032072973934074,0.9674763745363909,219.7,27.792049999999996,68.858592379226565,78.009818425258473,0.9725684349724405,0.94271832300516278,1.084479733485664,2.484860487951897,0.72617600000000015,627.77915200000018,17.8,231.20000000000002,391.4,298.89999999999998,61.900000000000006,135.5,5.22,2.4499999999999997,null,null,null,null,null,null,null,null,null,null,null,null,null,3000,200,5,27.005099999999999,0.79,80,551.92185778500016]
["ENSITJAT Enclova Botons Florals a Floració, Bolles",27.16,0.75460390300459157,0.67286444594327566,140.9,16.273949999999999,57.035050896491214,33.421779849232493,1.0754416064743921,1.1260486535516214,1.2670212051033991,2.1268632512770091,0.60143000000000013,526.25125000000014,27,353.5,537.20000000000005,351.67649999999998,null,125,3.5999999999999996,2.0999999999999996,null,null,null,null,null,null,null,null,null,null,null,null,null,null,null,null,20.464700000000001,0.79,150,306.24784632500013]
["ENSITJAT Enclova Inici Floració a Fructificació",19.66,0.76699251537638691,0.68587181205808523,135.6,15.661799999999999,56.909349422917131,28.474704026691985,1.0804926889835968,1.1353212919101585,1.2731603311922557,2.1166076052649183,0.60561200000000004,535.72437520000017,27,349.4,589.29999999999995,349.30259999999998,null,115.39999999999999,3.5999999999999996,2.0999999999999996,null,null,null,null,null,null,null,null,null,null,null,null,null,null,null,null,20.024799999999999,0.79,150,316.81913732000021]
["Fenc Graminies SG ",83,0.5002944593580948,0.39057115705529227,75,13.125,55.612633293160329,-24.336927020563007,1.1880810433393703,1.3634990847218165,1.8288669054643381,1.4734701752607537,0.45391200000000004,417.82599600000003,26,452,775.28,469.4,null,79.5,4.8000000000000007,2.4,null,null,null,null,null,null,null,null,null,null,null,null,null,null,null,null,13.855,0.75,null,343.76810877000003]
["FENC Bromo Final vegetació",85,0.76419285183337515,0.69355439469847935,100,20.3,58.493150019206396,-20.427847183009998,1.0835094894031958,1.1490542116640832,1.4703700439119152,1.832722892363662,0.62748999999999999,564.74099999999999,34,320,640,333,null,100,1.2400000000000002,2.0299999999999998,null,null,null,null,null,null,null,null,null,null,null,null,null,50000,50,5,15.93,0.71,null,494.54585790000004]
["FENC Dàctil Floració",85,0.6267609342137026,0.53155509065566853,88,17.247999999999998,48.36165599462273,-22.605088265998003,1.134465219318965,1.2492965014143194,1.6338101491345389,1.6493843187047212,0.53715200000000007,491.49408000000005,27,372,684.07999999999993,404,null,85,0.91999999999999993,1.26,null,null,null,null,null,null,null,null,null,null,null,null,null,50000,50,5,14.933999999999999,0.72,null,418.56868242000002]
["FENC Festuca Floració",88.2,0.73943220877777716,0.65928850942806472,116,23.547999999999998,59.757651814873611,-7.6431164502399973,1.0793541165782508,1.140751809057504,1.4579976536735357,1.8482751552675172,0.60047250000000008,550.63328250000006,27,331,637.33999999999992,354.45,null,83,0.91999999999999993,1.26,null,null,null,null,null,null,null,null,null,null,null,null,null,50000,50,5,17.257999999999999,0.71,null,474.73040960000003]
["FENC Raigràs italià Espigat",85,0.75513884519311159,0.68241655802433343,79,13.824999999999999,52.185630943845752,-32.772604824959004,1.1062655311186032,1.1934031028108834,1.5408190326700311,1.7489275395653956,0.622116,566.12555999999995,26,307,609.98,337,null,90,1.6,1.6099999999999999,2,null,20,2,null,null,4.9000000000000004,null,null,null,110,null,26.5,50000,50,5,14.186999999999999,0.75,null,502.81786960999989]
["FENC Raigràs italià Floració",85,0.6767027482560638,0.59071631898229005,52,10.92,45.712396424961298,-52.983002819602021,1.1556101088638542,1.2944117226547334,1.7072960015291541,1.5783911151373442,0.57474800000000004,528.76816000000008,24,344,652.16,374,null,80,1.6,1.26,null,null,null,null,null,null,null,null,null,null,null,null,null,50000,50,5,11.946,0.7,null,466.10574158000014]
["FENC Raigràs italià rebrots d'espigat amb fulles",85,0.88455752307932112,0.83555018199236453,107,23.219000000000005,65.956156128094094,-22.330970182515014,1.0503135369712728,1.0876843119708051,1.3736638097389902,1.9617469868665793,0.69441000000000019,629.13546000000019,29,256,567,291,null,94,1.6,1.89,2,null,20,2,null,null,null,null,null,null,null,null,null,50000,50,5,16.510999999999999,0.69,null,560.37510685000018]
["FENC Civada Floració",90,0.67480317863899208,0.58227461861367924,140,33.319999999999993,65.228139936057602,6.3406156979099997,1.0749145907417021,1.1317419865579073,1.4449610854640151,1.8649504591037236,0.55566000000000004,509.54022000000003,33,320,620,390,60,83,2.52,0.66,null,null,null,null,null,null,null,null,null,null,null,null,null,50000,50,5,19.25,0.66,null,419.88017109999998]
["FENC Civada Inici espigat",90,0.78652389805863199,0.70575228911118604,175,41.649999999999991,77.978984355311994,25.711887654824995,1.0237566758532983,1.0390632549443961,1.3016259564347528,2.0703189164299771,0.60694999999999999,567.49824999999998,26,290,580,350,40,65,2.52,0.66,null,null,null,null,null,null,null,null,null,null,null,null,null,50000,50,5,22.155000000000001,0.66,null,471.74008824999999]
["FENC Ordi Espigat",78.5,0.59193017134449111,0.49259343790919707,112,26.655999999999999,55.098112213262077,-9.2667890748219968,1.1196754302777518,1.2187032952808325,1.5845540343235869,1.7006556932427213,0.51462799999999997,464.70908399999996,12.5,285,584.9,422,null,97,1.1800000000000002,1.6500000000000001,1.6,null,14.15,1.75,1.7,7.0000000000000007E-2,24,null,null,101,27,0.16,48,null,null,null,16.925999999999998,0.66,null,379.92752537999996]
["FENC Ordi Inici espigat",83.7,0.78734030434506597,0.72632602372427391,108,25.703999999999997,65.002965002686736,-20.294505461098009,1.0656566417672084,1.1155627702170452,1.4175098191472175,1.9010667886197266,0.65300200000000008,570.72374800000011,12.5,285,584.9,313,null,126,1.1800000000000002,1.6500000000000001,1.6,null,14.15,1.75,1.7,7.0000000000000007E-2,24,null,null,101,27,0.16,48,50000,50,5,16.594000000000001,0.66,null,496.58561142000019]
["FENC Ordi Lletós",90,0.70632061718517436,0.62140149005677348,135,32.129999999999995,65.961349921366406,1.6054977698649999,1.0693830299255613,1.1216408789031524,1.4286049531676628,1.8863023215395973,0.58099000000000001,526.37693999999999,12.5,285,610,370,null,94,1.4400000000000002,1.5840000000000001,1.6,null,14.15,1.75,1.7,7.0000000000000007E-2,24,null,null,101,27,0.16,48,50000,50,5,18.834999999999997,0.66,null,439.84008664999999]
["FENC Ordi Vidriós",76.3,0.74034682336508006,0.66220836375956105,99,23.561999999999998,60.204756763352961,-25.004326111939005,1.0934509872849412,1.1679797385858239,1.5007721412635913,1.7955962571734776,0.60588600000000004,554.38569000000007,12.5,285,584.9,350,null,85,1.4400000000000002,1.5840000000000001,1.8,null,11.8,1.4,1.7,7.0000000000000007E-2,24,null,null,101,27,0.16,48,50000,50,5,15.847,0.66,null,479.47602381000007]
["PALLA blat",88,0.54489449959297132,0.44220463365346863,35,7.8399999999999981,35.751928353225608,-59.963289563915012,1.2158557736596241,1.4281298035897589,1.9403574479922112,1.3888063987960364,0.49196000000000006,452.60320000000007,15,420,738.8,439,null,80,0.8,0.66,1.4,null,16.5,2.1,null,null,null,null,null,null,null,null,null,null,null,null,10.535,0.68,null,387.94561285000009]
["PALLA Blat tractada amoniac",88,0.56531695204398313,0.46053859806899722,100,22.399999999999995,49.607914377043201,-16.606867928130011,1.1419257322988237,1.2641142850862204,1.6595863549606495,1.6237665678969901,0.49287000000000009,453.44040000000007,15,420,738.8,439,null,80,0.8,0.7,null,null,null,null,null,null,null,null,null,null,null,null,null,null,null,null,15.93,0.66,null,371.86186270000007]
["PALLA Blat de moro rostoll ",85,0.65295030331947668,0.56115553193506373,59,14.041999999999998,47.160476103231375,-49.080817388499,1.1574722224070044,1.2980624106603422,1.7140693223387169,1.572153940685612,0.55452600000000007,514.60012800000004,13,344,670,390,110,72,2.2800000000000002,0.66,1.4,null,16.5,2.1,null,null,null,null,null,null,null,null,null,50000,50,5,12.527000000000001,0.66,null,447.16018621000006]
["PALLA Civada ",88,0.53812725183444132,0.4366356893312896,32,7.3919999999999986,35.099752735092487,-62.006868228182014,1.2194997260559368,1.436733452984293,1.9556277145677179,1.3779620832990693,0.49191800000000008,447.64538000000005,15,420,738.8,439,null,90,1.4000000000000001,0.66,null,null,null,null,null,null,null,null,null,null,null,null,null,50000,50,5,10.286,0.67,null,383.54475978000005]
["PALLA Ordi ",88,0.54583884995246301,0.44305246126076597,38,8.5119999999999987,36.391435400478727,-57.869916257648001,1.2122335331673182,1.4196285839782588,1.9253238055783992,1.3996507142930033,0.49200200000000005,452.64184000000006,12.5,420,738.8,439,null,80,1.4000000000000001,0.66,1.4,null,16.5,2.1,null,null,3.1,null,null,null,17.600000000000001,null,7.3,50000,50,5,10.783999999999999,0.68,null,387.20328592000004]
["PALLA Ordi tractada amoniac",88,0.56531695204398313,0.46053859806899722,100,22.399999999999995,49.607914377043201,-16.606867928130011,1.1419257322988237,1.2641142850862204,1.6595863549606495,1.6237665678969901,0.49287000000000009,453.44040000000007,12.5,420,738.8,439,null,80,1.4000000000000001,0.66,null,null,null,null,null,null,null,null,null,null,null,null,null,null,null,null,15.93,0.66,null,371.86186270000007]
["FENC Alfals Botons florals",85,0.57123558052070356,0.46444274804760227,171,35.910000000000004,61.686763221321605,42.444994754684984,1.0731847945413775,1.1276103050952651,1.4400957053043448,1.8712512160111086,0.48796,443.06768,26,372,684.07999999999993,436,null,92,4.2,1.75,null,null,null,null,null,null,7.1,null,null,null,29,null,24.6,45000,400,10,21.823,0.72,null,344.99311884999997]
["FENC Alfals Inici vegetació",85,0.76317000378293631,0.68735630001277959,168.5,35.385000000000005,71.398796663299521,32.372187837194488,1.0272530664094703,1.0452860176409202,1.3108982501333131,2.0556750605541518,0.61256199999999994,548.91680819999999,21.200000000000003,283.39999999999998,483.1,326.70000000000005,69.3,103.9,3.75,1.68,null,null,null,null,null,0.1,4.5999999999999996,0.6,null,null,42.9,0.03,21.3,45000,400,10,21.615500000000001,0.72,null,460.05302034499999]
["FENC Alfals Floració",85,0.53042608012322923,0.41881028536100962,160,33.6,57.356247581535996,35.986337833849987,1.0949864792633808,1.1689784137676618,1.5060870012241476,1.7892597423208703,0.46059999999999995,421.90959999999995,24,395,710.3,460,null,84,4.2,1.54,null,null,null,null,null,null,null,null,null,null,null,null,null,45000,400,10,20.91,0.72,null,324.66845849999993]
["FENC Alfals floració (Catalunya)",89,0.7804774847881284,0.70842363842025324,174.5,36.645000000000003,73.402532623920322,36.236647318724494,1.0179631656165384,1.0291021887835796,1.2863355843314199,2.0949283161778949,0.62396199999999991,555.95014199999991,19.8,271.5,446.59999999999997,316.70000000000005,69.099999999999994,109,5.669999999999999,2.0999999999999996,null,null,null,null,null,0.1,4.5999999999999996,0.6,null,null,42.9,0.03,21.3,45000,400,10,22.113499999999998,0.72,null,466.38877164499996]
["FENC Alfals rebrots (Catalunya)",89,0.82205470435761685,0.75613867516714384,179.3,37.653000000000006,76.258578893598411,38.09099041675249,1.006503008750228,1.0094903891680025,1.2566714172197362,2.144379829760966,0.64471000000000001,577.98251500000003,19.8,259.60000000000002,442.1,298.5,65.8,103.5,3.3,1.54,null,null,null,null,null,0.1,4.5999999999999996,0.6,null,null,42.9,0.03,21.3,45000,400,10,22.511900000000001,0.72,null,488.66494552500001]
["FENC Alfals rebrots de floració",85,0.55599142142101565,0.44631833609527294,174,36.540000000000006,61.352732546995213,45.334091071320003,1.0754412677633514,1.1317071487843955,1.4468110586675325,1.8625658295734471,0.47542000000000001,434.53388000000001,24,382,695.48,447,null,86,3.6599999999999997,1.54,null,null,null,null,null,0.1,4.5999999999999996,0.6,null,null,42.9,0.03,21.3,45000,400,10,22.071999999999999,0.72,null,334.85269719999997]
["FENC Alfals Sense especificar (primavera) IAMZ",90,0.8022678479128047,0.73596215149667599,171,35.910000000000004,73.93543875043521,32.774167968444971,1.0148357975382867,1.0238365530945255,1.2781381256264579,2.1083643353509456,0.64072000000000007,567.0372000000001,25,300,394,302,null,115,4.38,3.15,null,null,null,null,null,null,null,null,null,null,null,null,null,45000,400,10,21.823,0.72,null,479.49696845000017]
["FENC Alfals Sense especificar (estiu) IAMZ",90,0.80275298588032373,0.73261232695119138,187,39.270000000000003,76.69014371951809,44.688834856652974,1.0047311728786472,1.0063219773648062,1.2521919703921178,2.1520508863183911,0.63182800000000006,566.11788799999999,25,284,583.76,309.8,null,104,5.8199999999999994,2.0299999999999998,null,null,null,null,null,null,null,null,null,null,null,null,null,45000,400,10,23.151,0.72,null,474.00786013000004]
["FENC Enclova Final floració",87.6,0.79742769224428822,0.72717662515667236,143,30.030000000000005,68.40600963093442,11.571818123664986,1.0419028468164517,1.0716763542824852,1.3505150540292457,1.9953726777671104,0.63273999999999997,575.16066000000001,13.5,287,414,309,null,91,0.36,0.21,null,null,null,null,null,null,null,null,null,null,null,null,null,45000,400,10,19.498999999999999,0.72,null,493.99418465000002]
["FENC Trèvol blanc Vegetatiu",90,0.79818726684692809,0.7236613653982934,220,56.099999999999994,91.797130433951992,57.220365256950018,0.98223680859474038,0.96830897985285391,1.1963126772137844,2.2525723341821324,0.62019999999999997,557.5598,27,212,360,320,70,101,4.05,2.17,4.3,3.2,16.2,1.9,1.7,0.16,11,null,null,184,73,null,17,45000,400,10,25.89,0.66,null,446.58740949999998]
["FENC Trèvol violeta Final floració",89,0.71129301654850108,0.62330572153739683,160,40.799999999999997,73.887318682976002,18.872008437850003,1.0490595705479822,1.0839781862511857,1.3705459085367102,1.9662098313804495,0.5746,525.75900000000001,28,288,460,360,80,85,4.59,1.75,null,null,null,null,null,null,null,null,null,null,null,null,null,45000,400,10,20.91,0.66,null,429.17929850000002]
["FENC Veça Inici botons",91.4,0.97212142615502195,0.93222753604964459,196,49.980000000000004,94.638496257844494,33.46866560751802,0.96804899794938748,0.94589141470041038,1.1621093304524754,2.3188703240803497,0.718468,653.80588,25,204,492.55999999999995,233.79999999999998,null,90,5.28,1.54,null,null,null,null,null,null,null,null,null,null,null,null,null,45000,400,10,23.898,0.66,null,556.62495677999993]
["FENC Veça Botons",92,0.7602900997960611,0.68406922475749654,217,55.334999999999994,89.496195466959989,56.933716722874991,0.98849058053204519,0.97861550011578569,1.2116285321394968,2.2240982019172817,0.60880000000000001,533.91759999999999,25,244,470,330,null,123,5.28,1.54,null,null,null,null,null,null,null,null,null,null,null,null,null,45000,400,10,25.641000000000002,0.66,null,423.03592875000004]
["FENC Veça Inici floració",90,0.75185723717774389,0.67347333051166314,225,57.375,90.8595417645856,62.847059980834999,0.98448565926461906,0.97187134256680685,1.2018330935222286,2.2422255255307535,0.60195999999999994,527.91891999999996,25,244,538.16,336,null,123,5.28,1.54,null,null,null,null,null,null,null,null,null,null,null,null,null,45000,400,10,26.305,0.66,null,414.22726034999994]
["FENC Veça Final floració",85,0.91395057593913331,0.86255647770957011,197,50.234999999999992,92.184528135347847,36.482013491719002,0.97734056562373328,0.96084554796604882,1.1843136089723143,2.2753946415101325,0.68814400000000009,623.45846400000005,25,232,524.48,260.39999999999998,null,94,4.4099999999999993,2.17,null,null,null,null,null,null,null,null,null,null,null,null,null,45000,400,10,23.980999999999998,0.66,null,523.89410999000006]
["FENC Veça Fructificació",91,0.83209635677761806,0.76577420261610507,186,47.429999999999993,85.844816081036811,32.088384657380004,1.0008060205745131,0.99975635411462671,1.2422134746837556,2.1693379557077908,0.64527999999999996,583.33312000000001,20,236,453,298,null,96,4.5299999999999994,1.19,null,null,null,null,null,null,null,null,null,null,null,null,null,45000,400,10,23.068000000000001,0.66,null,484.02802980000001]
["FENC Veça Pastós",90.2,0.94923426925277721,0.90897107697315827,188,47.94,91.999449584953595,28.969235711509999,0.97502789206574958,0.95729300272020357,1.1786990783138984,2.2862330931639918,0.71596000000000004,640.78420000000006,20,278,576.91999999999996,236,null,105,4.8,2.0999999999999996,null,null,null,null,null,null,null,null,null,null,null,null,null,45000,400,10,23.234000000000002,0.66,null,545.7686271]
["FENC Veça (>50%)-Civada tall precoç INRA",84,0.73,0.65,158,42,93,-18.581551750000013,1.0204081632653061,1.0245017686135793,0.86,3.13,0.68,881,null,333,674,378,null,119,null,null,null,null,null,null,null,null,null,null,null,null,null,null,null,null,null,null,null,0.6,null,799.88250000000005]
["FENC Veça (20-50%)-Civada tall precoç INRA",79,0.72,0.65,104,24,75,-50.306151750000026,1.0650923587231063,1.1087768440709616,1.21,2.23,0.68,897,null,280,595,323,null,103,null,null,null,null,null,null,null,null,null,null,null,null,null,null,null,null,null,null,null,0.63,null,833.88250000000005]
["FENC Veça (< 20%)-Civada tall precoç INRA",81,0.74,0.66,129,29,81,-31.064516230000006,1.0318700433385417,1.0534720220009313,1.21,2.23,0.7,870,null,270,575,308,null,130,null,null,null,null,null,null,null,null,null,null,null,null,null,null,null,null,null,null,null,0.64,null,803.26170000000002]
["FENC Veça (>50%)-Civada tall tardà INRA",81,0.65,0.55000000000000004,123,31,81,-43.476576070000021,1.0788068396353634,1.1283330364035868,0.89,3.02,0.61,929,null,268,584,309,null,71,null,null,null,null,null,null,null,null,null,null,null,null,null,null,null,null,null,null,null,0.6,null,854.05529999999999]
["FENC Veça (20-50%)-Civada tall tardà INRA",82,0.64,0.55000000000000004,99,23,72,-53.567740550000011,1.0901813594561551,1.1553663727576771,1.39,1.94,0.63,901,null,333,675,385,null,99,null,null,null,null,null,null,null,null,null,null,null,null,null,null,null,null,null,null,null,0.63,null,835.43449999999996]
["Ensitjat RGI Campabadal","24,05",0.73934153875509279,0.65486068731593017,117.6,11.466000000000001,55.316282227987209,17.243934018769995,1.2408372808355641,1.4345614669420865,1.5512227399491314,1.7371978699922224,0.59726000000000001,532.99482399999999,26,358,630.29999999999995,427.29999999999995,null,107.6,2,1.7999999999999998,null,null,null,null,null,null,null,null,null,null,null,null,null,null,null,null,18.530799999999999,0.85,95,373.38061169999997]
["Ensitjat BM Campabadal","34,51",0.97910149899530885,0.9343387196241919,71.8,12.565,60.8228217169396,-35.75284643271813,0.97881516232602961,1.0630904441925448,1.2844202105596523,1.4,0.71019108280254772,671.76974522292994,35,195.9,378.1,211.20000000000002,null,54.1,1.4400000000000002,1.6099999999999999,null,null,null,null,null,null,null,null,null,null,null,null,null,null,null,null,24,0.75,100,469.16337180414632]
["Pastone",53,"1,08",null,83,27,78,-42,"0,97",null,null,"1,4",0.78,768.16,31,90,318,104,null,19,0.8,1.26,1.5,null,null,null,null,null,null,null,null,null,null,null,null,null,null,null,24,0.63,0.87]
[]
[]
[]
[]
[]
[]
[]
[]
[]
[]
[]
[]
[]
[]
[]
[]
[]
[]
[]
[]
[]
[]
[]
[]
[]
[]
[]
[]
[]
[]
[]
[]
[]
[]
[]
[]
[]
[]
[]
[]
[]
[]
[]
[]
[]
[]
[]
[]
[]
[]
[]
[]
[]
[]
[]
[]
[]
[]
[]
[]
[]
[]
[]
[]
[]
[]
[]
[]
[]
[]
[]
[]
[]
[]
[]
[]
[]
[]
[]
[]
[]
[]
[]
[]
[]
[]
[]
[]
[]
[]
[]
[]
[]
[]
[]
[]
[]
[]
[]
[]
[]
[]
[]
[]
[]
[]
[]
[]
[null,null,null,null,null,null,null,null,null,null,null,null,null,null,null,null,null,null,null,null,null,null,null,null,null,null,"","","","","","","","","","","","",""]
["","","","","","","","",null,null,null,null,null,"",null,"","","","","","","","","","",""]
[null,null,null,null,null,null,null,null,null,null,null,null,null,null,null,null,null,null,null,null,null,null,null,null,null,null,"","","","","","","","","","","","",""]
["","","","","","","","",null,null,null,null,null,"",null,"","","","","","","","","","",""]
[null,null,null,null,null,null,null,null,null,null,null,null,null,null,null,null,null,null,null,null,null,null,null,null,null,null,"","","","","","","","","","","","",""]
["","","","","","","","",null,null,null,null,null,"",null,"","","","","","","","","","",""]
[]
[]
[]
[]
[null,null,null,null,null,null,null,null,null,null,null,null,null,null,null,null,null,null,null,null,null,null,null,null,null,null,"","","","","","","","","","","","",""]
["","","","","","","","",null,null,null,null,null,"",null,"","","","","","","","","","",""]
[null,null,null,null,null,null,null,null,null,null,null,null,null,null,null,null,null,null,null,null,null,null,null,null,null,null,"","","","","","","","","","","","",""]
["","","","","","","","",null,null,null,null,null,"",null,"","","","","","","","","","","","","","","","","","","","","","","",""]
["","","","","","","","",null,null,null,null,null,"",null,"","","","","","","","","","",""]
[]
[]
[null,null,null,null,null,null,null,null,null,null,null,null,null,null,null,null,null,null,null,null,null,null,null,null,null,null,"","","","","","","","","","","","",""]
["","","","","","","","",null,null,null,null,null,"",null,"","","","","","","","","","",""]
[null,null,null,null,null,null,null,null,null,null,null,null,null,null,null,null,null,null,null,null,null,null,null,null,null,null,"","","","","","","","","","","","",""]
["","","","","","","","",null,null,null,null,null,"",null,"","","","","","","","","","",""]
[null,null,null,null,null,null,null,null,null,null,null,null,null,null,null,null,null,null,null,null,null,null,null,null,null,null,"","","","","","","","","","","","",""]
["","","","","","","","",null,null,null,null,null,"",null,"","","","","","","","","","",""]
[null,null,null,null,null,null,null,null,null,null,null,null,null,null,null,null,null,null,null,null,null,null,null,null,null,null,"","","","","","","","","","","","",""]
["","","","","","","","",null,null,null,null,null,"",null,"","","","","","","","","","",""]
[null,null,null,null,null,null,null,null,null,null,null,null,null,null,null,null,null,null,null,null,null,null,null,null,null,null,"","","","","","","","","","","","",""]
["","","","","","","","",null,null,null,null,null,"",null,"","","","","","","","","","",""]
[]
[]
[]
[null,null,null,null,null,null,null,null,null,null,null,null,null,null,null,null,null,null,null,null,null,null,null,null,null,null,"","","","","","","","","","","","",""]
["","","","","","","","",null,null,null,null,"","","","","","","","","","","","","","","","","","","","","","","","","","",""]
["","","","","","","","",null,null,null,null,null,"",null,"","","","","","","","","","",""]
[null,null,null,null,null,null,null,null,null,null,null,null,null,null,null,null,null,null,null,null,null,null,null,null,null,null,"","","","","","","","","","","","",""]
["","","","","","","","",null,null,null,null,null,"",null,"","","","","","","","","","",""]
[null,null,null,null,null,null,null,null,null,null,null,null,null,null,null,null,null,null,null,null,null,null,null,null,null,null,"","","","","","","","","","","","",""]
["","","","","","","","",null,null,null,null,null,"",null,"","","","","","","","","","","","","","","","","","","","","","","",""]
["","","","","","","","",null,null,null,null,null,"",null,"","","","","","","","","","",""]
[null,null,null,null,null,null,null,null,null,null,null,null,null,null,null,null,null,null,null,null,null,null,null,null,null,null,"","","","","","","","","","","","",""]
["","","","","","","","",null,null,null,null,null,"",null,"","","","","","","","","","",""]
[null,null,null,null,null,null,null,null,null,null,null,null,null,null,null,null,null,null,null,null,null,null,null,null,null,null,"","","","","","","","","","","","",""]
["","","","","","","","",null,null,null,null,null,"",null,"","","","","","","","","","",""]
[null,null,null,null,null,null,null,null,null,null,null,null,null,null,null,null,null,null,null,null,null,null,null,null,null,null,"","","","","","","","","","","","",""]
["","","","","","","","",null,null,null,null,null,"",null,"","","","","","","","","","",""]
[null,null,null,null,null,null,null,null,null,null,null,null,null,null,null,null,null,null,null,null,null,null,null,null,null,null,"","","","","","","","","","","","",""]
["","","","","","","","",null,null,null,null,null,"",null,"","","","","","","","","","",""]
[null,null,null,null,null,null,null,null,null,null,null,null,null,null,null,null,null,null,null,null,null,null,null,null,null,null,"","","","","","","","","","","","",""]
["","","","","","","","",null,null,null,null,null,"",null,"","","","","","","","","","",""]
[null,null,null,null,null,null,null,null,null,null,null,null,null,null,null,null,null,null,null,null,null,null,null,null,null,null,"","","","","","","","","","","","",""]
["","","","","","","","",null,null,null,null,null,"",null,"","","","","","","","","","",""]
[null,null,null,null,null,null,null,null,null,null,null,null,null,null,null,null,null,null,null,null,null,null,null,null,null,null,"","","","","","","","","","","","",""]
["","","","","","","","",null,null,null,null,null,"",null,"","","","","","","","","","",""]
[null,null,null,null,null,null,null,null,null,null,null,null,null,null,null,null,null,null,null,null,null,null,null,null,null,null,"","","","","","","","","","","","",""]
["","","","","","","","",null,null,null,null,null,"",null,"","","","","","","","","","",""]
[null,null,null,null,null,null,null,null,null,null,null,null,null,null,null,null,null,null,null,null,null,null,null,null,null,null,"","","","","","","","","","","","",""]
["","","","","","","","",null,null,null,null,null,"",null,"","","","","","","","","","",""]
[null,null,null,null,null,null,null,null,null,null,null,null,null,null,null,null,null,null,null,null,null,null,null,null,null,null,"","","","","","","","","","","","",""]
["","","","","","","","",null,null,null,null,null,"",null,"","","","","","","","","","",""]
[null,null,null,null,null,null,null,null,null,null,null,null,null,null,null,null,null,null,null,null,null,null,null,null,null,null,"","","","","","","","","","","","",""]
["","","","","","","","",null,null,null,null,null,"",null,"","","","","","","","","","",""]
[null,null,null,null,null,null,null,null,null,null,null,null,null,null,null,null,null,null,null,null,null,null,null,null,null,null,"","","","","","","","","","","","",""]
["","","","","","","","",null,null,null,null,null,"",null,"","","","","","","","","","",""]
[null,null,null,null,null,null,null,null,null,null,null,null,null,null,null,null,null,null,null,null,null,null,null,null,null,null,"","","","","","","","","","","","",""]
["","","","","","","","",null,null,null,null,null,"",null,"","","","","","","","","","",""]
[null,null,null,null,null,null,null,null,null,null,null,null,null,null,null,null,null,null,null,null,null,null,null,null,null,null,"","","","","","","","","","","","",""]
["","","","","","","","",null,null,null,null,null,"",null,"","","","","","","","","","",""]
[null,null,null,null,null,null,null,null,null,null,null,null,null,null,null,null,null,null,null,null,null,null,null,null,null,null,"","","","","","","","","","","","",""]
["","","","","","","","",null,null,null,null,null,"",null,"","","","","","","","","","",""]
[null,null,null,null,null,null,null,null,null,null,null,null,null,null,null,null,null,null,null,null,null,null,null,null,null,null,"","","","","","","","","","","","",""]
["","","","","","","","",null,null,null,null,null,"",null,"","","","","","","","","","",""]
[null,null,null,null,null,null,null,null,null,null,null,null,null,null,null,null,null,null,null,null,null,null,null,null,null,null,"","","","","","","","","","","","",""]
["","","","","","","","",null,null,null,null,null,"",null,"","","","","","","","","","",""]
[null,null,null,null,null,null,null,null,null,null,null,null,null,null,null,null,null,null,null,null,null,null,null,null,null,null,"","","","","","","","","","","","",""]
["","","","","","","","",null,null,null,null,null,"",null,"","","","","","","","","","",""]
[null,null,null,null,null,null,null,null,null,null,null,null,null,null,null,null,null,null,null,null,null,null,null,null,null,null,"","","","","","","","","","","","",""]
["","","","","","","","",null,null,null,null,null,"",null,"","","","","","","","","","",""]
[null,null,null,null,null,null,null,null,null,null,null,null,null,null,null,null,null,null,null,null,null,null,null,null,null,null,"","","","","","","","","","","","",""]
["","","","","","","","",null,null,null,null,null,"",null,"","","","","","","","","","",""]
[null,null,null,null,null,null,null,null,null,null,null,null,null,null,null,null,null,null,null,null,null,null,null,null,null,null,"","","","","","","","","","","","",""]
["","","","","","","","",null,null,null,null,null,"",null,"","","","","","","","","","",""]
[null,null,null,null,null,null,null,null,null,null,null,null,null,null,null,null,null,null,null,null,null,null,null,null,null,null,"","","","","","","","","","","","",""]
["","","","","","","","",null,null,null,null,null,"",null,"","","","","","","","","","",""]
[null,null,null,null,null,null,null,null,null,null,null,null,null,null,null,null,null,null,null,null,null,null,null,null,null,null,"","","","","","","","","","","","",""]
["","","","","","","","",null,null,null,null,null,"",null,"","","","","","","","","","",""]
[null,null,null,null,null,null,null,null,null,null,null,null,null,null,null,null,null,null,null,null,null,null,null,null,null,null,"","","","","","","","","","","","",""]
["","","","","","","","",null,null,null,null,null,"",null,"","","","","","","","","","",""]
[null,null,null,null,null,null,null,null,null,null,null,null,null,null,null,null,null,null,null,null,null,null,null,null,null,null,"","","","","","","","","","","","",""]
["","","","","","","","",null,null,null,null,null,"",null,"","","","","","","","","","",""]
[null,null,null,null,null,null,null,null,null,null,null,null,null,null,null,null,null,null,null,null,null,null,null,null,null,null,"","","","","","","","","","","","",""]
["","","","","","","","",null,null,null,null,null,"",null,"","","","","","","","","","",""]
[null,null,null,null,null,null,null,null,null,null,null,null,null,null,null,null,null,null,null,null,null,null,null,null,null,null,"","","","","","","","","","","","",""]
["","","","","","","","",null,null,null,null,null,"",null,"","","","","","","","","","",""]
[null,null,null,null,null,null,null,null,null,null,null,null,null,null,null,null,null,null,null,null,null,null,null,null,null,null,"","","","","","","","","","","","",""]
["","","","","","","","",null,null,null,null,null,"",null,"","","","","","","","","","",""]
[null,null,null,null,null,null,null,null,null,null,null,null,null,null,null,null,null,null,null,null,null,null,null,null,null,null,"","","","","","","","","","","","",""]
["","","","","","","","",null,null,null,null,null,"",null,"","","","","","","","","","","","","","","","","","","","","","","",""]
["","","","","","","","",null,null,null,null,null,"",null,"","","","","","","","","","",""]
[null,null,null,null,null,null,null,null,null,null,null,null,null,null,null,null,null,null,null,null,null,null,null,null,null,null,"","","","","","","","","","","","",""]
["","","","","","","","",null,null,null,null,null,"",null,"","","","","","","","","","",""]
[null,null,null,null,null,null,null,null,null,null,null,null,null,null,null,null,null,null,null,null,null,null,null,null,null,null,"","","","","","","","","","","","",""]
["","","","","","","","",null,null,null,null,null,"",null,"","","","","","","","","","",""]
[null,null,null,null,null,null,null,null,null,null,null,null,null,null,null,null,null,null,null,null,null,null,null,null,null,null,"","","","","","","","","","","","",""]
["","","","","","","","",null,null,null,null,null,"",null,"","","","","","","","","","",""]
[null,null,null,null,null,null,null,null,null,null,null,null,null,null,null,null,null,null,null,null,null,null,null,null,null,null,"","","","","","","","","","","","",""]
["","","","","","","","",null,null,null,null,null,"",null,"","","","","","","","","","",""]
[null,null,null,null,null,null,null,null,null,null,null,null,null,null,null,null,null,null,null,null,null,null,null,null,null,null,"","","","","","","","","","","","",""]
["","","","","","","","",null,null,null,null,null,"",null,"","","","","","","","","","",""]
[null,null,null,null,null,null,null,null,null,null,null,null,null,null,null,null,null,null,null,null,null,null,null,null,null,null,"","","","","","","","","","","","",""]
["","","","","","","","",null,null,null,null,null,"",null,"","","","","","","","","","",""]
[null,null,null,null,null,null,null,null,null,null,null,null,null,null,null,null,null,null,null,null,null,null,null,null,null,null,"","","","","","","","","","","","",""]
["","","","","","","","",null,null,null,null,null,"",null,"","","","","","","","","","",""]
[null,null,null,null,null,null,null,null,null,null,null,null,null,null,null,null,null,null,null,null,null,null,null,null,null,null,"","","","","","","","","","","","",""]
["","","","","","","","",null,null,null,null,null,"",null,"","","","","","","","","","",""]
[null,null,null,null,null,null,null,null,null,null,null,null,null,null,null,null,null,null,null,null,null,null,null,null,null,null,"","","","","","","","","","","","",""]
["","","","","","","","",null,null,null,null,null,"",null,"","","","","","","","","","",""]
[null,null,null,null,null,null,null,null,null,null,null,null,null,null,null,null,null,null,null,null,null,null,null,null,null,null,"","","","","","","","","","","","",""]
["","","","","","","","",null,null,null,null,null,"",null,"","","","","","","","","","","","","","","","","","","","","","","",""]
["","","","","","","","",null,null,null,null,null,"",null,"","","","","","","","","","",""]
[null,null,null,null,null,null,null,null,null,null,null,null,null,null,null,null,null,null,null,null,null,null,null,null,null,null,"","","","","","","","","","","","",""]
["","","","","","","","",null,null,null,null,null,"",null,"","","","","","","","","","",""]
[null,null,null,null,null,null,null,null,null,null,null,null,null,null,null,null,null,null,null,null,null,null,null,null,null,null,"","","","","","","","","","","","",""]
["","","","","","","","",null,null,null,null,null,"",null,"","","","","","","","","","",""]
[null,null,null,null,null,null,null,null,null,null,null,null,null,null,null,null,null,null,null,null,null,null,null,null,null,null,"","","","","","","","","","","","",""]
["","","","","","","","",null,null,null,null,null,"",null,"","","","","","","","","","",""]
[null,null,null,null,null,null,null,null,null,null,null,null,null,null,null,null,null,null,null,null,null,null,null,null,null,null,"","","","","","","","","","","","",""]
["","","","","","","","",null,null,null,null,null,"",null,"","","","","","","","","","",""]
[null,null,null,null,null,null,null,null,null,null,null,null,null,null,null,null,null,null,null,null,null,null,null,null,null,null,"","","","","","","","","","","","",""]
["","","","","","","","",null,null,null,null,null,"",null,"","","","","","","","","","",""]
[null,null,null,null,null,null,null,null,null,null,null,null,null,null,null,null,null,null,null,null,null,null,null,null,null,null,"","","","","","","","","","","","",""]
["","","","","","","","",null,null,null,null,null,"",null,"","","","","","","","","","",""]
[null,null,null,null,null,null,null,null,null,null,null,null,null,null,null,null,null,null,null,null,null,null,null,null,null,null,"","","","","","","","","","","","",""]
["","","","","","","","",null,null,null,null,null,"",null,"","","","","","","","","","",""]
[null,null,null,null,null,null,null,null,null,null,null,null,null,null,null,null,null,null,null,null,null,null,null,null,null,null,"","","","","","","","","","","","",""]
["","","","","","","","",null,null,null,null,null,"",null,"","","","","","","","","","",""]
[null,null,null,null,null,null,null,null,null,null,null,null,null,null,null,null,null,null,null,null,null,null,null,null,null,null,"","","","","","","","","","","","",""]
["","","","","","","","",null,null,null,null,null,"",null,"","","","","","","","","","",""]
[null,null,null,null,null,null,null,null,null,null,null,null,null,null,null,null,null,null,null,null,null,null,null,null,null,null,"","","","","","","","","","","","",""]
["","","","","","","","",null,null,null,null,null,"",null,"","","","","","","","","","",""]
[null,null,null,null,null,null,null,null,null,null,null,null,null,null,null,null,null,null,null,null,null,null,null,null,null,null,"","","","","","","","","","","","",""]
["","","","","","","","",null,null,null,null,null,"",null,"","","","","","","","","","",""]
[null,null,null,null,null,null,null,null,null,null,null,null,null,null,null,null,null,null,null,null,null,null,null,null,null,null,"","","","","","","","","","","","",""]
["","","","","","","","",null,null,null,null,null,"",null,"","","","","","","","","","",""]
[null,null,null,null,null,null,null,null,null,null,null,null,null,null,null,null,null,null,null,null,null,null,null,null,null,null,"","","","","","","","","","","","",""]
["","","","","","","","",null,null,null,null,null,"",null,"","","","","","","","","","",""]
[null,null,null,null,null,null,null,null,null,null,null,null,null,null,null,null,null,null,null,null,null,null,null,null,null,null,"","","","","","","","","","","","",""]
["","","","","","","","",null,null,null,null,null,"",null,"","","","","","","","","","",""]
[null,null,null,null,null,null,null,null,null,null,null,null,null,null,null,null,null,null,null,null,null,null,null,null,null,null,"","","","","","","","","","","","",""]
["","","","","","","","",null,null,null,null,null,"",null,"","","","","","","","","","",""]
[null,null,null,null,null,null,null,null,null,null,null,null,null,null,null,null,null,null,null,null,null,null,null,null,null,null,"","","","","","","","","","","","",""]
["","","","","","","","",null,null,null,null,null,"",null,"","","","","","","","","","","","","","","","","","","","","","","",""]
["","","","","","","","",null,null,null,null,null,"",null,"","","","","","","","","","",""]
[]
[null,null,null,null,null,null,null,null,null,null,null,null,null,null,null,null,null,null,null,null,null,null,null,null,null,null,"","","","","","","","","","","","",""]
["","","","","","","","",null,null,null,null,null,"",null,"","","","","","","","","","",""]
[null,null,null,null,null,null,null,null,null,null,null,null,null,null,null,null,null,null,null,null,null,null,null,null,null,null,"","","","","","","","","","","","",""]
["","","","","","","","",null,null,null,null,null,"",null,"","","","","","","","","","","","","","","","","","","","","","","",""]
["","","","","","","","",null,null,null,null,null,"",null,"","","","","","","","","","",""]
[null,null,null,null,null,null,null,null,null,null,null,null,null,null,null,null,null,null,null,null,null,null,null,null,null,null,"","","","","","","","","","","","",""]
["","","","","","","","",null,null,null,null,null,"",null,"","","","","","","","","","",""]
[null,null,null,null,null,null,null,null,null,null,null,null,null,null,null,null,null,null,null,null,null,null,null,null,null,null,"","","","","","","","","","","","",""]
["","","","","","","","",null,null,null,null,null,"",null,"","","","","","","","","","",""]
[null,null,null,null,null,null,null,null,null,null,null,null,null,null,null,null,null,null,null,null,null,null,null,null,null,null,"","","","","","","","","","","","",""]
["","","","","","","","",null,null,null,null,null,"",null,"","","","","","","","","","",""]
[null,null,null,null,null,null,null,null,null,null,null,null,null,null,null,null,null,null,null,null,null,null,null,null,null,null,"","","","","","","","","","","","",""]
["","","","","","","","",null,null,null,null,null,"",null,"","","","","","","","","","","","","","","","","","","","","","","",""]
["","","","","","","","",null,null,null,null,null,"",null,"","","","","","","","","","",""]
[]
[null,null,null,null,null,null,null,null,null,null,null,null,null,null,null,null,null,null,null,null,null,null,null,null,null,null,"","","","","","","","","","","","",""]
["","","","","","","","",null,null,null,null,null,"",null,"","","","","","","","","","",""]
[null,null,null,null,null,null,null,null,null,null,null,null,null,null,null,null,null,null,null,null,null,null,null,null,null,null,"","","","","","","","","","","","",""]
["","","","","","","","",null,null,null,null,null,"",null,"","","","","","","","","","",""]
[null,null,null,null,null,null,null,null,null,null,null,null,null,null,null,null,null,null,null,null,null,null,null,null,null,null,"","","","","","","","","","","","",""]
["","","","","","","","",null,null,null,null,null,"",null,"","","","","","","","","","",""]
[null,null,null,null,null,null,null,null,null,null,null,null,null,null,null,null,null,null,null,null,null,null,null,null,null,null,"","","","","","","","","","","","",""]
["","","","","","","","",null,null,null,null,null,"",null,"","","","","","","","","","",""]
[null,null,null,null,null,null,null,null,null,null,null,null,null,null,null,null,null,null,null,null,null,null,null,null,null,null,"","","","","","","","","","","","",""]
["","","","","","","","",null,null,null,null,null,"",null,"","","","","","","","","","",""]
[]
[]
[]
[]
[]
[]
[]
[]
[]
[]
[null,null,null,null,null,null,null,null,null,null,null,null,null,null,null,null,null,null,null,null,null,null,null,null,null,null,"","","","","","","","","","","","",""]
["","","","","","","","",null,null,null,null,null,"",null,"","","","","","","","","","",""]

{"sheet":"Taula Concentrats","index":2,"n_rows":198,"n_cols":42,"rows_kept":198,"cut":false,"hidden":false,"merged":[]}
["Concentrats","MS","UFL","UFV","MNT_PB","PDIA","PDI","BPR","UEL","UEB","UEM","NI ref","dMO","MOD_TDN","EE","FB","NDF","ADF","Lignina","cendres","Ca","P","Mg","Cl","K","Na","S","Co","Cu","Mo","Iode","Fe","Mn","Se","Zn","Vit A","Vit D","Vit E","AG","DT_N","dr","MOF"]
[]
["Ordi gra",87.2,1.0789699893040996,1.0677525561217629,112,27.595082457151996,89.462201893951999,-31.347374120000008,0.2046,null,null,2,0.83732799999999996,816.39479999999992,19,54,215,65,12,25,0.8,3.9,1.3,null,5.55,0.35,null,0.01,4.0999999999999996,0.3,null,90,17.600000000000001,0.02,24.4,1000,null,25,{"$f":"0.75*O3","v":14.25},{"$f":"1-(F3/(E3*AO3))","v":0.73492599485689536},{"$f":"(88.3+0.0371*E3-3.7*(10^-5)*(E3^2)-0.107*S3-0.00313*(100-N3))/100","v":0.92949387723999977},{"$f":"N3-E3*(1-AN3)-O3","v":767.70651142397219}]
["Blat de moro gra",86,1.2447554097468898,1.2699211700375517,89,38.129888218376763,100.70571645287278,-70.144731616400009,0.3291,null,null,2,0.88284600000000013,870.48615600000005,43,26,125,31,60,14,0.5,2.9,1.4,null,3.6,0.33,null,0.02,2.2999999999999998,0.3,null,80,10.8,0.02,21.4,null,null,null,{"$f":"0.85*O4","v":36.549999999999997},0.50925139963862587,0.87300444668280008,783.80953056783778]
["Blat gra",87,1.1915137972087206,1.2050625767281833,157,33.001449423599993,96.505827343600004,5.8944094999999983,0.1714,null,null,2,0.87875000000000003,861.17500000000007,23,29,146,38,12,20,0.5,3.9,null,null,null,null,null,0.02,4.4000000000000004,0.3,null,null,33.700000000000003,0.04,32.5,null,null,12,{"$f":"O5*0.75","v":17.25},0.77712043387736873,0.94311164749999987,803.18290811874692]
["Civada",87.4,1.002754803542979,0.95481461893995845,111,20.397543993710997,75.333047872111024,-14.566724810000022,0.32080000000000003,null,null,2,0.72867000000000004,706.80990000000008,67,135,336,162,27,30,1,4,1.75,null,4.3,0.5,null,0.02,3.5,0.7,null,null,38.4,0.04,25.2,null,null,15,{"$f":"O6*0.9","v":60.300000000000004},0.79800315384488929,0.90972537986999991,617.38825007678281]
["Fajol gra",88,1.0007757853016814,0.96615921016994921,125,34.099887237024994,90.969890410784984,-20.559379958999994,0.21290000000000009,null,null,2,0.74392999999999987,726.8196099999999,28,118,301,158.9,33.4,23,1.1000000000000001,3.7,1.2,0.5,5.0999999999999996,0.6,1.6,0.06,11,null,null,50,38,null,10,null,null,null,{"$f":"O7*0.75","v":21},0.69938671959743504,0.90747520379299995,661.24294994967931]
["Mill gra",88,1.009546490666007,0.97767630563404173,131,35.907645941378647,91.778122786690659,-15.037620070799999,0.21290000000000009,null,null,2,0.75275400000000003,721.13833199999999,42,106,284.5,143.85999999999999,29.700000000000003,42,0.4,3.2,1.7,0.34,4.66,0.45,null,null,null,null,null,null,null,null,null,null,null,null,{"$f":"0.9*O8","v":37.800000000000004},0.69974811478529253,0.91291405979160001,639.80533503687332]
["Segol gra",86.5,1.2078146748003231,1.231534718227727,120,35.283824642879999,99.110415798080027,-34.72904868000002,0.21290000000000009,null,null,2,0.88214000000000015,864.49720000000013,16.200000000000003,26,132,42,14,20,0.7,4,1.35,null,5.25,0.3,null,0.03,4.5,0.2,null,null,55,0.03,30,null,null,17,{"$f":"0.75*O9","v":12.150000000000002},0.68422403581734659,0.93114076235999998,810.40408429808167]
["Sorgo gra",86,1.2563624126057522,1.2850946916475117,114,33.93068941985544,97.130963149263465,-37.710427702200008,0.21290000000000009,null,null,2,0.88468600000000008,869.64633800000001,37,25,107,49,4,17,0.3,3.2,1.75,null,3.6,0.4,null,null,10,null,null,160,14,null,14,14000,null,12,{"$f":"O10*0.9","v":33.300000000000004},0.68346370384827659,0.9402954103793999,796.56120023870358]
["Triticale gra",87.1,1.1917933324586927,1.2103621408310392,130,38.225488002259986,101.29653785185999,-26.948515390000008,0.21290000000000009,null,null,2,0.87145000000000006,852.27809999999999,17,33,148,40,13,22,0.5,4.5999999999999996,null,null,null,null,null,null,null,null,null,null,null,null,null,null,null,null,{"$f":"O11*0.75","v":12.75},0.68538622981633202,0.93461330452999991,794.37830987612313]
["Blat segó blat dur",87.7,1.0176943686522057,0.977907847095282,167,34.631141078796077,88.47767852596408,25.244785238800009,0.30577720000000003,null,null,2,0.73153799999999991,692.03494799999987,58,118,481,148,38,54,1.7,10.4,null,null,null,null,null,null,10,null,null,200,90,null,80,1000,null,21,{"$f":"O12*0.8","v":46.400000000000006},0.77274508423544552,0.91250876387239999,596.08337706731925]
["Blat de moro flocs",89,1.2854594416716449,1.3156335468620108,100,41.498506498559998,103.94646933760002,-59.774941936000019,0.231567,null,null,2,0.88266,868.53744000000006,43,26,90,30,10,16,0.3,2.9,1.4,0.5,3.7,0.3,1.2,0.05,4,null,null,30,5,0.08,14,1000,null,25,{"$f":"O13*0.85","v":36.549999999999997},0.55366202283859689,0.92975522187199999,780.90364228385977]
["Blat de moro bagàs",88.1,1.2034638734603806,1.2055011502513313,151,56.283786721918673,116.77481847795069,-22.647237118800017,0.28759999999999997,null,null,2,0.85009200000000007,833.94025199999999,34,68,272,78,11,19,null,null,1.8,null,3.5,9.5,null,null,null,null,null,null,null,null,null,null,null,null,{"$f":"O14*0.75","v":25.5},0.60422014182361838,0.94178695988759986,740.17749341536637]
["Blat de moro hominyfeed (mescla segó, germèn i midó)",90,1.1533551355658935,1.1579668052179757,114,46.524159785375986,107.37452349097599,-49.998693289999991,0.25357849999999998,null,null,2,0.83747599999999989,816.53909999999985,19,54,215,65,12,25,0.5,5.7,2.6,0.6,6.5,0.9,0.3,0.06,15,null,null,75,16,0.11,3,null,null,null,{"$f":"O15*0.85","v":16.149999999999999},0.56121014448870521,0.93007315382999989,747.51705647171229]
["Blat de moro gluten feed",87.7,1.0563074392437739,1.0298938534891089,216,53.864651595352321,111.00304612616833,49.881258545599977,0.3125,null,null,2,0.82507200000000003,769.79217599999993,45,88,343,100,13,67,3,7.8,3.5,null,10.25,7,null,null,null,null,null,null,null,null,null,3000,null,14,{"$f":"O16*0.9","v":40.5},0.73830819761020405,0.9529277751088,668.26674668380406]
["Blat de moro gluten meal",89.3,1.6477477819813739,1.7039593019383183,661,427.85021155354741,474.69275818906743,117.51852088199998,0.48679999999999995,null,null,2,0.94365200000000005,929.49722000000008,35,21,107,28,6,15,0.2,4,null,null,null,null,null,null,null,null,null,null,null,null,null,14000,null,26,{"$f":"O17*0.8","v":28},0.34360783225527836,0.98611349298600004,460.62199712073908]
["Blat de moro espigots ",90.2,0.52319139706798212,0.41152989548810526,44,14.398539143577599,59.977382422937616,-62.536942624000005,0.46929120000000002,null,null,2,0.45527600000000007,437.0649600000001,5,302,822,408,38,40,1.2,0.7,null,null,null,null,null,null,null,null,null,null,null,null,null,null,null,null,2,0.62321203231751077,0.86849781324800002,415.48628942197058]
["Blat de moro segó",88.3,1.1129736772157073,1.1007866196572278,101,43.238359333239842,96.344289691511847,-50.718016184800007,0.37059999999999998,null,null,2,0.70725199999999999,669.06039199999998,40,150,557,164,19,54,0.3,2.5,null,null,null,null,null,null,null,null,null,null,null,null,null,null,null,null,{"$f":"O19*0.85","v":34},0.53170775876766296,0.91417822026959994,581.76287563553399]
["Blat de moro tortó de gèrmens a pressió",88.1,1.1789597500931865,1.171602179305957,146,59.101547199313913,113.88478174088193,-23.878803971200011,0.2642698,null,null,2,0.80152400000000001,763.05084800000009,82,72,285,82,11,48,0.6,4.7,4.5,null,1.8,8.5,null,null,null,null,null,null,null,null,null,null,null,null,{"$f":"O20*0.8","v":65.600000000000009},0.56855881276595621,0.9382625715424,618.06043466382971]
["Blat de moro tortó de gèrmens amb dissolvent",87.9,1.0419900226719216,1.0235383932445659,135,54.171907268543997,111.696577773504,-33.882297663999992,0.26867210000000002,null,null,2,0.79027999999999987,752.34655999999984,17,79,310,89,12,48,0.9,5,4.5,null,1.8,8.5,null,null,null,null,null,null,null,null,null,1000,null,94,{"$f":"O21*0.75","v":12.75},0.57033439439208355,0.93392019732799991,677.34170324293109]
["Blat de moro extrussionat",90.3,1.2659242795142109,1.3059451410330718,96.35,55.422778448670854,120.6512296608667,-82.396955019056023,0.21464959,null,null,2,0.91813040000000012,904.90932224000017,4.32,2.5499999999999998,12.18,3.1,0.55000000000000004,14.399999999999999,0.3,2.9,1.4,0.5,3.7,0.3,1.2,0.05,4,null,null,30,5,0.08,14,1000,null,25,{"$f":"O22*0.85","v":3.6720000000000002},0.3880056000926686,0.93991618246111197,841.62366180892877]
["Fajol segones",89,1.1855213154544,1.1685861892728744,335,98.398382182629987,150.65027895702997,125.25641129000003,0.21290000000000009,null,null,2,0.79561999999999999,751.8608999999999,82,83,251.39,114.99000000000001,22.61,55,null,null,null,null,null,null,null,null,null,null,null,null,null,null,null,null,null,null,{"$f":"O23*0.8","v":65.600000000000009},0.69466219022372699,0.96197229616999991,567.57273372494842]
["Ordi bagàs cerveseria fresc",20.5,0.86409217991914111,0.77037029419231517,300,129.948715875,172.97965507500001,53.564157499999993,0.49509999999999998,null,null,2,0.63849999999999996,606.57500000000005,86,150,525,206,47,50,3.3,5.7,1.6,null,0.7,1.6,null,0.08,22.2,0.5,null,null,38.5,0.06,85,null,null,29,{"$f":"O24*0.45","v":38.700000000000003},0.5325076886943908,0.9265657974999999,380.32730660831726]
["Ordi bagàs cerveseria sec",91.9,0.87119356499561229,0.78054262949459352,262.39999999999998,107.61563282559231,151.63839868082431,35.094428351199994,0.49509999999999998,null,null,2,0.62731999999999999,601.34895199999994,79.900000000000006,161.6,643.29999999999995,236.4,78.899999999999991,41.4,2.2999999999999998,6.3,null,null,null,null,null,0.08,22.2,0.5,null,null,38.5,0.06,85,null,null,29,{"$f":"O25*0.45","v":35.955000000000005},0.53718506650710496,0.88614373099759991,400.00631345146428]
["Ordi malta, gra germinat i eixugat",89.6,0.82318564868563615,0.75819659606944634,255,66.3550213595625,127.25276543956251,71.697274874999977,0.29589999999999994,null,null,2,0.89924999999999988,840.79874999999993,23,10,94,10,6,65,2.7,7.5,null,null,null,null,null,null,null,null,null,null,null,null,null,null,null,16,{"$f":"O26*0.45","v":10.35},0.73182278620697816,0.97031275087500002,749.4135604827793]
["Ordi segó",89,0.76049500367747369,0.68300071501306703,118,25.132764616152489,75.567175445336488,-8.0437669206000031,0.36300710000000003,null,null,2,0.62060199999999999,581.50407399999995,32,187,539,239,28,63,0.8,3.9,null,null,null,null,null,0.03,11.7,0.6,null,null,123,0.05,59,null,null,null,{"$f":"O27*0.8","v":25.6},0.76510334942826175,0.90673719751619997,521.78626923253478]
["Cacau tortó",86.6,0.92152562915630509,0.87946946177744068,232,88.670879085753597,140.27091297407361,25.814947049499995,0.34659280999999997,null,null,2,0.74546499999999993,673.15489500000001,20,161,363.86,212.89999999999998,47.29,97,2.6,1.3,null,null,null,null,null,null,null,null,null,null,null,null,null,null,null,null,{"$f":"O28*0.75","v":15},0.58297490871153479,0.91649656821350012,556.40507382107603]
["Cacauet, tortó 48",88.6,1.1944335830241395,1.1865160385387328,524,143.30222231441923,198.10149398417923,261.73613801599998,0.28759999999999997,null,null,2,0.84376000000000007,789.75936000000002,16,77,150,101,26,64,1.8,6.6,3,null,null,null,null,0.3,14.5,1.7,null,450,47.5,0.11,61.5,null,null,null,{"$f":"O29*0.75","v":12},0.71794238190373694,0.96958034796799997,625.96116811755815]
["Coco tortó",90,0.97095956734287703,0.93399951412527582,239,87.269035447756792,138.20984342983681,30.484987527999994,0.28759999999999997,null,null,2,0.7160399999999999,660.18887999999993,18,178,580,316,78,78,2,6.6,4,null,null,0.6,null,null,20,null,null,500,60,null,70,null,null,null,{"$f":"O30*0.9","v":16.2},0.58722694217038374,0.88460814194399984,543.53611917872161]
["Colza, gra",89.9,1.9687535898800934,2.0261645054875959,217,41.884822356221591,81.980608908541598,90.240333511999992,0.29589999999999994,null,null,2,0.84608000000000005,798.69952000000012,457,68,199,116,41,56,3.3,5.3,null,null,null,null,null,null,null,null,null,null,null,null,null,null,null,null,{"$f":"O31*0.85","v":388.45},0.79112532282213199,0.92408336497600008,296.37371505240276]
["Colza, gra semiesclovellat",90,2.0068243854673327,2.0660563857148828,217,41.884822356221591,80.92224090854161,91.894033511999979,0.29589999999999994,null,null,2,0.84608000000000005,798.69952000000012,480,68,115,84,41,56,3.3,5.3,null,null,null,null,null,null,null,null,null,null,null,null,null,null,null,null,{"$f":"O32*0.79","v":379.20000000000005},0.79112532282213199,0.92408336497600008,273.37371505240276]
["Colza, turtó ",90,0.95800502495921236,0.90985936028426784,418,103.91199090373202,155.86270835653204,193.04700397999994,0.3125,null,null,2,0.78420000000000001,704.99580000000014,26,120,287,182,74,101,8.4,12.4,5.15,null,12.4,0.75,null,0.1,5.5,0.5,null,300,63.5,7.0000000000000007E-2,64.5,null,null,20,{"$f":"O33*0.8","v":20.8},0.72777380875241571,0.91318648854000006,565.20525205850993]
["Colza, turtó  tanné, curtit",89,1.2403090812927602,1.2532844857689245,391,143.42495357934857,193.47316113966858,118.739675687,0.33739999999999998,null,null,2,0.77349000000000001,713.93126999999993,26,129,302,193,79,77,8.4,12.4,null,null,12.4,0.75,null,0.1,5.5,0.5,null,300,63.5,7.0000000000000007E-2,64.5,null,null,null,{"$f":"O34*0.69","v":17.939999999999998},0.59520702136024917,0.90618107875099996,529.6572153518573]
["Cotó, gra",92,1.1057454642423121,1.0271553531490456,220,48.764449067224007,91.654792821464014,70.583837883999976,0.50340000000000007,null,null,2,0.64651999999999998,618.71964000000003,198,276,456,354,105,43,2.1,6.4,null,null,null,null,null,null,null,null,null,null,null,null,null,null,null,null,{"$f":"O35*0.95","v":188.1},0.73941085414823005,0.85059792473200002,363.39002791261066]
["Cotó tortó dessoliat",89,1.1501920277402691,1.1259438132783857,466,160.92210943249918,212.64457169579521,184.58365271359997,0.29948819999999998,null,null,2,0.80219600000000002,750.855456,20,127,232,138,32,64,4.7,9.4,5.2,null,15.2,0.4,null,null,null,null,null,null,null,null,null,null,null,null,{"$f":"O36*0.75","v":15},0.64090967269049992,0.96167005577279996,563.51936347377296]
["Cotó clovella",91,0.36620814217767916,0.23807886329057015,81,16.103086591867196,54.653602301563204,-25.8351807964,0.65129486000000003,null,null,2,0.32318199999999997,309.60835599999996,19,547,900,697.4,184.60000000000002,42,1.4,1.1000000000000001,null,null,null,null,null,null,null,null,null,null,null,null,null,null,null,null,{"$f":"O37*0.75","v":14.25},0.72375435859716208,0.71966217154279999,268.23245904637008]
["Favó gra",86.9,1.2866071181997207,1.3209577887210684,302,51.430279740777983,115.06988487997799,130.98311697000003,0.1714,null,null,2,0.91429999999999989,876.81370000000004,16,90,171,108,24.700000000000003,41,1.3,7,1.6,0.8,12,0.25,null,0.4,13.8,1,null,100,12.7,0.02,43.7,null,null,null,{"$f":"O38*0.8","v":12.8},0.82245394822364193,0.95918178880999994,807.19479236353993]
["Gira-sol, gra",93,1.7084711843203275,1.695156001331616,174,24.647498694691201,60.4191065078112,72.586862791999977,0.26269999999999993,null,null,2,0.74312,714.13832000000002,485,164,294,200,56,39,1.8,4.8,null,null,null,null,null,null,null,null,null,null,null,null,null,null,null,null,{"$f":"O39*0.95","v":460.75},0.84184492382372955,0.89565440941600005,201.61933674532895]
["Gira-sol tortó esclovellat",91,0.99107641893319698,0.94397086945962927,417,80.253815077377354,133.12343795232135,220.11121425790003,0.32080000000000003,null,null,2,0.74591699999999994,691.46505899999988,22,176,299,220,70,73,3.8,9.9,5.5,1.2,12,0.33,null,null,null,null,null,null,null,null,null,null,null,null,{"$f":"O40*0.75","v":16.5},0.79012083402996014,0.91698092634670014,581.94544679049329]
["Llentia gra",88,1.2927425717054508,1.3306553425464995,281,49.081812964852382,113.1999670179724,113.22538429199999,0.1714,null,null,2,0.91962999999999995,886.52332000000001,19.3,49,160,72,3,36,1.1000000000000001,4.5,null,null,null,null,null,null,null,null,null,null,null,null,null,null,null,null,{"$f":"O41*0.75","v":14.475000000000001},0.82166571738072802,0.97944360991599988,817.11138658398465]
["Llí, gra",90.3,1.6575837469429318,1.6606714982698805,253,51.011948668166198,92.319144300857403,111.00750682392,0.32080000000000003,null,null,2,0.78051800000000005,743.36534319999998,362,101.89999999999999,244.7,148.4,62,47.599999999999994,4.2081949058693242,6.7552602436323372,3.9867109634551494,0.66445182724252494,7.9734219269102988,0.77519379844961245,2.9900332225913622,null,13.289036544850498,0.22148394241417499,0.44296788482834998,163.89811738648947,32.115171650055373,null,49.833887043189371,null,null,null,{"$f":"O42*0.95","v":343.9},0.77769198729402633,0.90697700524215985,325.12141598538869]
["Llinosa tortó dessoliat",89,1.1518710540767036,1.1341411667893986,377,129.46711168154192,180.63225981184593,120.74445604639997,0.30640610000000001,null,null,2,0.80390399999999995,752.45414399999981,58,118,236,149,88,64,4.7,9.4,6.1,null,14,1.3,null,0.6,21,0.6,null,250,59,0.5,73,null,null,9,{"$f":"O43*0.75","v":43.5},0.61695666244551961,0.89654108470719995,550.04680574196072]
["Margalló tortó (palmiste)",90,0.83194750357129577,0.76329964928928062,206,83.768055090368009,136.52083694508801,-3.9262216479999914,0.42869999999999997,null,null,2,0.73055999999999999,699.14591999999993,19,167,632,241,103,43,3.1,6.7,null,null,null,null,null,null,null,null,null,null,null,null,null,null,null,null,{"$f":"O44*0.9","v":17.100000000000001},0.52287183224694234,0.85226794729599997,581.85751744287006]
["Mongeta gra",88,1.2694175668129566,1.3060081028573072,257,44.572029681858787,108.56384220537879,93.98279293200001,0.1714,null,null,2,0.91937000000000002,878.91772000000003,19,51,162,74,3,44,1.3,5.0999999999999996,1.6,null,14,0.4,null,null,null,null,null,null,null,null,null,null,null,null,{"$f":"O45*0.8","v":15.200000000000001},0.82213541357934528,0.97507899463600001,814.20652128989173]
["Pèsol gra",85.7,1.2625786176584095,1.2977899538253017,259,44.911731932978391,108.99577708625841,95.458679448000012,0.1714,null,null,2,0.91768000000000005,877.30208000000005,15,64,162,74,3,44,0.9,4.5999999999999996,1.45,null,11,0.3,null,7.0000000000000007E-2,7.2,1.1000000000000001,null,null,8,0.2,37,null,null,null,{"$f":"O46*0.8","v":12},0.82222021761807795,0.97538858510400006,816.25711636308222]
["Soja, gra extrussionat",88,1.4854856019534888,1.4973907223657086,402,188.43235510953002,238.04062854249003,109.28707276099998,0.32080000000000003,null,null,2,0.97179000000000004,912.51081000000011,213,74,146,92,7,61,2.8,6.4,null,null,null,null,null,null,null,null,null,null,null,null,null,null,null,null,{"$f":"O47*0.95","v":202.35},0.52666678399466216,0.99029010835300013,509.23085716585433]
["Soja, gra torrat",88.6,1.4901857276896577,1.5024458709028436,397.29999999999995,133.30789500662681,185.68918291519,158.22623764286999,0.29589999999999994,null,null,2,0.97577899999999995,918.50077269999986,216.70000000000002,63.2,132,77.78,13.5,58.7,3.6117381489841991,5.9819413092550793,2.5959367945823928,0.56433408577878108,20.767494356659142,0.90293453724604977,3.1602708803611739,null,38.37471783295711,4.5146726862302486,null,161.39954853273139,31.602708803611741,0.31602708803611745,45.146726862302486,null,null,null,{"$f":"O48*0.95","v":205.86500000000001},0.65872130014657793,0.98316887688550991,566.2107452482353]
["Soja tortó 44",87.2,1.1656258626018918,1.1597938319839582,488,153.41999795655397,207.06952650471396,219.17261164349998,0.27810560000000001,null,null,2,0.84965499999999994,779.13363500000003,22,84,163,104,8,83,3.4,7,2.7,null,20,1.95,null,0.3,17.100000000000001,2.2999999999999998,null,200,43.7,0.2,54.6,null,null,7,{"$f":"O49*0.75","v":16.5},0.68199960346033861,0.9886316027755,601.94944148864533]
["Soja tortó 46",87.2,1.2042399719188401,1.2053336060239686,505,160.06920989040626,214.45587978640626,229.07082828750001,0.26867210000000002,null,null,2,0.86389499999999997,799.10287499999993,20,72,143,89,7,75,3.4,7.4,2.7,null,20,1.95,null,0.3,17.100000000000001,2.2999999999999998,null,200,43.7,0.2,54.6,null,null,null,{"$f":"O50*0.75","v":15},0.6799548883113109,0.99038766998750005,617.48009359721186]
["Soja tortó 48",88.3,1.2238106736886152,1.2268716598377332,520,165.08161824536202,219.31515756907405,239.06009480669999,0.26741429999999999,null,null,2,0.86734100000000003,804.02510700000005,23,70,140,87,7,73,3.4,7.8,2.7,null,19.7,1.95,null,0.3,17.100000000000001,2.2999999999999998,null,200,43.7,0.2,54.6,null,null,null,{"$f":"O51*0.75","v":17.25},0.67946396874075055,0.99041798584910001,614.34637074519037]
["Soja tortó 50",87.8,1.225744301238733,1.2255650042406774,544,172.40454338212001,225.71545583172002,256.10169929750003,0.2498051,null,null,2,0.86202699999999988,797.37497499999995,28,77,102,59,6,75,3,7.8,2.7,null,19.7,1.95,null,0.3,17.100000000000001,2.2999999999999998,null,200,43.7,0.2,54.6,null,null,null,{"$f":"O52*0.75","v":21},0.68011632654366916,0.99073551671750015,595.35825663975595]
["Soja tortó 48 curtit \"tanne\"",88.8,1.2238106736886152,1.2268716598377332,520,165.08161824536202,219.31515756907405,239.06009480669999,0.26741429999999999,null,null,2,0.86734100000000003,804.02510700000005,23,70,140,87,7,73,3.4,7.8,null,null,null,null,null,0.3,17.100000000000001,2.2999999999999998,null,200,43.7,0.2,54.6,null,null,null,{"$f":"O53*0.66","v":15.180000000000001},0.67946396874075055,0.99041798584910001,614.34637074519037]
["Llobí (tramús) gra",86.7,1.4985748501920342,1.5443460916061895,399,69.098815818280471,127.26703342788048,218.10215998500001,0.1714,null,null,2,0.90506999999999993,864.34185000000002,104,161,229,172,17,45,2,4.5999999999999996,2.5,null,9.5,0.55000000000000004,null,null,null,null,null,null,null,null,null,null,null,null,{"$f":"O54*0.9","v":93.600000000000009},0.82289872796188157,0.97785852990499988,689.67844245679078]
["Llobí (tramús) extrussionat",88,1.5275128795369315,1.5781926650923088,406,69.232090685749569,127.71452533022958,223.28119586800003,0.1714,null,null,2,0.91027000000000002,877.50027999999998,109,121,214,175,34.4,36,2,4.5,1.7,0.23,10,0.11,null,null,null,null,null,null,null,null,null,null,null,null,{"$f":"O55*0.77","v":83.93},0.82240293019900856,0.96016443876399993,696.39586966079742]
["Polpes (cítrics) ensitjades",21,1.2247648530455373,1.2387634090832353,73,20.576516455389989,79.537256128989995,-58.876155740000002,0.22120000000000006,null,null,2,0.87227999999999994,824.30459999999994,97,156,356.65,206.62,44.65,55,20.399999999999999,1.5,1.6,null,6.2,0.9,0.2,0.16,6,null,null,160,7,null,16,null,null,null,{"$f":"O56*0.6","v":58.199999999999996},0.68078367808218965,0.88300650397999969,704.00180849999981]
["Polpes (cítrics)",90,1.0945776496498119,1.1035515879610236,70,20.494530967225,82.579768544825001,-65.708183715000004,0.22120000000000006,null,null,2,0.87930999999999993,822.1548499999999,28,137,223,158,14,65,23,1.3,null,null,null,null,null,null,null,null,null,null,null,null,null,null,null,null,{"$f":"O57*0.6","v":16.8},0.6799461391636954,0.91478044680499992,771.75107974145862]
["Garrofer garrofa",87,0.84349490499888424,0.82739527562045634,58,20.578036751799999,81.081596271800024,-76.256811750000026,0.28817428899999997,null,null,2,0.801456386292835,771.80250000000012,11,87,257.16000000000003,120.00999999999999,23.83,37,1.5,0.6,null,null,null,null,null,null,null,null,null,null,null,null,null,null,null,null,{"$f":"O58*0.9","v":9.9},0.60525957312408907,0.89880263824999995,737.90755524119731]
["Garrofer polpa deshidratada sense grana, IAMZ",86,0.81755713356327342,0.80100990873229949,56,19.887404593055997,81.023260765855994,-78.364775269999996,0.286199543,null,null,2,0.80349252336448596,773.76329999999996,0.1,84.5,253.55,116.86999999999999,23.07,37,1.5,0.6,null,null,null,null,null,null,null,null,null,null,null,null,null,null,null,null,{"$f":"O59*0.8","v":8.0000000000000016E-2},0.60497831613785447,0.89901957128999999,751.54208570371975]
["Oliva molinada \"orujo\"",89,0.3555684594003049,0.23152849593807051,111,37.773671789926794,72.196085881446805,-21.365022018000008,0.58639999999999992,null,null,2,0.33429000000000003,306.87822,74,339,620.51,456.32,108.36,82,14,3.4,null,null,null,null,null,null,null,null,null,null,null,null,null,null,null,null,{"$f":"O60*0.74","v":54.76},0.57995139706720433,0.81015231828599998,186.25282507445968]
["Oliva polpa sense extracció, IAMZ ",68.5,0.52852566084554287,0.41188219318965796,114,44.703288467039997,84.482230931040007,-28.474597600000006,0.58639999999999992,null,null,2,0.45799999999999996,425.02399999999994,74,200,341,295,60.21,72,11.9,1.6,null,null,null,null,null,null,null,null,null,null,null,null,null,null,null,null,{"$f":"O61*0.74","v":54.76},0.54731158643493383,0.86623403119999987,299.4175208535824]
["Oliva polpa d'extracció (\"orujo\"), IAMZ",87.6,0.28358208219027031,0.16307856023765305,66,20.210481566827202,53.349659430507202,-38.259965412,0.58639999999999992,null,null,2,0.26932,252.89148,74,412,725.77,527.95000000000005,134.64000000000001,61,5.6,0.9,null,null,null,null,null,null,null,null,null,null,null,null,null,null,null,null,{"$f":"O62*0.74","v":54.76},0.60054601929246265,0.766594983324,152.52751727330252]
["Patata-ITEB",13,1.2240398770980918,1.2703481114883948,100,34.239489082499993,100.58316924249999,-56.862000250000008,0.12159999999999993,null,null,2,0.94450000000000001,901.99749999999995,0.8,30,174.97,48.46,7.2799999999999994,45,1,2,1,22,null,null,null,null,null,null,null,null,null,null,null,null,null,null,{"$f":"O63*0.8","v":0.64000000000000012},0.63329746986550162,0.93371292174999998,864.52724698655015]
["Patata polpa-ITEB",17,1.0475620581342135,1.0403259038381121,50,15.367721216250001,77.369791776250025,-80.57823525000002,0.12159999999999993,null,null,2,0.81010000000000004,789.84750000000008,2.5,150,348,199.08999999999997,43.7,25,5,0.5,0.8,6,null,null,null,null,null,null,null,null,null,null,null,null,null,null,{"$f":"O64*0.8","v":2},0.64892165618683528,0.87545822674999996,769.79358280934184]
["Poma deixalles",22,1.1001886495245434,1.1027604333914458,23,8.7955432171043988,71.564699576784406,-100.08680681200001,0.48679999999999995,null,null,2,0.82908000000000004,813.32747999999992,18,68,229.76,96.16,18,19,0.6,0.6,null,null,null,null,null,null,null,null,null,null,null,null,null,null,null,null,{"$f":"O65*0.9","v":16.2},0.57243623367851648,0.89440442012400012,785.49351337460575]
["Poma molinada (\"marc\") deshidratada",94.1,0.5535459390511992,0.42986523768137502,79,22.417724090135192,65.611793691415201,-39.820733751999995,0.48679999999999995,null,null,2,0.44367999999999996,435.25007999999991,39,478,354,610.79,121,19,1.9,1.6,null,null,null,null,null,null,null,null,null,null,null,null,null,null,null,null,35.1,0.64126377758117026,0.79102315750399976,367.90991842891236]
["Poma residu deshidratat, NRC",89,1.0175921929055001,0.98320116886366127,49,17.456201438843994,73.715111672443996,-76.134547240000003,0.48679999999999995,null,null,2,0.73319999999999996,717.06959999999992,51,170,376.83,260,50.24,22,1.3,1.1000000000000001,0.7,null,4.5999999999999996,1.2,0.2,null,10,null,null,300,7,null,null,null,null,null,45.9,{"$f":"1-(F67/(E67*AO67))","v":0.58855484528181679},{"$f":"(88.3+0.0371*E67-3.7*(10^-5)*(E67^2)-0.107*S67-0.00313*(100-N67))/100","v":0.86584810847999993},{"$f":"N67-E67*(1-AN67)-O67","v":645.90878741880897}]
["Raïm vinassa sense pinyols",67,0.66080505971637316,0.56171561481913768,172,20.015764349395198,59.872981870035204,-4.2369023759999997,0.58639999999999992,null,null,2,0.54432999999999998,483.36503999999996,97,103,777,685,536,112,6,2.5,null,null,null,null,null,null,null,null,null,null,null,null,null,null,null,null,{"$f":"O68*0.75","v":72.75},0.68913529881265156,0.37434524575200001,332.89631139577602]
["Raïm polpa",90,0.30489011965292578,0.18655481578623268,120,11.608508946144001,48.208402918624003,-20.987334332000007,0.58639999999999992,null,null,2,0.30492000000000002,292.41828000000004,7,372,754,653,499,41,8,4,null,null,null,null,null,null,null,null,null,null,null,null,null,null,null,null,{"$f":"O69*0.75","v":5.25},0.75465044300790995,0.39428469216400003,255.97633316094925]
["Raïm tortó de pinyols",89,0.16230419405379379,6.7872305095073068E-2,112,-1.6540106768192107,29.626211898540795,-16.035347774000005,0.58639999999999992,null,null,2,0.18833000000000005,181.17346000000003,16,503,847,751,644,38,6.6,1.3,null,null,null,null,null,null,null,null,null,null,null,null,null,null,null,null,{"$f":"O70*0.75","v":12},1.0632808876836617,0.23337144929799986,172.26091942057013]
["Remolatxa polpes ensitjades",22,1.0076659697674053,1.0014902800769032,98,33.631260467481596,93.731943465241613,-53.227317184,0.28759999999999997,null,null,2,0.85377999999999998,778.64736000000005,9,206,428.74,269.38,62.220000000000006,88,13,1,null,null,null,null,null,0.1,4.5999999999999996,0.3,null,null,52.4,0.03,9.6,null,null,null,{"$f":"O71*0.5","v":4.5},0.60575801718969247,0.87047078236799991,731.01164568458989]
["Remolatxa polpes deshidratades",90,1.0254716288107246,1.0191080235150367,98,34.16981376867458,94.986646944936979,-54.346301837909991,0.28759999999999997,null,null,2,0.85500100000000001,794.2104288999999,9,202.7,507.9,302.10000000000002,55.099999999999994,71.100000000000009,10.6,1,2.2333333333333334,0.4,4,2.2333333333333329,2.2000000000000002,9.3333333333333338E-2,7.7333333333333334,0.3,null,243,47.6,0.03,9.7333333333333325,null,0.6,null,4,0.60314025484359779,0.87857630642456985,746.31817387467254]
["Melassa Remolatxa",76,1.184004733191649,1.2070895142316092,146,10.219999999999994,76.740128512000027,17.642299199999986,-0.70840000000000014,null,null,3,0.89,878.25200000000007,2,0,0,0,0,13.200000000000001,3.5,0.5,16.5,null,55,12.5,null,null,null,null,null,null,null,null,null,null,null,null,2,0.93,1,866.03200000000004]
["Melassa canya",75,0.86106390989984793,0.83916162333276656,45,3.1499999999999977,61.811424000000009,-64.008475000000004,-1.5384,null,null,4,0.8,710.40000000000009,12,0,0,0,0,112,9.3000000000000007,1.1000000000000001,4.7,27,33,1.7,null,null,null,null,null,null,null,null,null,null,null,null,12,0.93,1,695.25000000000011]
["Grassa vegetal, mantega de porc (tots els tipus)",99.9,3.61,3.94,9.9999999999999995E-8,9.9999999999999995E-8,9.9999999999999995E-8,-14,0.25,null,null,2,0.9,9.9999999999999995E-8,999,9.9999999999999995E-8,9.9999999999999995E-8,9.9999999999999995E-8,9.9999999999999995E-8,9.9999999999999995E-8,9.9999999999999995E-8,9.9999999999999995E-8,9.9999999999999995E-8,9.9999999999999995E-8,9.9999999999999995E-8,9.9999999999999995E-8,9.9999999999999995E-8,9.9999999999999995E-8,9.9999999999999995E-8,9.9999999999999995E-8,9.9999999999999995E-8,9.9999999999999995E-8,9.9999999999999995E-8,9.9999999999999995E-8,9.9999999999999995E-8,1300,9.9999999999999995E-8,95,{"$f":"O75","v":999},0,0,0]
["Llevat cerveseria",93.3,1.18,1.17,476,87,143,278,0.15,null,null,2,0.84,756,40,21,88,25,7,32,3,13.5,2.4,null,null,null,null,null,null,null,null,null,null,null,null,null,null,null,32,{"$f":"1-(F76/(E76*AO76))","v":0.81515770697868817},{"$f":"(88.3+0.0371*E76-3.7*(10^-5)*(E76^2)-0.107*S76-0.00313*(100-N76))/100","v":0.98880568000000002},{"$f":"N76-E76*(1-AN76)-O76","v":628.0150685218556}]
["Urea",99,0.26,0.2,2870,9.9999999999999995E-7,71,2557,0.23,null,null,2,0.99,9.9999999999999995E-7,9.9999999999999995E-7,9.9999999999999995E-7,9.9999999999999995E-7,9.9999999999999995E-7,9.9999999999999995E-7,9.9999999999999995E-7,9.9999999999999995E-7,9.9999999999999995E-7,9.9999999999999995E-7,9.9999999999999995E-7,9.9999999999999995E-7,9.9999999999999995E-7,9.9999999999999995E-7,9.9999999999999995E-7,9.9999999999999995E-7,9.9999999999999995E-7,9.9999999999999995E-7,9.9999999999999995E-7,9.9999999999999995E-7,9.9999999999999995E-7,9.9999999999999995E-7,9.9999999999999995E-7,9.9999999999999995E-7,9.9999999999999995E-7,0,0,0,0]
["Residu pa deshidratat, NRC ",92,1.0961415666476575,1.0548754187213749,107,22.016129611689657,70.466557902495424,-10.723794204384003,0.29445700000000002,null,null,2,0.71421800000000002,628.16901535999989,127,130,180,130,10,44,1.4,2.6,2.6,16.100000000000001,5.3,12.4,0.2,1.05,5,null,null,31,71,null,16,2000,null,45,null,{"$f":"1-(F78/(E78*AO78))","v":0.77738842706928668},{"$f":"(88.3+0.0371*E78-3.7*(10^-5)*(E78^2)-0.107*S78-0.00313*(100-N78))/100","v":0.924292560180768},{"$f":"N78-E78*(1-AN78)-O78","v":477.34957705641352}]
["Mandioca",85,1.1420974625875657,1.1744543546403801,31,10.1054225265006,75.490022489380621,-97.453437442000009,0.12159999999999993,null,null,2,0.91761999999999999,861.64517999999998,8.1999999999999993,54,118,59,14.01,61,2.5,1,0.9,null,7.5,0.35,null,null,2,null,null,50,5,null,30,null,null,null,{"$f":"O79*0.8","v":6.56},{"$f":"1-(F79/(E79*AO79))","v":0.63899949400537248},{"$f":"(88.3+0.0371*E79-3.7*(10^-5)*(E79^2)-0.107*S79-0.00313*(100-N79))/100","v":0.90299422413399999},{"$f":"N79-E79*(1-AN79)-O79","v":842.25416431416647}]
["Alfals deshidratat i aglomerats",90.2,0.73987011742021469,0.6738447078476324,233,68.64631678888,116.14710297768001,51.380021579999976,0.37889999999999996,null,null,2,0.66579999999999995,579.91179999999997,34,237,405,280,76,129,24.1,3.2,null,null,null,null,null,null,null,null,null,null,null,null,null,null,null,null,{"$f":"O80*0.5","v":17},{"$f":"1-(F80/(E80*AO80))","v":0.66636436588674008},{"$f":"(88.3+0.0371*E80-3.7*(10^-5)*(E80^2)-0.107*S80-0.00313*(100-N80))/100","v":0.88305730933999993},{"$f":"N80-E80*(1-AN80)-O80","v":468.17469725161038}]
["Graminies deshidratades i aglomerades",91,0.82899594181392655,0.78514605944839444,105,26.822401345057497,80.520582379937494,-29.853407866999998,0.38187409999999999,null,null,2,0.72206999999999999,649.14093000000003,25,238,508,269,73.08,101,4.3,2.7,null,null,null,null,null,null,null,null,null,null,null,null,null,null,null,null,{"$f":"O81*0.5","v":12.5},{"$f":"1-(F81/(E81*AO81))","v":0.70187781135587579},{"$f":"(88.3+0.0371*E81-3.7*(10^-5)*(E81^2)-0.107*S81-0.00313*(100-N81))/100","v":0.85686826110900005},{"$f":"N81-E81*(1-AN81)-O81","v":592.83810019236694}]
[]
[]
[]
[]
[]
[]
[]
[]
[]
[]
[]
[]
[]
[]
[]
[]
[]
[]
[]
[]
[]
[]
[]
[]
[]
[]
[]
[]
[]
[]
[]
[]
[]
[]
[]
[]
[]
[]
[]
[]
[]
[]
[]
[]
[]
[]
[]
[]
[]
[]
[]
[]
[]
[]
[]
[]
[]
[]
[]
[]
[]
[]
[]
[]
[]
[]
[]
[]
[]
[]
[]
[]
[]
[]
[]
[]
[]
[]
[]
[]
[]
[]
[]
[]
[]
[]
[]
[]
[]
[]
[]
[]
[]
[]
[]
[]
[]
[]
[]
[]
[]
[]
[]
[]
[]
[]
[]
[]
["","","","","","","","",null,null,null,null,"","","","","","","","","","","","","","","","","","","","","","","","","",""]
["","","","","","","","",null,null,null,null,"","","","","","","","","","","","","","","","","","","","","","","","","",""]
[]
["","","","","","","","",null,null,null,null,"","","","","","","","","","","","","","","","","","","","","","","","","",""]
[]
[]
["","","","","","","","",null,null,null,null,"","","","","","","","","","","","","","","","","","","","","","","","","",""]
[]
["","","","","","","","",null,null,null,null,"","","","","","","","","","","","","","","","","","","","","","","","","",""]

{"sheet":"Taula Minerals-aa","index":3,"n_rows":24,"n_cols":42,"rows_kept":24,"cut":false,"hidden":false,"merged":[]}
["INGREDIENTS","MS","UFL","UFV","MNT_PB","PDIA","PDI","BPR","UEL","UEB","UEM","NI ref","dMO","MOD_TDN","EE","FB","NDF","ADF","Lignina","cendres","Ca","P","Mg","Cl","K","Na","S","Co","Cu","Mo","Iode","Fe","Mn","Se","Zn","Vit A","Vit D","Vit E","AG","DT_N","dr","MOF"]
[]
["Carbonat càlcic",98,null,null,null,null,null,null,null,null,null,null,null,null,null,null,null,null,null,955,145.54,null,14,0.2,0.7,0.7,0.7,null,12,null,null,620]
["Fosfat bicàlcic",98.8,null,null,null,null,null,null,null,null,null,null,null,null,null,null,null,null,null,836,244,122.4,5,0.4,1.2,0.8,11,null,15,null,null,7800]
["Fosfat monocàlcic",98.8,null,null,null,null,null,null,null,null,null,null,null,null,null,null,null,null,null,null,88.2,155.04000000000002]
["Òxid magnèsic",100,null,null,null,null,null,null,null,null,null,null,null,null,null,null,null,null,null,null,30,null,510]
["Farina d’ossos",100,null,null,null,null,null,null,null,null,null,null,null,null,null,null,null,null,null,null,11.8,10.200000000000001]
["Fosfat sòdic",100,null,null,null,null,null,null,null,null,null,null,null,null,null,null,null,null,null,null,null,13.600000000000001,null,null,null,19]
["Fosfòric",100,null,null,null,null,null,null,null,null,null,null,null,null,null,null,null,null,null,null,null,21.488000000000003]
["Bicarbonat sòdic",99.7,null,null,null,null,null,null,null,null,null,null,null,null,null,null,null,null,null,null,null,null,null,null,null,270]
["Carbonat de cobalt",100,null,null,null,null,null,null,null,null,null,null,null,null,null,null,null,null,null,null,null,null,null,null,null,null,null,49]
["Carbonat de manganès",100,null,null,null,null,null,null,null,null,null,null,null,null,null,null,null,null,null,null,null,null,null,null,null,null,null,null,null,null,null,null,47]
["Carbonat de zinc",100,null,null,null,null,null,null,null,null,null,null,null,null,null,null,null,null,null,null,null,null,null,null,null,null,null,null,null,null,null,null,null,null,52]
["Clorur potàssic",100,null,null,null,null,null,null,null,null,null,null,null,null,null,null,null,null,null,null,null,null,null,null,52]
["Clorur sòdic",98,null,null,null,null,null,null,null,null,null,null,null,null,null,null,null,null,null,null,null,null,null,570,null,360]
["Iodur potàssic",100,null,null,null,null,null,null,null,null,null,null,null,null,null,null,null,null,null,null,null,null,null,null,null,null,null,null,null,null,76]
["Òxid de coure",100,null,null,null,null,null,null,null,null,null,null,null,null,null,null,null,null,null,null,null,null,null,null,null,null,null,null,80,null,null,null,null,null,null,null,null,780]
["Òxid de manganès",100,null,null,null,null,null,null,null,null,null,null,null,null,null,null,null,null,null,null,null,null,null,null,null,null,null,null,null,null,null,null,77]
["Òxid de zinc",100,null,null,null,null,null,null,null,null,null,null,null,null,null,null,null,null,null,null,null,null,null,null,null,null,null,null,null,null,null,null,null,null,80]
["Sulfat de cobalt",100,null,null,null,null,null,null,null,null,null,null,null,null,null,null,null,null,null,null,null,null,null,null,null,null,null,22]
["Sulfat de coure",100,null,null,null,null,null,null,null,null,null,null,null,null,null,null,null,null,null,null,null,null,null,null,null,null,null,null,25]
["Sulfat de zinc",100,null,null,null,null,null,null,null,null,null,null,null,null,null,null,null,null,null,null,null,null,null,null,null,null,null,null,null,null,null,null,null,null,23]
["Sulfat magnèsic",100,null,null,null,null,null,null,null,null,null,null,null,null,null,null,null,null,null,null,null,null,10,null,null,null,13]
["Sulfat sòdic",100,null,null,null,null,null,null,null,null,null,null,null,null,null,null,null,null,null,null,null,null,null,null,null,32,22]

{"sheet":"CàlculsEV","index":4,"n_rows":53,"n_cols":109,"rows_kept":53,"cut":false,"hidden":true,"merged":[[2,0,6,0],[7,0,18,0],[19,0,24,0]]}
[null,null,null,{"$f":"OFFSET('Taula Farratges'!$A$1,0,D2,1,1)","v":"MS %"},{"$f":"OFFSET('Taula Farratges'!$A$1,0,E2,1,1)","v":"UEB"},{"$f":"OFFSET('Taula Farratges'!$A$1,0,F2,1,1)","v":"UFL"},{"$f":"OFFSET('Taula Farratges'!$A$1,0,G2,1,1)","v":"PDI"},{"$f":"OFFSET('Taula Farratges'!$A$1,0,H2,1,1)","v":"BPR"},{"$f":"OFFSET('Taula Farratges'!$A$1,0,I2,1,1)","v":"NI ref"},{"$f":"OFFSET('Taula Farratges'!$A$1,0,J2,1,1)","v":"Ca"},{"$f":"OFFSET('Taula Farratges'!$A$1,0,K2,1,1)","v":"P"},{"$f":"OFFSET('Taula Farratges'!$A$1,0,L2,1,1)","v":"Mg"},{"$f":"OFFSET('Taula Farratges'!$A$1,0,M2,1,1)","v":"K"},{"$f":"OFFSET('Taula Farratges'!$A$1,0,N2,1,1)","v":"Na"},{"$f":"OFFSET('Taula Farratges'!$A$1,0,O2,1,1)","v":"S"},{"$f":"OFFSET('Taula Farratges'!$A$1,0,P2,1,1)","v":"Cl"},{"$f":"OFFSET('Taula Farratges'!$A$1,0,Q2,1,1)","v":"Co"},{"$f":"OFFSET('Taula Farratges'!$A$1,0,R2,1,1)","v":"Cu"},{"$f":"OFFSET('Taula Farratges'!$A$1,0,S2,1,1)","v":"Mn"},{"$f":"OFFSET('Taula Farratges'!$A$1,0,T2,1,1)","v":"Zn"},{"$f":"OFFSET('Taula Farratges'!$A$1,0,U2,1,1)","v":"Iode"},{"$f":"OFFSET('Taula Farratges'!$A$1,0,V2,1,1)","v":"Se"},{"$f":"OFFSET('Taula Farratges'!$A$1,0,W2,1,1)","v":"Vit A"},{"$f":"OFFSET('Taula Farratges'!$A$1,0,X2,1,1)","v":"Vit D"},{"$f":"OFFSET('Taula Farratges'!$A$1,0,Y2,1,1)","v":"Vit E"},{"$f":"OFFSET('Taula Farratges'!$A$1,0,Z2,1,1)","v":"AG"},{"$f":"OFFSET('Taula Farratges'!$A$1,0,AA2,1,1)","v":"MNT_PB"},{"$f":"OFFSET('Taula Farratges'!$A$1,0,AB2,1,1)","v":"PDIA"},{"$f":"OFFSET('Taula Farratges'!$A$1,0,AC2,1,1)","v":"dMO"},{"$f":"OFFSET('Taula Farratges'!$A$1,0,AD2,1,1)","v":"MOD"},{"$f":"OFFSET('Taula Farratges'!$A$1,0,AE2,1,1)","v":"EE"},{"$f":"OFFSET('Taula Farratges'!$A$1,0,AF2,1,1)","v":"FB"},{"$f":"OFFSET('Taula Farratges'!$A$1,0,AG2,1,1)","v":"NDF"},{"$f":"OFFSET('Taula Farratges'!$A$1,0,AH2,1,1)","v":"ADF"},{"$f":"OFFSET('Taula Farratges'!$A$1,0,AI2,1,1)","v":"Lignina"},{"$f":"OFFSET('Taula Farratges'!$A$1,0,AJ2,1,1)","v":"cendres"},{"$f":"OFFSET('Taula Farratges'!$A$1,0,AK2,1,1)","v":"Mo"},{"$f":"OFFSET('Taula Farratges'!$A$1,0,AL2,1,1)","v":"DT_N"},{"$f":"OFFSET('Taula Farratges'!$A$1,0,AM2,1,1)","v":"MOF"},null,null,null,null,null,null,null,null,null,null,null,null,null,null,null,null,null,null,null,null,null,"AG","MNT_PB","PDIA","dMO","MOD","EE","FB","NDF","ADF","Lignina","cendres","Mo"]
["TIPUS","INGREDIENTS UTILITZATS","Nº",1,9,{"$f":"E29+1","v":2},6,7,11,20,21,22,24,25,26,23,27,28,32,34,30,33,35,36,37,38,4,5,12,13,14,15,16,17,18,19,29,39,41,"UEB","UFV","PDI","BPR","NI ref","Ca","P","Mg","K","Na","S","Cl","Co","Cu","Mn","Zn","Iode","Se","Vit A","Vit D","Vit E","AG","MNT_PB","PDIA","dMO","MOD","EE","FB","NDF","ADF","Lignina","cendres","Mo","DT_N","MOF"]
["FARRATGES",{"$f":"IF(OFFSET('Taula Farratges'!$A$1,C3,0,1,1)=0,\"\",OFFSET('Taula Farratges'!$A$1,C3,0,1,1))","v":"FENC Civada Inici espigat"},66,{"$f":"OFFSET('Taula Farratges'!$A$1,$C3,$D$2,1,1)","v":90},{"$f":"OFFSET('Taula Farratges'!$A$1,$C3,$E$2,1,1)","v":1.0390632549443961},{"$f":"OFFSET('Taula Farratges'!$A$1,$C3,$F$2,1,1)","v":0.78652389805863199},{"$f":"OFFSET('Taula Farratges'!$A$1,$C3,$G$2,1,1)","v":77.978984355311994},{"$f":"OFFSET('Taula Farratges'!$A$1,$C3,$H$2,1,1)","v":25.711887654824995},{"$f":"OFFSET('Taula Farratges'!$A$1,$C3,$I$2,1,1)","v":2.0703189164299771},{"$f":"OFFSET('Taula Farratges'!$A$1,$C3,$J$2,1,1)","v":2.52},{"$f":"OFFSET('Taula Farratges'!$A$1,$C3,$K$2,1,1)","v":0.66},{"$f":"OFFSET('Taula Farratges'!$A$1,$C3,$L$2,1,1)","v":0},{"$f":"OFFSET('Taula Farratges'!$A$1,$C3,$M$2,1,1)","v":0},{"$f":"OFFSET('Taula Farratges'!$A$1,$C3,$N$2,1,1)","v":0},{"$f":"OFFSET('Taula Farratges'!$A$1,$C3,$O$2,1,1)","v":0},{"$f":"OFFSET('Taula Farratges'!$A$1,$C3,$P$2,1,1)","v":0},{"$f":"OFFSET('Taula Farratges'!$A$1,$C3,$Q$2,1,1)","v":0},{"$f":"OFFSET('Taula Farratges'!$A$1,$C3,$R$2,1,1)","v":0},{"$f":"OFFSET('Taula Farratges'!$A$1,$C3,$S$2,1,1)","v":0},{"$f":"OFFSET('Taula Farratges'!$A$1,$C3,$T$2,1,1)","v":0},{"$f":"OFFSET('Taula Farratges'!$A$1,$C3,$U$2,1,1)","v":0},{"$f":"OFFSET('Taula Farratges'!$A$1,$C3,$V$2,1,1)","v":0},{"$f":"OFFSET('Taula Farratges'!$A$1,$C3,$W$2,1,1)","v":50000},{"$f":"OFFSET('Taula Farratges'!$A$1,$C3,$X$2,1,1)","v":50},{"$f":"OFFSET('Taula Farratges'!$A$1,$C3,$Y$2,1,1)","v":5},{"$f":"OFFSET('Taula Farratges'!$A$1,$C3,$Z$2,1,1)","v":22.155000000000001},{"$f":"OFFSET('Taula Farratges'!$A$1,$C3,$AA$2,1,1)","v":175},{"$f":"OFFSET('Taula Farratges'!$A$1,$C3,$AB$2,1,1)","v":41.649999999999991},{"$f":"OFFSET('Taula Farratges'!$A$1,$C3,$AC$2,1,1)","v":0.60694999999999999},{"$f":"OFFSET('Taula Farratges'!$A$1,$C3,$AD$2,1,1)","v":567.49824999999998},{"$f":"OFFSET('Taula Farratges'!$A$1,$C3,$AE$2,1,1)","v":26},{"$f":"OFFSET('Taula Farratges'!$A$1,$C3,$AF$2,1,1)","v":290},{"$f":"OFFSET('Taula Farratges'!$A$1,$C3,$AG$2,1,1)","v":580},{"$f":"OFFSET('Taula Farratges'!$A$1,$C3,$AH$2,1,1)","v":350},{"$f":"OFFSET('Taula Farratges'!$A$1,$C3,$AI$2,1,1)","v":40},{"$f":"OFFSET('Taula Farratges'!$A$1,$C3,$AJ$2,1,1)","v":65},{"$f":"OFFSET('Taula Farratges'!$A$1,$C3,$AK$2,1,1)","v":0},{"$f":"OFFSET('Taula Farratges'!$A$1,$C3,$AL$2,1,1)","v":0.66},{"$f":"OFFSET('Taula Farratges'!$A$1,$C3,$AM$2,1,1)","v":471.74008824999999},{"$f":"IF('II_Plantejar Ració'!$E4>0,IF(CàlculsEV!E3>0,1,\"No\"),\"\")","v":1},{"$f":"IF('II_Plantejar Ració'!$E4>0,IF(CàlculsEV!F3>0,1,\"No\"),\"\")","v":1},{"$f":"IF('II_Plantejar Ració'!$E4>0,IF(CàlculsEV!G3>0,1,\"No\"),\"\")","v":1},{"$f":"IF('II_Plantejar Ració'!$E4>0,IF(CàlculsEV!H3=0,\"No\",1),\"\")","v":1},{"$f":"IF('II_Plantejar Ració'!$E4>0,IF(CàlculsEV!I3>0,1,\"No\"),\"\")","v":1},{"$f":"IF('II_Plantejar Ració'!$E4>0,IF(CàlculsEV!J3>0,1,\"No\"),\"\")","v":1},{"$f":"IF('II_Plantejar Ració'!$E4>0,IF(CàlculsEV!K3>0,1,\"No\"),\"\")","v":1},{"$f":"IF('II_Plantejar Ració'!$E4>0,IF(CàlculsEV!L3>0,1,\"No\"),\"\")","v":"No"},{"$f":"IF('II_Plantejar Ració'!$E4>0,IF(CàlculsEV!M3>0,1,\"No\"),\"\")","v":"No"},{"$f":"IF('II_Plantejar Ració'!$E4>0,IF(CàlculsEV!N3>0,1,\"No\"),\"\")","v":"No"},{"$f":"IF('II_Plantejar Ració'!$E4>0,IF(CàlculsEV!O3>0,1,\"No\"),\"\")","v":"No"},{"$f":"IF('II_Plantejar Ració'!$E4>0,IF(CàlculsEV!P3>0,1,\"No\"),\"\")","v":"No"},{"$f":"IF('II_Plantejar Ració'!$E4>0,IF(CàlculsEV!Q3>0,1,\"No\"),\"\")","v":"No"},{"$f":"IF('II_Plantejar Ració'!$E4>0,IF(CàlculsEV!R3>0,1,\"No\"),\"\")","v":"No"},{"$f":"IF('II_Plantejar Ració'!$E4>0,IF(CàlculsEV!S3>0,1,\"No\"),\"\")","v":"No"},{"$f":"IF('II_Plantejar Ració'!$E4>0,IF(CàlculsEV!T3>0,1,\"No\"),\"\")","v":"No"},{"$f":"IF('II_Plantejar Ració'!$E4>0,IF(CàlculsEV!U3>0,1,\"No\"),\"\")","v":"No"},{"$f":"IF('II_Plantejar Ració'!$E4>0,IF(CàlculsEV!V3>0,1,\"No\"),\"\")","v":"No"},{"$f":"IF('II_Plantejar Ració'!$E4>0,IF(CàlculsEV!W3>0,1,\"No\"),\"\")","v":1},{"$f":"IF('II_Plantejar Ració'!$E4>0,IF(CàlculsEV!X3>0,1,\"No\"),\"\")","v":1},{"$f":"IF('II_Plantejar Ració'!$E4>0,IF(CàlculsEV!Y3>0,1,\"No\"),\"\")","v":1},{"$f":"IF('II_Plantejar Ració'!$E4>0,IF(CàlculsEV!Z3>0,1,\"No\"),\"\")","v":1},{"$f":"IF('II_Plantejar Ració'!$E4>0,IF(CàlculsEV!AA3>0,1,\"No\"),\"\")","v":1},{"$f":"IF('II_Plantejar Ració'!$E4>0,IF(CàlculsEV!AB3>0,1,\"No\"),\"\")","v":1},{"$f":"IF('II_Plantejar Ració'!$E4>0,IF(CàlculsEV!AC3>0,1,\"No\"),\"\")","v":1},{"$f":"IF('II_Plantejar Ració'!$E4>0,IF(CàlculsEV!AD3>0,1,\"No\"),\"\")","v":1},{"$f":"IF('II_Plantejar Ració'!$E4>0,IF(CàlculsEV!AE3>0,1,\"No\"),\"\")","v":1},{"$f":"IF('II_Plantejar Ració'!$E4>0,IF(CàlculsEV!AF3>0,1,\"No\"),\"\")","v":1},{"$f":"IF('II_Plantejar Ració'!$E4>0,IF(CàlculsEV!AG3>0,1,\"No\"),\"\")","v":1},{"$f":"IF('II_Plantejar Ració'!$E4>0,IF(CàlculsEV!AH3>0,1,\"No\"),\"\")","v":1},{"$f":"IF('II_Plantejar Ració'!$E4>0,IF(CàlculsEV!AI3>0,1,\"No\"),\"\")","v":1},{"$f":"IF('II_Plantejar Ració'!$E4>0,IF(CàlculsEV!AJ3>0,1,\"No\"),\"\")","v":1},{"$f":"IF('II_Plantejar Ració'!$E4>0,IF(CàlculsEV!AK3>0,1,\"No\"),\"\")","v":"No"},{"$f":"IF('II_Plantejar Ració'!$E4>0,IF(CàlculsEV!AL3>0,1,\"No\"),\"\")","v":1},{"$f":"IF('II_Plantejar Ració'!$E4>0,IF(CàlculsEV!AM3>0,1,\"No\"),\"\")","v":1},{"$f":"IF(AN3=\"\",0,1)","v":1},1,1,1,1,1,1,1,1,1,1,1,1,1,1,1,1,1,1,1,1,1,1,1,1,1,1,1,1,1,1,1,1,1,1]
[null,{"$f":"IF(OFFSET('Taula Farratges'!$A$1,C4,0,1,1)=0,\"\",OFFSET('Taula Farratges'!$A$1,C4,0,1,1))","v":"ENSITJAT prefenificat Alfals rebrots floració"},55,{"$f":"OFFSET('Taula Farratges'!$A$1,$C4,$D$2,1,1)","v":47},{"$f":"OFFSET('Taula Farratges'!$A$1,$C4,$E$2,1,1)","v":0.94271832300516278},{"$f":"OFFSET('Taula Farratges'!$A$1,$C4,$F$2,1,1)","v":1.0032072973934074},{"$f":"OFFSET('Taula Farratges'!$A$1,$C4,$G$2,1,1)","v":68.858592379226565},{"$f":"OFFSET('Taula Farratges'!$A$1,$C4,$H$2,1,1)","v":78.009818425258473},{"$f":"OFFSET('Taula Farratges'!$A$1,$C4,$I$2,1,1)","v":2.484860487951897},{"$f":"OFFSET('Taula Farratges'!$A$1,$C4,$J$2,1,1)","v":5.22},{"$f":"OFFSET('Taula Farratges'!$A$1,$C4,$K$2,1,1)","v":2.4499999999999997},{"$f":"OFFSET('Taula Farratges'!$A$1,$C4,$L$2,1,1)","v":0},{"$f":"OFFSET('Taula Farratges'!$A$1,$C4,$M$2,1,1)","v":0},{"$f":"OFFSET('Taula Farratges'!$A$1,$C4,$N$2,1,1)","v":0},{"$f":"OFFSET('Taula Farratges'!$A$1,$C4,$O$2,1,1)","v":0},{"$f":"OFFSET('Taula Farratges'!$A$1,$C4,$P$2,1,1)","v":0},{"$f":"OFFSET('Taula Farratges'!$A$1,$C4,$Q$2,1,1)","v":0},{"$f":"OFFSET('Taula Farratges'!$A$1,$C4,$R$2,1,1)","v":0},{"$f":"OFFSET('Taula Farratges'!$A$1,$C4,$S$2,1,1)","v":0},{"$f":"OFFSET('Taula Farratges'!$A$1,$C4,$T$2,1,1)","v":0},{"$f":"OFFSET('Taula Farratges'!$A$1,$C4,$U$2,1,1)","v":0},{"$f":"OFFSET('Taula Farratges'!$A$1,$C4,$V$2,1,1)","v":0},{"$f":"OFFSET('Taula Farratges'!$A$1,$C4,$W$2,1,1)","v":3000},{"$f":"OFFSET('Taula Farratges'!$A$1,$C4,$X$2,1,1)","v":200},{"$f":"OFFSET('Taula Farratges'!$A$1,$C4,$Y$2,1,1)","v":5},{"$f":"OFFSET('Taula Farratges'!$A$1,$C4,$Z$2,1,1)","v":27.005099999999999},{"$f":"OFFSET('Taula Farratges'!$A$1,$C4,$AA$2,1,1)","v":219.7},{"$f":"OFFSET('Taula Farratges'!$A$1,$C4,$AB$2,1,1)","v":27.792049999999996},{"$f":"OFFSET('Taula Farratges'!$A$1,$C4,$AC$2,1,1)","v":0.72617600000000015},{"$f":"OFFSET('Taula Farratges'!$A$1,$C4,$AD$2,1,1)","v":627.77915200000018},{"$f":"OFFSET('Taula Farratges'!$A$1,$C4,$AE$2,1,1)","v":17.8},{"$f":"OFFSET('Taula Farratges'!$A$1,$C4,$AF$2,1,1)","v":231.20000000000002},{"$f":"OFFSET('Taula Farratges'!$A$1,$C4,$AG$2,1,1)","v":391.4},{"$f":"OFFSET('Taula Farratges'!$A$1,$C4,$AH$2,1,1)","v":298.89999999999998},{"$f":"OFFSET('Taula Farratges'!$A$1,$C4,$AI$2,1,1)","v":61.900000000000006},{"$f":"OFFSET('Taula Farratges'!$A$1,$C4,$AJ$2,1,1)","v":135.5},{"$f":"OFFSET('Taula Farratges'!$A$1,$C4,$AK$2,1,1)","v":0},{"$f":"OFFSET('Taula Farratges'!$A$1,$C4,$AL$2,1,1)","v":0.79},{"$f":"OFFSET('Taula Farratges'!$A$1,$C4,$AM$2,1,1)","v":551.92185778500016},{"$f":"IF('II_Plantejar Ració'!$E5>0,IF(CàlculsEV!E4>0,1,\"No\"),\"\")","v":""},{"$f":"IF('II_Plantejar Ració'!$E5>0,IF(CàlculsEV!F4>0,1,\"No\"),\"\")","v":""},{"$f":"IF('II_Plantejar Ració'!$E5>0,IF(CàlculsEV!G4>0,1,\"No\"),\"\")","v":""},{"$f":"IF('II_Plantejar Ració'!$E5>0,IF(CàlculsEV!H4=0,\"No\",1),\"\")","v":""},{"$f":"IF('II_Plantejar Ració'!$E5>0,IF(CàlculsEV!I4>0,1,\"No\"),\"\")","v":""},{"$f":"IF('II_Plantejar Ració'!$E5>0,IF(CàlculsEV!J4>0,1,\"No\"),\"\")","v":""},{"$f":"IF('II_Plantejar Ració'!$E5>0,IF(CàlculsEV!K4>0,1,\"No\"),\"\")","v":""},{"$f":"IF('II_Plantejar Ració'!$E5>0,IF(CàlculsEV!L4>0,1,\"No\"),\"\")","v":""},{"$f":"IF('II_Plantejar Ració'!$E5>0,IF(CàlculsEV!M4>0,1,\"No\"),\"\")","v":""},{"$f":"IF('II_Plantejar Ració'!$E5>0,IF(CàlculsEV!N4>0,1,\"No\"),\"\")","v":""},{"$f":"IF('II_Plantejar Ració'!$E5>0,IF(CàlculsEV!O4>0,1,\"No\"),\"\")","v":""},{"$f":"IF('II_Plantejar Ració'!$E5>0,IF(CàlculsEV!P4>0,1,\"No\"),\"\")","v":""},{"$f":"IF('II_Plantejar Ració'!$E5>0,IF(CàlculsEV!Q4>0,1,\"No\"),\"\")","v":""},{"$f":"IF('II_Plantejar Ració'!$E5>0,IF(CàlculsEV!R4>0,1,\"No\"),\"\")","v":""},{"$f":"IF('II_Plantejar Ració'!$E5>0,IF(CàlculsEV!S4>0,1,\"No\"),\"\")","v":""},{"$f":"IF('II_Plantejar Ració'!$E5>0,IF(CàlculsEV!T4>0,1,\"No\"),\"\")","v":""},{"$f":"IF('II_Plantejar Ració'!$E5>0,IF(CàlculsEV!U4>0,1,\"No\"),\"\")","v":""},{"$f":"IF('II_Plantejar Ració'!$E5>0,IF(CàlculsEV!V4>0,1,\"No\"),\"\")","v":""},{"$f":"IF('II_Plantejar Ració'!$E5>0,IF(CàlculsEV!W4>0,1,\"No\"),\"\")","v":""},{"$f":"IF('II_Plantejar Ració'!$E5>0,IF(CàlculsEV!X4>0,1,\"No\"),\"\")","v":""},{"$f":"IF('II_Plantejar Ració'!$E5>0,IF(CàlculsEV!Y4>0,1,\"No\"),\"\")","v":""},{"$f":"IF('II_Plantejar Ració'!$E5>0,IF(CàlculsEV!Z4>0,1,\"No\"),\"\")","v":""},{"$f":"IF('II_Plantejar Ració'!$E5>0,IF(CàlculsEV!AA4>0,1,\"No\"),\"\")","v":""},{"$f":"IF('II_Plantejar Ració'!$E5>0,IF(CàlculsEV!AB4>0,1,\"No\"),\"\")","v":""},{"$f":"IF('II_Plantejar Ració'!$E5>0,IF(CàlculsEV!AC4>0,1,\"No\"),\"\")","v":""},{"$f":"IF('II_Plantejar Ració'!$E5>0,IF(CàlculsEV!AD4>0,1,\"No\"),\"\")","v":""},{"$f":"IF('II_Plantejar Ració'!$E5>0,IF(CàlculsEV!AE4>0,1,\"No\"),\"\")","v":""},{"$f":"IF('II_Plantejar Ració'!$E5>0,IF(CàlculsEV!AF4>0,1,\"No\"),\"\")","v":""},{"$f":"IF('II_Plantejar Ració'!$E5>0,IF(CàlculsEV!AG4>0,1,\"No\"),\"\")","v":""},{"$f":"IF('II_Plantejar Ració'!$E5>0,IF(CàlculsEV!AH4>0,1,\"No\"),\"\")","v":""},{"$f":"IF('II_Plantejar Ració'!$E5>0,IF(CàlculsEV!AI4>0,1,\"No\"),\"\")","v":""},{"$f":"IF('II_Plantejar Ració'!$E5>0,IF(CàlculsEV!AJ4>0,1,\"No\"),\"\")","v":""},{"$f":"IF('II_Plantejar Ració'!$E5>0,IF(CàlculsEV!AK4>0,1,\"No\"),\"\")","v":""},{"$f":"IF('II_Plantejar Ració'!$E5>0,IF(CàlculsEV!AL4>0,1,\"No\"),\"\")","v":""},{"$f":"IF('II_Plantejar Ració'!$E5>0,IF(CàlculsEV!AM4>0,1,\"No\"),\"\")","v":""},{"$f":"IF(AN4=\"\",0,1)","v":0},{"$f":"IF(AO4=\"\",0,1)","v":0},{"$f":"IF(AP4=\"\",0,1)","v":0},{"$f":"IF(AQ4=\"\",0,1)","v":0},{"$f":"IF(AR4=\"\",0,1)","v":0},{"$f":"IF(AS4=\"\",0,1)","v":0},{"$f":"IF(AT4=\"\",0,1)","v":0},{"$f":"IF(AU4=\"\",0,1)","v":0},{"$f":"IF(AV4=\"\",0,1)","v":0},{"$f":"IF(AW4=\"\",0,1)","v":0},{"$f":"IF(AX4=\"\",0,1)","v":0},{"$f":"IF(AY4=\"\",0,1)","v":0},{"$f":"IF(AZ4=\"\",0,1)","v":0},{"$f":"IF(BA4=\"\",0,1)","v":0},{"$f":"IF(BB4=\"\",0,1)","v":0},{"$f":"IF(BC4=\"\",0,1)","v":0},{"$f":"IF(BD4=\"\",0,1)","v":0},{"$f":"IF(BE4=\"\",0,1)","v":0},{"$f":"IF(BF4=\"\",0,1)","v":0},{"$f":"IF(BG4=\"\",0,1)","v":0},{"$f":"IF(BH4=\"\",0,1)","v":0},{"$f":"IF(BI4=\"\",0,1)","v":0},{"$f":"IF(BJ4=\"\",0,1)","v":0},{"$f":"IF(BK4=\"\",0,1)","v":0},{"$f":"IF(BL4=\"\",0,1)","v":0},{"$f":"IF(BM4=\"\",0,1)","v":0},{"$f":"IF(BN4=\"\",0,1)","v":0},{"$f":"IF(BO4=\"\",0,1)","v":0},{"$f":"IF(BP4=\"\",0,1)","v":0},{"$f":"IF(BQ4=\"\",0,1)","v":0},{"$f":"IF(BR4=\"\",0,1)","v":0},{"$f":"IF(BS4=\"\",0,1)","v":0},{"$f":"IF(BT4=\"\",0,1)","v":0},{"$f":"IF(BU4=\"\",0,1)","v":0},{"$f":"IF(BV4=\"\",0,1)","v":0}]
[null,{"$f":"IF(OFFSET('Taula Farratges'!$A$1,C5,0,1,1)=0,\"\",OFFSET('Taula Farratges'!$A$1,C5,0,1,1))","v":""},1,{"$f":"OFFSET('Taula Farratges'!$A$1,$C5,$D$2,1,1)","v":0},{"$f":"OFFSET('Taula Farratges'!$A$1,$C5,$E$2,1,1)","v":0},{"$f":"OFFSET('Taula Farratges'!$A$1,$C5,$F$2,1,1)","v":0},{"$f":"OFFSET('Taula Farratges'!$A$1,$C5,$G$2,1,1)","v":0},{"$f":"OFFSET('Taula Farratges'!$A$1,$C5,$H$2,1,1)","v":0},{"$f":"OFFSET('Taula Farratges'!$A$1,$C5,$I$2,1,1)","v":0},{"$f":"OFFSET('Taula Farratges'!$A$1,$C5,$J$2,1,1)","v":0},{"$f":"OFFSET('Taula Farratges'!$A$1,$C5,$K$2,1,1)","v":0},{"$f":"OFFSET('Taula Farratges'!$A$1,$C5,$L$2,1,1)","v":0},{"$f":"OFFSET('Taula Farratges'!$A$1,$C5,$M$2,1,1)","v":0},{"$f":"OFFSET('Taula Farratges'!$A$1,$C5,$N$2,1,1)","v":0},{"$f":"OFFSET('Taula Farratges'!$A$1,$C5,$O$2,1,1)","v":0},{"$f":"OFFSET('Taula Farratges'!$A$1,$C5,$P$2,1,1)","v":0},{"$f":"OFFSET('Taula Farratges'!$A$1,$C5,$Q$2,1,1)","v":0},{"$f":"OFFSET('Taula Farratges'!$A$1,$C5,$R$2,1,1)","v":0},{"$f":"OFFSET('Taula Farratges'!$A$1,$C5,$S$2,1,1)","v":0},{"$f":"OFFSET('Taula Farratges'!$A$1,$C5,$T$2,1,1)","v":0},{"$f":"OFFSET('Taula Farratges'!$A$1,$C5,$U$2,1,1)","v":0},{"$f":"OFFSET('Taula Farratges'!$A$1,$C5,$V$2,1,1)","v":0},{"$f":"OFFSET('Taula Farratges'!$A$1,$C5,$W$2,1,1)","v":0},{"$f":"OFFSET('Taula Farratges'!$A$1,$C5,$X$2,1,1)","v":0},{"$f":"OFFSET('Taula Farratges'!$A$1,$C5,$Y$2,1,1)","v":0},{"$f":"OFFSET('Taula Farratges'!$A$1,$C5,$Z$2,1,1)","v":0},{"$f":"OFFSET('Taula Farratges'!$A$1,$C5,$AA$2,1,1)","v":0},{"$f":"OFFSET('Taula Farratges'!$A$1,$C5,$AB$2,1,1)","v":0},{"$f":"OFFSET('Taula Farratges'!$A$1,$C5,$AC$2,1,1)","v":0},{"$f":"OFFSET('Taula Farratges'!$A$1,$C5,$AD$2,1,1)","v":0},{"$f":"OFFSET('Taula Farratges'!$A$1,$C5,$AE$2,1,1)","v":0},{"$f":"OFFSET('Taula Farratges'!$A$1,$C5,$AF$2,1,1)","v":0},{"$f":"OFFSET('Taula Farratges'!$A$1,$C5,$AG$2,1,1)","v":0},{"$f":"OFFSET('Taula Farratges'!$A$1,$C5,$AH$2,1,1)","v":0},{"$f":"OFFSET('Taula Farratges'!$A$1,$C5,$AI$2,1,1)","v":0},{"$f":"OFFSET('Taula Farratges'!$A$1,$C5,$AJ$2,1,1)","v":0},{"$f":"OFFSET('Taula Farratges'!$A$1,$C5,$AK$2,1,1)","v":0},{"$f":"OFFSET('Taula Farratges'!$A$1,$C5,$AL$2,1,1)","v":0},{"$f":"OFFSET('Taula Farratges'!$A$1,$C5,$AM$2,1,1)","v":0},{"$f":"IF('II_Plantejar Ració'!$E6>0,IF(CàlculsEV!E5>0,1,\"No\"),\"\")","v":""},{"$f":"IF('II_Plantejar Ració'!$E6>0,IF(CàlculsEV!F5>0,1,\"No\"),\"\")","v":""},{"$f":"IF('II_Plantejar Ració'!$E6>0,IF(CàlculsEV!G5>0,1,\"No\"),\"\")","v":""},{"$f":"IF('II_Plantejar Ració'!$E6>0,IF(CàlculsEV!H5=0,\"No\",1),\"\")","v":""},{"$f":"IF('II_Plantejar Ració'!$E6>0,IF(CàlculsEV!I5>0,1,\"No\"),\"\")","v":""},{"$f":"IF('II_Plantejar Ració'!$E6>0,IF(CàlculsEV!J5>0,1,\"No\"),\"\")","v":""},{"$f":"IF('II_Plantejar Ració'!$E6>0,IF(CàlculsEV!K5>0,1,\"No\"),\"\")","v":""},{"$f":"IF('II_Plantejar Ració'!$E6>0,IF(CàlculsEV!L5>0,1,\"No\"),\"\")","v":""},{"$f":"IF('II_Plantejar Ració'!$E6>0,IF(CàlculsEV!M5>0,1,\"No\"),\"\")","v":""},{"$f":"IF('II_Plantejar Ració'!$E6>0,IF(CàlculsEV!N5>0,1,\"No\"),\"\")","v":""},{"$f":"IF('II_Plantejar Ració'!$E6>0,IF(CàlculsEV!O5>0,1,\"No\"),\"\")","v":""},{"$f":"IF('II_Plantejar Ració'!$E6>0,IF(CàlculsEV!P5>0,1,\"No\"),\"\")","v":""},{"$f":"IF('II_Plantejar Ració'!$E6>0,IF(CàlculsEV!Q5>0,1,\"No\"),\"\")","v":""},{"$f":"IF('II_Plantejar Ració'!$E6>0,IF(CàlculsEV!R5>0,1,\"No\"),\"\")","v":""},{"$f":"IF('II_Plantejar Ració'!$E6>0,IF(CàlculsEV!S5>0,1,\"No\"),\"\")","v":""},{"$f":"IF('II_Plantejar Ració'!$E6>0,IF(CàlculsEV!T5>0,1,\"No\"),\"\")","v":""},{"$f":"IF('II_Plantejar Ració'!$E6>0,IF(CàlculsEV!U5>0,1,\"No\"),\"\")","v":""},{"$f":"IF('II_Plantejar Ració'!$E6>0,IF(CàlculsEV!V5>0,1,\"No\"),\"\")","v":""},{"$f":"IF('II_Plantejar Ració'!$E6>0,IF(CàlculsEV!W5>0,1,\"No\"),\"\")","v":""},{"$f":"IF('II_Plantejar Ració'!$E6>0,IF(CàlculsEV!X5>0,1,\"No\"),\"\")","v":""},{"$f":"IF('II_Plantejar Ració'!$E6>0,IF(CàlculsEV!Y5>0,1,\"No\"),\"\")","v":""},{"$f":"IF('II_Plantejar Ració'!$E6>0,IF(CàlculsEV!Z5>0,1,\"No\"),\"\")","v":""},{"$f":"IF('II_Plantejar Ració'!$E6>0,IF(CàlculsEV!AA5>0,1,\"No\"),\"\")","v":""},{"$f":"IF('II_Plantejar Ració'!$E6>0,IF(CàlculsEV!AB5>0,1,\"No\"),\"\")","v":""},{"$f":"IF('II_Plantejar Ració'!$E6>0,IF(CàlculsEV!AC5>0,1,\"No\"),\"\")","v":""},{"$f":"IF('II_Plantejar Ració'!$E6>0,IF(CàlculsEV!AD5>0,1,\"No\"),\"\")","v":""},{"$f":"IF('II_Plantejar Ració'!$E6>0,IF(CàlculsEV!AE5>0,1,\"No\"),\"\")","v":""},{"$f":"IF('II_Plantejar Ració'!$E6>0,IF(CàlculsEV!AF5>0,1,\"No\"),\"\")","v":""},{"$f":"IF('II_Plantejar Ració'!$E6>0,IF(CàlculsEV!AG5>0,1,\"No\"),\"\")","v":""},{"$f":"IF('II_Plantejar Ració'!$E6>0,IF(CàlculsEV!AH5>0,1,\"No\"),\"\")","v":""},{"$f":"IF('II_Plantejar Ració'!$E6>0,IF(CàlculsEV!AI5>0,1,\"No\"),\"\")","v":""},{"$f":"IF('II_Plantejar Ració'!$E6>0,IF(CàlculsEV!AJ5>0,1,\"No\"),\"\")","v":""},{"$f":"IF('II_Plantejar Ració'!$E6>0,IF(CàlculsEV!AK5>0,1,\"No\"),\"\")","v":""},{"$f":"IF('II_Plantejar Ració'!$E6>0,IF(CàlculsEV!AL5>0,1,\"No\"),\"\")","v":""},{"$f":"IF('II_Plantejar Ració'!$E6>0,IF(CàlculsEV!AM5>0,1,\"No\"),\"\")","v":""},0,0,0,0,0,0,0,0,0,0,0,0,0,0,0,0,0,0,0,0,0,0,0,0,0,0,0,0,0,0,0,0,0,0,0]
[null,{"$f":"IF(OFFSET('Taula Farratges'!$A$1,C6,0,1,1)=0,\"\",OFFSET('Taula Farratges'!$A$1,C6,0,1,1))","v":""},1,{"$f":"OFFSET('Taula Farratges'!$A$1,$C6,$D$2,1,1)","v":0},{"$f":"OFFSET('Taula Farratges'!$A$1,$C6,$E$2,1,1)","v":0},{"$f":"OFFSET('Taula Farratges'!$A$1,$C6,$F$2,1,1)","v":0},{"$f":"OFFSET('Taula Farratges'!$A$1,$C6,$G$2,1,1)","v":0},{"$f":"OFFSET('Taula Farratges'!$A$1,$C6,$H$2,1,1)","v":0},{"$f":"OFFSET('Taula Farratges'!$A$1,$C6,$I$2,1,1)","v":0},{"$f":"OFFSET('Taula Farratges'!$A$1,$C6,$J$2,1,1)","v":0},{"$f":"OFFSET('Taula Farratges'!$A$1,$C6,$K$2,1,1)","v":0},{"$f":"OFFSET('Taula Farratges'!$A$1,$C6,$L$2,1,1)","v":0},{"$f":"OFFSET('Taula Farratges'!$A$1,$C6,$M$2,1,1)","v":0},{"$f":"OFFSET('Taula Farratges'!$A$1,$C6,$N$2,1,1)","v":0},{"$f":"OFFSET('Taula Farratges'!$A$1,$C6,$O$2,1,1)","v":0},{"$f":"OFFSET('Taula Farratges'!$A$1,$C6,$P$2,1,1)","v":0},{"$f":"OFFSET('Taula Farratges'!$A$1,$C6,$Q$2,1,1)","v":0},{"$f":"OFFSET('Taula Farratges'!$A$1,$C6,$R$2,1,1)","v":0},{"$f":"OFFSET('Taula Farratges'!$A$1,$C6,$S$2,1,1)","v":0},{"$f":"OFFSET('Taula Farratges'!$A$1,$C6,$T$2,1,1)","v":0},{"$f":"OFFSET('Taula Farratges'!$A$1,$C6,$U$2,1,1)","v":0},{"$f":"OFFSET('Taula Farratges'!$A$1,$C6,$V$2,1,1)","v":0},{"$f":"OFFSET('Taula Farratges'!$A$1,$C6,$W$2,1,1)","v":0},{"$f":"OFFSET('Taula Farratges'!$A$1,$C6,$X$2,1,1)","v":0},{"$f":"OFFSET('Taula Farratges'!$A$1,$C6,$Y$2,1,1)","v":0},{"$f":"OFFSET('Taula Farratges'!$A$1,$C6,$Z$2,1,1)","v":0},{"$f":"OFFSET('Taula Farratges'!$A$1,$C6,$AA$2,1,1)","v":0},{"$f":"OFFSET('Taula Farratges'!$A$1,$C6,$AB$2,1,1)","v":0},{"$f":"OFFSET('Taula Farratges'!$A$1,$C6,$AC$2,1,1)","v":0},{"$f":"OFFSET('Taula Farratges'!$A$1,$C6,$AD$2,1,1)","v":0},{"$f":"OFFSET('Taula Farratges'!$A$1,$C6,$AE$2,1,1)","v":0},{"$f":"OFFSET('Taula Farratges'!$A$1,$C6,$AF$2,1,1)","v":0},{"$f":"OFFSET('Taula Farratges'!$A$1,$C6,$AG$2,1,1)","v":0},{"$f":"OFFSET('Taula Farratges'!$A$1,$C6,$AH$2,1,1)","v":0},{"$f":"OFFSET('Taula Farratges'!$A$1,$C6,$AI$2,1,1)","v":0},{"$f":"OFFSET('Taula Farratges'!$A$1,$C6,$AJ$2,1,1)","v":0},{"$f":"OFFSET('Taula Farratges'!$A$1,$C6,$AK$2,1,1)","v":0},{"$f":"OFFSET('Taula Farratges'!$A$1,$C6,$AL$2,1,1)","v":0},{"$f":"OFFSET('Taula Farratges'!$A$1,$C6,$AM$2,1,1)","v":0},{"$f":"IF('II_Plantejar Ració'!$E7>0,IF(CàlculsEV!E6>0,1,\"No\"),\"\")","v":""},{"$f":"IF('II_Plantejar Ració'!$E7>0,IF(CàlculsEV!F6>0,1,\"No\"),\"\")","v":""},{"$f":"IF('II_Plantejar Ració'!$E7>0,IF(CàlculsEV!G6>0,1,\"No\"),\"\")","v":""},{"$f":"IF('II_Plantejar Ració'!$E7>0,IF(CàlculsEV!H6=0,\"No\",1),\"\")","v":""},{"$f":"IF('II_Plantejar Ració'!$E7>0,IF(CàlculsEV!I6>0,1,\"No\"),\"\")","v":""},{"$f":"IF('II_Plantejar Ració'!$E7>0,IF(CàlculsEV!J6>0,1,\"No\"),\"\")","v":""},{"$f":"IF('II_Plantejar Ració'!$E7>0,IF(CàlculsEV!K6>0,1,\"No\"),\"\")","v":""},{"$f":"IF('II_Plantejar Ració'!$E7>0,IF(CàlculsEV!L6>0,1,\"No\"),\"\")","v":""},{"$f":"IF('II_Plantejar Ració'!$E7>0,IF(CàlculsEV!M6>0,1,\"No\"),\"\")","v":""},{"$f":"IF('II_Plantejar Ració'!$E7>0,IF(CàlculsEV!N6>0,1,\"No\"),\"\")","v":""},{"$f":"IF('II_Plantejar Ració'!$E7>0,IF(CàlculsEV!O6>0,1,\"No\"),\"\")","v":""},{"$f":"IF('II_Plantejar Ració'!$E7>0,IF(CàlculsEV!P6>0,1,\"No\"),\"\")","v":""},{"$f":"IF('II_Plantejar Ració'!$E7>0,IF(CàlculsEV!Q6>0,1,\"No\"),\"\")","v":""},{"$f":"IF('II_Plantejar Ració'!$E7>0,IF(CàlculsEV!R6>0,1,\"No\"),\"\")","v":""},{"$f":"IF('II_Plantejar Ració'!$E7>0,IF(CàlculsEV!S6>0,1,\"No\"),\"\")","v":""},{"$f":"IF('II_Plantejar Ració'!$E7>0,IF(CàlculsEV!T6>0,1,\"No\"),\"\")","v":""},{"$f":"IF('II_Plantejar Ració'!$E7>0,IF(CàlculsEV!U6>0,1,\"No\"),\"\")","v":""},{"$f":"IF('II_Plantejar Ració'!$E7>0,IF(CàlculsEV!V6>0,1,\"No\"),\"\")","v":""},{"$f":"IF('II_Plantejar Ració'!$E7>0,IF(CàlculsEV!W6>0,1,\"No\"),\"\")","v":""},{"$f":"IF('II_Plantejar Ració'!$E7>0,IF(CàlculsEV!X6>0,1,\"No\"),\"\")","v":""},{"$f":"IF('II_Plantejar Ració'!$E7>0,IF(CàlculsEV!Y6>0,1,\"No\"),\"\")","v":""},{"$f":"IF('II_Plantejar Ració'!$E7>0,IF(CàlculsEV!Z6>0,1,\"No\"),\"\")","v":""},{"$f":"IF('II_Plantejar Ració'!$E7>0,IF(CàlculsEV!AA6>0,1,\"No\"),\"\")","v":""},{"$f":"IF('II_Plantejar Ració'!$E7>0,IF(CàlculsEV!AB6>0,1,\"No\"),\"\")","v":""},{"$f":"IF('II_Plantejar Ració'!$E7>0,IF(CàlculsEV!AC6>0,1,\"No\"),\"\")","v":""},{"$f":"IF('II_Plantejar Ració'!$E7>0,IF(CàlculsEV!AD6>0,1,\"No\"),\"\")","v":""},{"$f":"IF('II_Plantejar Ració'!$E7>0,IF(CàlculsEV!AE6>0,1,\"No\"),\"\")","v":""},{"$f":"IF('II_Plantejar Ració'!$E7>0,IF(CàlculsEV!AF6>0,1,\"No\"),\"\")","v":""},{"$f":"IF('II_Plantejar Ració'!$E7>0,IF(CàlculsEV!AG6>0,1,\"No\"),\"\")","v":""},{"$f":"IF('II_Plantejar Ració'!$E7>0,IF(CàlculsEV!AH6>0,1,\"No\"),\"\")","v":""},{"$f":"IF('II_Plantejar Ració'!$E7>0,IF(CàlculsEV!AI6>0,1,\"No\"),\"\")","v":""},{"$f":"IF('II_Plantejar Ració'!$E7>0,IF(CàlculsEV!AJ6>0,1,\"No\"),\"\")","v":""},{"$f":"IF('II_Plantejar Ració'!$E7>0,IF(CàlculsEV!AK6>0,1,\"No\"),\"\")","v":""},{"$f":"IF('II_Plantejar Ració'!$E7>0,IF(CàlculsEV!AL6>0,1,\"No\"),\"\")","v":""},{"$f":"IF('II_Plantejar Ració'!$E7>0,IF(CàlculsEV!AM6>0,1,\"No\"),\"\")","v":""},0,0,0,0,0,0,0,0,0,0,0,0,0,0,0,0,0,0,0,0,0,0,0,0,0,0,0,0,0,0,0,0,0,0,0]
[null,{"$f":"IF(OFFSET('Taula Farratges'!$A$1,C7,0,1,1)=0,\"\",OFFSET('Taula Farratges'!$A$1,C7,0,1,1))","v":""},1,{"$f":"OFFSET('Taula Farratges'!$A$1,$C7,$D$2,1,1)","v":0},{"$f":"OFFSET('Taula Farratges'!$A$1,$C7,$E$2,1,1)","v":0},{"$f":"OFFSET('Taula Farratges'!$A$1,$C7,$F$2,1,1)","v":0},{"$f":"OFFSET('Taula Farratges'!$A$1,$C7,$G$2,1,1)","v":0},{"$f":"OFFSET('Taula Farratges'!$A$1,$C7,$H$2,1,1)","v":0},{"$f":"OFFSET('Taula Farratges'!$A$1,$C7,$I$2,1,1)","v":0},{"$f":"OFFSET('Taula Farratges'!$A$1,$C7,$J$2,1,1)","v":0},{"$f":"OFFSET('Taula Farratges'!$A$1,$C7,$K$2,1,1)","v":0},{"$f":"OFFSET('Taula Farratges'!$A$1,$C7,$L$2,1,1)","v":0},{"$f":"OFFSET('Taula Farratges'!$A$1,$C7,$M$2,1,1)","v":0},{"$f":"OFFSET('Taula Farratges'!$A$1,$C7,$N$2,1,1)","v":0},{"$f":"OFFSET('Taula Farratges'!$A$1,$C7,$O$2,1,1)","v":0},{"$f":"OFFSET('Taula Farratges'!$A$1,$C7,$P$2,1,1)","v":0},{"$f":"OFFSET('Taula Farratges'!$A$1,$C7,$Q$2,1,1)","v":0},{"$f":"OFFSET('Taula Farratges'!$A$1,$C7,$R$2,1,1)","v":0},{"$f":"OFFSET('Taula Farratges'!$A$1,$C7,$S$2,1,1)","v":0},{"$f":"OFFSET('Taula Farratges'!$A$1,$C7,$T$2,1,1)","v":0},{"$f":"OFFSET('Taula Farratges'!$A$1,$C7,$U$2,1,1)","v":0},{"$f":"OFFSET('Taula Farratges'!$A$1,$C7,$V$2,1,1)","v":0},{"$f":"OFFSET('Taula Farratges'!$A$1,$C7,$W$2,1,1)","v":0},{"$f":"OFFSET('Taula Farratges'!$A$1,$C7,$X$2,1,1)","v":0},{"$f":"OFFSET('Taula Farratges'!$A$1,$C7,$Y$2,1,1)","v":0},{"$f":"OFFSET('Taula Farratges'!$A$1,$C7,$Z$2,1,1)","v":0},{"$f":"OFFSET('Taula Farratges'!$A$1,$C7,$AA$2,1,1)","v":0},{"$f":"OFFSET('Taula Farratges'!$A$1,$C7,$AB$2,1,1)","v":0},{"$f":"OFFSET('Taula Farratges'!$A$1,$C7,$AC$2,1,1)","v":0},{"$f":"OFFSET('Taula Farratges'!$A$1,$C7,$AD$2,1,1)","v":0},{"$f":"OFFSET('Taula Farratges'!$A$1,$C7,$AE$2,1,1)","v":0},{"$f":"OFFSET('Taula Farratges'!$A$1,$C7,$AF$2,1,1)","v":0},{"$f":"OFFSET('Taula Farratges'!$A$1,$C7,$AG$2,1,1)","v":0},{"$f":"OFFSET('Taula Farratges'!$A$1,$C7,$AH$2,1,1)","v":0},{"$f":"OFFSET('Taula Farratges'!$A$1,$C7,$AI$2,1,1)","v":0},{"$f":"OFFSET('Taula Farratges'!$A$1,$C7,$AJ$2,1,1)","v":0},{"$f":"OFFSET('Taula Farratges'!$A$1,$C7,$AK$2,1,1)","v":0},{"$f":"OFFSET('Taula Farratges'!$A$1,$C7,$AL$2,1,1)","v":0},{"$f":"OFFSET('Taula Farratges'!$A$1,$C7,$AM$2,1,1)","v":0},{"$f":"IF('II_Plantejar Ració'!$E8>0,IF(CàlculsEV!E7>0,1,\"No\"),\"\")","v":""},{"$f":"IF('II_Plantejar Ració'!$E8>0,IF(CàlculsEV!F7>0,1,\"No\"),\"\")","v":""},{"$f":"IF('II_Plantejar Ració'!$E8>0,IF(CàlculsEV!G7>0,1,\"No\"),\"\")","v":""},{"$f":"IF('II_Plantejar Ració'!$E8>0,IF(CàlculsEV!H7=0,\"No\",1),\"\")","v":""},{"$f":"IF('II_Plantejar Ració'!$E8>0,IF(CàlculsEV!I7>0,1,\"No\"),\"\")","v":""},{"$f":"IF('II_Plantejar Ració'!$E8>0,IF(CàlculsEV!J7>0,1,\"No\"),\"\")","v":""},{"$f":"IF('II_Plantejar Ració'!$E8>0,IF(CàlculsEV!K7>0,1,\"No\"),\"\")","v":""},{"$f":"IF('II_Plantejar Ració'!$E8>0,IF(CàlculsEV!L7>0,1,\"No\"),\"\")","v":""},{"$f":"IF('II_Plantejar Ració'!$E8>0,IF(CàlculsEV!M7>0,1,\"No\"),\"\")","v":""},{"$f":"IF('II_Plantejar Ració'!$E8>0,IF(CàlculsEV!N7>0,1,\"No\"),\"\")","v":""},{"$f":"IF('II_Plantejar Ració'!$E8>0,IF(CàlculsEV!O7>0,1,\"No\"),\"\")","v":""},{"$f":"IF('II_Plantejar Ració'!$E8>0,IF(CàlculsEV!P7>0,1,\"No\"),\"\")","v":""},{"$f":"IF('II_Plantejar Ració'!$E8>0,IF(CàlculsEV!Q7>0,1,\"No\"),\"\")","v":""},{"$f":"IF('II_Plantejar Ració'!$E8>0,IF(CàlculsEV!R7>0,1,\"No\"),\"\")","v":""},{"$f":"IF('II_Plantejar Ració'!$E8>0,IF(CàlculsEV!S7>0,1,\"No\"),\"\")","v":""},{"$f":"IF('II_Plantejar Ració'!$E8>0,IF(CàlculsEV!T7>0,1,\"No\"),\"\")","v":""},{"$f":"IF('II_Plantejar Ració'!$E8>0,IF(CàlculsEV!U7>0,1,\"No\"),\"\")","v":""},{"$f":"IF('II_Plantejar Ració'!$E8>0,IF(CàlculsEV!V7>0,1,\"No\"),\"\")","v":""},{"$f":"IF('II_Plantejar Ració'!$E8>0,IF(CàlculsEV!W7>0,1,\"No\"),\"\")","v":""},{"$f":"IF('II_Plantejar Ració'!$E8>0,IF(CàlculsEV!X7>0,1,\"No\"),\"\")","v":""},{"$f":"IF('II_Plantejar Ració'!$E8>0,IF(CàlculsEV!Y7>0,1,\"No\"),\"\")","v":""},{"$f":"IF('II_Plantejar Ració'!$E8>0,IF(CàlculsEV!Z7>0,1,\"No\"),\"\")","v":""},{"$f":"IF('II_Plantejar Ració'!$E8>0,IF(CàlculsEV!AA7>0,1,\"No\"),\"\")","v":""},{"$f":"IF('II_Plantejar Ració'!$E8>0,IF(CàlculsEV!AB7>0,1,\"No\"),\"\")","v":""},{"$f":"IF('II_Plantejar Ració'!$E8>0,IF(CàlculsEV!AC7>0,1,\"No\"),\"\")","v":""},{"$f":"IF('II_Plantejar Ració'!$E8>0,IF(CàlculsEV!AD7>0,1,\"No\"),\"\")","v":""},{"$f":"IF('II_Plantejar Ració'!$E8>0,IF(CàlculsEV!AE7>0,1,\"No\"),\"\")","v":""},{"$f":"IF('II_Plantejar Ració'!$E8>0,IF(CàlculsEV!AF7>0,1,\"No\"),\"\")","v":""},{"$f":"IF('II_Plantejar Ració'!$E8>0,IF(CàlculsEV!AG7>0,1,\"No\"),\"\")","v":""},{"$f":"IF('II_Plantejar Ració'!$E8>0,IF(CàlculsEV!AH7>0,1,\"No\"),\"\")","v":""},{"$f":"IF('II_Plantejar Ració'!$E8>0,IF(CàlculsEV!AI7>0,1,\"No\"),\"\")","v":""},{"$f":"IF('II_Plantejar Ració'!$E8>0,IF(CàlculsEV!AJ7>0,1,\"No\"),\"\")","v":""},{"$f":"IF('II_Plantejar Ració'!$E8>0,IF(CàlculsEV!AK7>0,1,\"No\"),\"\")","v":""},{"$f":"IF('II_Plantejar Ració'!$E8>0,IF(CàlculsEV!AL7>0,1,\"No\"),\"\")","v":""},{"$f":"IF('II_Plantejar Ració'!$E8>0,IF(CàlculsEV!AM7>0,1,\"No\"),\"\")","v":""},0,0,0,0,0,0,0,0,0,0,0,0,0,0,0,0,0,0,0,0,0,0,0,0,0,0,0,0,0,0,0,0,0,0,0]
["CONCENTRATS",{"$f":"IF(OFFSET('Taula Concentrats'!$A$1,C8,0,1,1)=0,\"\",OFFSET('Taula Concentrats'!$A$1,C8,0,1,1))","v":""},1,{"$f":"OFFSET('Taula Concentrats'!$A$1,$C8,$D$2,1,1)","v":0},{"$f":"OFFSET('Taula Concentrats'!$A$1,$C8,$E$2,1,1)","v":0},{"$f":"OFFSET('Taula Concentrats'!$A$1,$C8,$F$2,1,1)","v":0},{"$f":"OFFSET('Taula Concentrats'!$A$1,$C8,$G$2,1,1)","v":0},{"$f":"OFFSET('Taula Concentrats'!$A$1,$C8,$H$2,1,1)","v":0},{"$f":"OFFSET('Taula Concentrats'!$A$1,$C8,$I$2,1,1)","v":0},{"$f":"OFFSET('Taula Concentrats'!$A$1,$C8,$J$2,1,1)","v":0},{"$f":"OFFSET('Taula Concentrats'!$A$1,$C8,$K$2,1,1)","v":0},{"$f":"OFFSET('Taula Concentrats'!$A$1,$C8,$L$2,1,1)","v":0},{"$f":"OFFSET('Taula Concentrats'!$A$1,$C8,$M$2,1,1)","v":0},{"$f":"OFFSET('Taula Concentrats'!$A$1,$C8,$N$2,1,1)","v":0},{"$f":"OFFSET('Taula Concentrats'!$A$1,$C8,$O$2,1,1)","v":0},{"$f":"OFFSET('Taula Concentrats'!$A$1,$C8,$P$2,1,1)","v":0},{"$f":"OFFSET('Taula Concentrats'!$A$1,$C8,$Q$2,1,1)","v":0},{"$f":"OFFSET('Taula Concentrats'!$A$1,$C8,$R$2,1,1)","v":0},{"$f":"OFFSET('Taula Concentrats'!$A$1,$C8,$S$2,1,1)","v":0},{"$f":"OFFSET('Taula Concentrats'!$A$1,$C8,$T$2,1,1)","v":0},{"$f":"OFFSET('Taula Concentrats'!$A$1,$C8,$U$2,1,1)","v":0},{"$f":"OFFSET('Taula Concentrats'!$A$1,$C8,$V$2,1,1)","v":0},{"$f":"OFFSET('Taula Concentrats'!$A$1,$C8,$W$2,1,1)","v":0},{"$f":"OFFSET('Taula Concentrats'!$A$1,$C8,$X$2,1,1)","v":0},{"$f":"OFFSET('Taula Concentrats'!$A$1,$C8,$Y$2,1,1)","v":0},{"$f":"OFFSET('Taula Concentrats'!$A$1,$C8,$Z$2,1,1)","v":0},{"$f":"OFFSET('Taula Concentrats'!$A$1,$C8,$AA$2,1,1)","v":0},{"$f":"OFFSET('Taula Concentrats'!$A$1,$C8,$AB$2,1,1)","v":0},{"$f":"OFFSET('Taula Concentrats'!$A$1,$C8,$AC$2,1,1)","v":0},{"$f":"OFFSET('Taula Concentrats'!$A$1,$C8,$AD$2,1,1)","v":0},{"$f":"OFFSET('Taula Concentrats'!$A$1,$C8,$AE$2,1,1)","v":0},{"$f":"OFFSET('Taula Concentrats'!$A$1,$C8,$AF$2,1,1)","v":0},{"$f":"OFFSET('Taula Concentrats'!$A$1,$C8,$AG$2,1,1)","v":0},{"$f":"OFFSET('Taula Concentrats'!$A$1,$C8,$AH$2,1,1)","v":0},{"$f":"OFFSET('Taula Concentrats'!$A$1,$C8,$AI$2,1,1)","v":0},{"$f":"OFFSET('Taula Concentrats'!$A$1,$C8,$AJ$2,1,1)","v":0},{"$f":"OFFSET('Taula Concentrats'!$A$1,$C8,$AK$2,1,1)","v":0},{"$f":"OFFSET('Taula Concentrats'!$A$1,$C8,$AL$2,1,1)","v":0},{"$f":"OFFSET('Taula Concentrats'!$A$1,$C8,$AM$2,1,1)","v":0},{"$f":"IF('II_Plantejar Ració'!$E9>0,IF(CàlculsEV!E8>=0,1,\"No\"),\"\")","v":""},{"$f":"IF('II_Plantejar Ració'!$E9>0,IF(CàlculsEV!F8>0,1,\"No\"),\"\")","v":""},{"$f":"IF('II_Plantejar Ració'!$E9>0,IF(CàlculsEV!G8>0,1,\"No\"),\"\")","v":""},{"$f":"IF('II_Plantejar Ració'!$E9>0,IF(CàlculsEV!H8=0,\"No\",1),\"\")","v":""},{"$f":"IF('II_Plantejar Ració'!$E9>0,IF(CàlculsEV!I8>0,1,\"No\"),\"\")","v":""},{"$f":"IF('II_Plantejar Ració'!$E9>0,IF(CàlculsEV!J8>0,1,\"No\"),\"\")","v":""},{"$f":"IF('II_Plantejar Ració'!$E9>0,IF(CàlculsEV!K8>0,1,\"No\"),\"\")","v":""},{"$f":"IF('II_Plantejar Ració'!$E9>0,IF(CàlculsEV!L8>0,1,\"No\"),\"\")","v":""},{"$f":"IF('II_Plantejar Ració'!$E9>0,IF(CàlculsEV!M8>0,1,\"No\"),\"\")","v":""},{"$f":"IF('II_Plantejar Ració'!$E9>0,IF(CàlculsEV!N8>0,1,\"No\"),\"\")","v":""},{"$f":"IF('II_Plantejar Ració'!$E9>0,IF(CàlculsEV!O8>0,1,\"No\"),\"\")","v":""},{"$f":"IF('II_Plantejar Ració'!$E9>0,IF(CàlculsEV!P8>0,1,\"No\"),\"\")","v":""},{"$f":"IF('II_Plantejar Ració'!$E9>0,IF(CàlculsEV!Q8>0,1,\"No\"),\"\")","v":""},{"$f":"IF('II_Plantejar Ració'!$E9>0,IF(CàlculsEV!R8>0,1,\"No\"),\"\")","v":""},{"$f":"IF('II_Plantejar Ració'!$E9>0,IF(CàlculsEV!S8>0,1,\"No\"),\"\")","v":""},{"$f":"IF('II_Plantejar Ració'!$E9>0,IF(CàlculsEV!T8>0,1,\"No\"),\"\")","v":""},{"$f":"IF('II_Plantejar Ració'!$E9>0,IF(CàlculsEV!U8>0,1,\"No\"),\"\")","v":""},{"$f":"IF('II_Plantejar Ració'!$E9>0,IF(CàlculsEV!V8>0,1,\"No\"),\"\")","v":""},{"$f":"IF('II_Plantejar Ració'!$E9>0,IF(CàlculsEV!W8>0,1,\"No\"),\"\")","v":""},{"$f":"IF('II_Plantejar Ració'!$E9>0,IF(CàlculsEV!X8>0,1,\"No\"),\"\")","v":""},{"$f":"IF('II_Plantejar Ració'!$E9>0,IF(CàlculsEV!Y8>0,1,\"No\"),\"\")","v":""},{"$f":"IF('II_Plantejar Ració'!$E9>0,IF(CàlculsEV!Z8>0,1,\"No\"),\"\")","v":""},{"$f":"IF('II_Plantejar Ració'!$E9>0,IF(CàlculsEV!AA8>0,1,\"No\"),\"\")","v":""},{"$f":"IF('II_Plantejar Ració'!$E9>0,IF(CàlculsEV!AB8>0,1,\"No\"),\"\")","v":""},{"$f":"IF('II_Plantejar Ració'!$E9>0,IF(CàlculsEV!AC8>0,1,\"No\"),\"\")","v":""},{"$f":"IF('II_Plantejar Ració'!$E9>0,IF(CàlculsEV!AD8>0,1,\"No\"),\"\")","v":""},{"$f":"IF('II_Plantejar Ració'!$E9>0,IF(CàlculsEV!AE8>0,1,\"No\"),\"\")","v":""},{"$f":"IF('II_Plantejar Ració'!$E9>0,IF(CàlculsEV!AF8>0,1,\"No\"),\"\")","v":""},{"$f":"IF('II_Plantejar Ració'!$E9>0,IF(CàlculsEV!AG8>0,1,\"No\"),\"\")","v":""},{"$f":"IF('II_Plantejar Ració'!$E9>0,IF(CàlculsEV!AH8>0,1,\"No\"),\"\")","v":""},{"$f":"IF('II_Plantejar Ració'!$E9>0,IF(CàlculsEV!AI8>0,1,\"No\"),\"\")","v":""},{"$f":"IF('II_Plantejar Ració'!$E9>0,IF(CàlculsEV!AJ8>0,1,\"No\"),\"\")","v":""},{"$f":"IF('II_Plantejar Ració'!$E9>0,IF(CàlculsEV!AK8>0,1,\"No\"),\"\")","v":""},{"$f":"IF('II_Plantejar Ració'!$E9>0,IF(CàlculsEV!AL8>0,1,\"No\"),\"\")","v":""},{"$f":"IF('II_Plantejar Ració'!$E9>0,IF(CàlculsEV!AM8>0,1,\"No\"),\"\")","v":""},0,0,0,0,0,0,0,0,0,0,0,0,0,0,0,0,0,0,0,0,0,0,0,0,0,0,0,0,0,0,0,0,0,0,0]
[null,{"$f":"IF(OFFSET('Taula Concentrats'!$A$1,C9,0,1,1)=0,\"\",OFFSET('Taula Concentrats'!$A$1,C9,0,1,1))","v":"Ordi gra"},2,{"$f":"OFFSET('Taula Concentrats'!$A$1,$C9,$D$2,1,1)","v":87.2},{"$f":"OFFSET('Taula Concentrats'!$A$1,$C9,$E$2,1,1)","v":0},{"$f":"OFFSET('Taula Concentrats'!$A$1,$C9,$F$2,1,1)","v":1.0789699893040996},{"$f":"OFFSET('Taula Concentrats'!$A$1,$C9,$G$2,1,1)","v":89.462201893951999},{"$f":"OFFSET('Taula Concentrats'!$A$1,$C9,$H$2,1,1)","v":-31.347374120000008},{"$f":"OFFSET('Taula Concentrats'!$A$1,$C9,$I$2,1,1)","v":2},{"$f":"OFFSET('Taula Concentrats'!$A$1,$C9,$J$2,1,1)","v":0.8},{"$f":"OFFSET('Taula Concentrats'!$A$1,$C9,$K$2,1,1)","v":3.9},{"$f":"OFFSET('Taula Concentrats'!$A$1,$C9,$L$2,1,1)","v":1.3},{"$f":"OFFSET('Taula Concentrats'!$A$1,$C9,$M$2,1,1)","v":5.55},{"$f":"OFFSET('Taula Concentrats'!$A$1,$C9,$N$2,1,1)","v":0.35},{"$f":"OFFSET('Taula Concentrats'!$A$1,$C9,$O$2,1,1)","v":0},{"$f":"OFFSET('Taula Concentrats'!$A$1,$C9,$P$2,1,1)","v":0},{"$f":"OFFSET('Taula Concentrats'!$A$1,$C9,$Q$2,1,1)","v":0.01},{"$f":"OFFSET('Taula Concentrats'!$A$1,$C9,$R$2,1,1)","v":4.0999999999999996},{"$f":"OFFSET('Taula Concentrats'!$A$1,$C9,$S$2,1,1)","v":17.600000000000001},{"$f":"OFFSET('Taula Concentrats'!$A$1,$C9,$T$2,1,1)","v":24.4},{"$f":"OFFSET('Taula Concentrats'!$A$1,$C9,$U$2,1,1)","v":0},{"$f":"OFFSET('Taula Concentrats'!$A$1,$C9,$V$2,1,1)","v":0.02},{"$f":"OFFSET('Taula Concentrats'!$A$1,$C9,$W$2,1,1)","v":1000},{"$f":"OFFSET('Taula Concentrats'!$A$1,$C9,$X$2,1,1)","v":0},{"$f":"OFFSET('Taula Concentrats'!$A$1,$C9,$Y$2,1,1)","v":25},{"$f":"OFFSET('Taula Concentrats'!$A$1,$C9,$Z$2,1,1)","v":14.25},{"$f":"OFFSET('Taula Concentrats'!$A$1,$C9,$AA$2,1,1)","v":112},{"$f":"OFFSET('Taula Concentrats'!$A$1,$C9,$AB$2,1,1)","v":27.595082457151996},{"$f":"OFFSET('Taula Concentrats'!$A$1,$C9,$AC$2,1,1)","v":0.83732799999999996},{"$f":"OFFSET('Taula Concentrats'!$A$1,$C9,$AD$2,1,1)","v":816.39479999999992},{"$f":"OFFSET('Taula Concentrats'!$A$1,$C9,$AE$2,1,1)","v":19},{"$f":"OFFSET('Taula Concentrats'!$A$1,$C9,$AF$2,1,1)","v":54},{"$f":"OFFSET('Taula Concentrats'!$A$1,$C9,$AG$2,1,1)","v":215},{"$f":"OFFSET('Taula Concentrats'!$A$1,$C9,$AH$2,1,1)","v":65},{"$f":"OFFSET('Taula Concentrats'!$A$1,$C9,$AI$2,1,1)","v":12},{"$f":"OFFSET('Taula Concentrats'!$A$1,$C9,$AJ$2,1,1)","v":25},{"$f":"OFFSET('Taula Concentrats'!$A$1,$C9,$AK$2,1,1)","v":0.3},{"$f":"OFFSET('Taula Concentrats'!$A$1,$C9,$AL$2,1,1)","v":0.73492599485689536},{"$f":"OFFSET('Taula Concentrats'!$A$1,$C9,$AM$2,1,1)","v":767.70651142397219},{"$f":"IF('II_Plantejar Ració'!$E10>0,IF(CàlculsEV!E9>=0,1,\"No\"),\"\")","v":1},{"$f":"IF('II_Plantejar Ració'!$E10>0,IF(CàlculsEV!F9>0,1,\"No\"),\"\")","v":1},{"$f":"IF('II_Plantejar Ració'!$E10>0,IF(CàlculsEV!G9>0,1,\"No\"),\"\")","v":1},{"$f":"IF('II_Plantejar Ració'!$E10>0,IF(CàlculsEV!H9=0,\"No\",1),\"\")","v":1},{"$f":"IF('II_Plantejar Ració'!$E10>0,IF(CàlculsEV!I9>0,1,\"No\"),\"\")","v":1},{"$f":"IF('II_Plantejar Ració'!$E10>0,IF(CàlculsEV!J9>0,1,\"No\"),\"\")","v":1},{"$f":"IF('II_Plantejar Ració'!$E10>0,IF(CàlculsEV!K9>0,1,\"No\"),\"\")","v":1},{"$f":"IF('II_Plantejar Ració'!$E10>0,IF(CàlculsEV!L9>0,1,\"No\"),\"\")","v":1},{"$f":"IF('II_Plantejar Ració'!$E10>0,IF(CàlculsEV!M9>0,1,\"No\"),\"\")","v":1},{"$f":"IF('II_Plantejar Ració'!$E10>0,IF(CàlculsEV!N9>0,1,\"No\"),\"\")","v":1},{"$f":"IF('II_Plantejar Ració'!$E10>0,IF(CàlculsEV!O9>0,1,\"No\"),\"\")","v":"No"},{"$f":"IF('II_Plantejar Ració'!$E10>0,IF(CàlculsEV!P9>0,1,\"No\"),\"\")","v":"No"},{"$f":"IF('II_Plantejar Ració'!$E10>0,IF(CàlculsEV!Q9>0,1,\"No\"),\"\")","v":1},{"$f":"IF('II_Plantejar Ració'!$E10>0,IF(CàlculsEV!R9>0,1,\"No\"),\"\")","v":1},{"$f":"IF('II_Plantejar Ració'!$E10>0,IF(CàlculsEV!S9>0,1,\"No\"),\"\")","v":1},{"$f":"IF('II_Plantejar Ració'!$E10>0,IF(CàlculsEV!T9>0,1,\"No\"),\"\")","v":1},{"$f":"IF('II_Plantejar Ració'!$E10>0,IF(CàlculsEV!U9>0,1,\"No\"),\"\")","v":"No"},{"$f":"IF('II_Plantejar Ració'!$E10>0,IF(CàlculsEV!V9>0,1,\"No\"),\"\")","v":1},{"$f":"IF('II_Plantejar Ració'!$E10>0,IF(CàlculsEV!W9>0,1,\"No\"),\"\")","v":1},{"$f":"IF('II_Plantejar Ració'!$E10>0,IF(CàlculsEV!X9>0,1,\"No\"),\"\")","v":"No"},{"$f":"IF('II_Plantejar Ració'!$E10>0,IF(CàlculsEV!Y9>0,1,\"No\"),\"\")","v":1},{"$f":"IF('II_Plantejar Ració'!$E10>0,IF(CàlculsEV!Z9>0,1,\"No\"),\"\")","v":1},{"$f":"IF('II_Plantejar Ració'!$E10>0,IF(CàlculsEV!AA9>0,1,\"No\"),\"\")","v":1},{"$f":"IF('II_Plantejar Ració'!$E10>0,IF(CàlculsEV!AB9>0,1,\"No\"),\"\")","v":1},{"$f":"IF('II_Plantejar Ració'!$E10>0,IF(CàlculsEV!AC9>0,1,\"No\"),\"\")","v":1},{"$f":"IF('II_Plantejar Ració'!$E10>0,IF(CàlculsEV!AD9>0,1,\"No\"),\"\")","v":1},{"$f":"IF('II_Plantejar Ració'!$E10>0,IF(CàlculsEV!AE9>0,1,\"No\"),\"\")","v":1},{"$f":"IF('II_Plantejar Ració'!$E10>0,IF(CàlculsEV!AF9>0,1,\"No\"),\"\")","v":1},{"$f":"IF('II_Plantejar Ració'!$E10>0,IF(CàlculsEV!AG9>0,1,\"No\"),\"\")","v":1},{"$f":"IF('II_Plantejar Ració'!$E10>0,IF(CàlculsEV!AH9>0,1,\"No\"),\"\")","v":1},{"$f":"IF('II_Plantejar Ració'!$E10>0,IF(CàlculsEV!AI9>0,1,\"No\"),\"\")","v":1},{"$f":"IF('II_Plantejar Ració'!$E10>0,IF(CàlculsEV!AJ9>0,1,\"No\"),\"\")","v":1},{"$f":"IF('II_Plantejar Ració'!$E10>0,IF(CàlculsEV!AK9>0,1,\"No\"),\"\")","v":1},{"$f":"IF('II_Plantejar Ració'!$E10>0,IF(CàlculsEV!AL9>0,1,\"No\"),\"\")","v":1},{"$f":"IF('II_Plantejar Ració'!$E10>0,IF(CàlculsEV!AM9>0,1,\"No\"),\"\")","v":1},1,1,1,1,1,1,1,1,1,1,1,1,1,1,1,1,1,1,1,1,1,1,1,1,1,1,1,1,1,1,1,1,1,1,1]
[null,{"$f":"IF(OFFSET('Taula Concentrats'!$A$1,C10,0,1,1)=0,\"\",OFFSET('Taula Concentrats'!$A$1,C10,0,1,1))","v":"Colza, turtó "},32,{"$f":"OFFSET('Taula Concentrats'!$A$1,$C10,$D$2,1,1)","v":90},{"$f":"OFFSET('Taula Concentrats'!$A$1,$C10,$E$2,1,1)","v":0},{"$f":"OFFSET('Taula Concentrats'!$A$1,$C10,$F$2,1,1)","v":0.95800502495921236},{"$f":"OFFSET('Taula Concentrats'!$A$1,$C10,$G$2,1,1)","v":155.86270835653204},{"$f":"OFFSET('Taula Concentrats'!$A$1,$C10,$H$2,1,1)","v":193.04700397999994},{"$f":"OFFSET('Taula Concentrats'!$A$1,$C10,$I$2,1,1)","v":2},{"$f":"OFFSET('Taula Concentrats'!$A$1,$C10,$J$2,1,1)","v":8.4},{"$f":"OFFSET('Taula Concentrats'!$A$1,$C10,$K$2,1,1)","v":12.4},{"$f":"OFFSET('Taula Concentrats'!$A$1,$C10,$L$2,1,1)","v":5.15},{"$f":"OFFSET('Taula Concentrats'!$A$1,$C10,$M$2,1,1)","v":12.4},{"$f":"OFFSET('Taula Concentrats'!$A$1,$C10,$N$2,1,1)","v":0.75},{"$f":"OFFSET('Taula Concentrats'!$A$1,$C10,$O$2,1,1)","v":0},{"$f":"OFFSET('Taula Concentrats'!$A$1,$C10,$P$2,1,1)","v":0},{"$f":"OFFSET('Taula Concentrats'!$A$1,$C10,$Q$2,1,1)","v":0.1},{"$f":"OFFSET('Taula Concentrats'!$A$1,$C10,$R$2,1,1)","v":5.5},{"$f":"OFFSET('Taula Concentrats'!$A$1,$C10,$S$2,1,1)","v":63.5},{"$f":"OFFSET('Taula Concentrats'!$A$1,$C10,$T$2,1,1)","v":64.5},{"$f":"OFFSET('Taula Concentrats'!$A$1,$C10,$U$2,1,1)","v":0},{"$f":"OFFSET('Taula Concentrats'!$A$1,$C10,$V$2,1,1)","v":7.0000000000000007E-2},{"$f":"OFFSET('Taula Concentrats'!$A$1,$C10,$W$2,1,1)","v":0},{"$f":"OFFSET('Taula Concentrats'!$A$1,$C10,$X$2,1,1)","v":0},{"$f":"OFFSET('Taula Concentrats'!$A$1,$C10,$Y$2,1,1)","v":20},{"$f":"OFFSET('Taula Concentrats'!$A$1,$C10,$Z$2,1,1)","v":20.8},{"$f":"OFFSET('Taula Concentrats'!$A$1,$C10,$AA$2,1,1)","v":418},{"$f":"OFFSET('Taula Concentrats'!$A$1,$C10,$AB$2,1,1)","v":103.91199090373202},{"$f":"OFFSET('Taula Concentrats'!$A$1,$C10,$AC$2,1,1)","v":0.78420000000000001},{"$f":"OFFSET('Taula Concentrats'!$A$1,$C10,$AD$2,1,1)","v":704.99580000000014},{"$f":"OFFSET('Taula Concentrats'!$A$1,$C10,$AE$2,1,1)","v":26},{"$f":"OFFSET('Taula Concentrats'!$A$1,$C10,$AF$2,1,1)","v":120},{"$f":"OFFSET('Taula Concentrats'!$A$1,$C10,$AG$2,1,1)","v":287},{"$f":"OFFSET('Taula Concentrats'!$A$1,$C10,$AH$2,1,1)","v":182},{"$f":"OFFSET('Taula Concentrats'!$A$1,$C10,$AI$2,1,1)","v":74},{"$f":"OFFSET('Taula Concentrats'!$A$1,$C10,$AJ$2,1,1)","v":101},{"$f":"OFFSET('Taula Concentrats'!$A$1,$C10,$AK$2,1,1)","v":0.5},{"$f":"OFFSET('Taula Concentrats'!$A$1,$C10,$AL$2,1,1)","v":0.72777380875241571},{"$f":"OFFSET('Taula Concentrats'!$A$1,$C10,$AM$2,1,1)","v":565.20525205850993},{"$f":"IF('II_Plantejar Ració'!$E11>0,IF(CàlculsEV!E10>=0,1,\"No\"),\"\")","v":""},{"$f":"IF('II_Plantejar Ració'!$E11>0,IF(CàlculsEV!F10>0,1,\"No\"),\"\")","v":""},{"$f":"IF('II_Plantejar Ració'!$E11>0,IF(CàlculsEV!G10>0,1,\"No\"),\"\")","v":""},{"$f":"IF('II_Plantejar Ració'!$E11>0,IF(CàlculsEV!H10=0,\"No\",1),\"\")","v":""},{"$f":"IF('II_Plantejar Ració'!$E11>0,IF(CàlculsEV!I10>0,1,\"No\"),\"\")","v":""},{"$f":"IF('II_Plantejar Ració'!$E11>0,IF(CàlculsEV!J10>0,1,\"No\"),\"\")","v":""},{"$f":"IF('II_Plantejar Ració'!$E11>0,IF(CàlculsEV!K10>0,1,\"No\"),\"\")","v":""},{"$f":"IF('II_Plantejar Ració'!$E11>0,IF(CàlculsEV!L10>0,1,\"No\"),\"\")","v":""},{"$f":"IF('II_Plantejar Ració'!$E11>0,IF(CàlculsEV!M10>0,1,\"No\"),\"\")","v":""},{"$f":"IF('II_Plantejar Ració'!$E11>0,IF(CàlculsEV!N10>0,1,\"No\"),\"\")","v":""},{"$f":"IF('II_Plantejar Ració'!$E11>0,IF(CàlculsEV!O10>0,1,\"No\"),\"\")","v":""},{"$f":"IF('II_Plantejar Ració'!$E11>0,IF(CàlculsEV!P10>0,1,\"No\"),\"\")","v":""},{"$f":"IF('II_Plantejar Ració'!$E11>0,IF(CàlculsEV!Q10>0,1,\"No\"),\"\")","v":""},{"$f":"IF('II_Plantejar Ració'!$E11>0,IF(CàlculsEV!R10>0,1,\"No\"),\"\")","v":""},{"$f":"IF('II_Plantejar Ració'!$E11>0,IF(CàlculsEV!S10>0,1,\"No\"),\"\")","v":""},{"$f":"IF('II_Plantejar Ració'!$E11>0,IF(CàlculsEV!T10>0,1,\"No\"),\"\")","v":""},{"$f":"IF('II_Plantejar Ració'!$E11>0,IF(CàlculsEV!U10>0,1,\"No\"),\"\")","v":""},{"$f":"IF('II_Plantejar Ració'!$E11>0,IF(CàlculsEV!V10>0,1,\"No\"),\"\")","v":""},{"$f":"IF('II_Plantejar Ració'!$E11>0,IF(CàlculsEV!W10>0,1,\"No\"),\"\")","v":""},{"$f":"IF('II_Plantejar Ració'!$E11>0,IF(CàlculsEV!X10>0,1,\"No\"),\"\")","v":""},{"$f":"IF('II_Plantejar Ració'!$E11>0,IF(CàlculsEV!Y10>0,1,\"No\"),\"\")","v":""},{"$f":"IF('II_Plantejar Ració'!$E11>0,IF(CàlculsEV!Z10>0,1,\"No\"),\"\")","v":""},{"$f":"IF('II_Plantejar Ració'!$E11>0,IF(CàlculsEV!AA10>0,1,\"No\"),\"\")","v":""},{"$f":"IF('II_Plantejar Ració'!$E11>0,IF(CàlculsEV!AB10>0,1,\"No\"),\"\")","v":""},{"$f":"IF('II_Plantejar Ració'!$E11>0,IF(CàlculsEV!AC10>0,1,\"No\"),\"\")","v":""},{"$f":"IF('II_Plantejar Ració'!$E11>0,IF(CàlculsEV!AD10>0,1,\"No\"),\"\")","v":""},{"$f":"IF('II_Plantejar Ració'!$E11>0,IF(CàlculsEV!AE10>0,1,\"No\"),\"\")","v":""},{"$f":"IF('II_Plantejar Ració'!$E11>0,IF(CàlculsEV!AF10>0,1,\"No\"),\"\")","v":""},{"$f":"IF('II_Plantejar Ració'!$E11>0,IF(CàlculsEV!AG10>0,1,\"No\"),\"\")","v":""},{"$f":"IF('II_Plantejar Ració'!$E11>0,IF(CàlculsEV!AH10>0,1,\"No\"),\"\")","v":""},{"$f":"IF('II_Plantejar Ració'!$E11>0,IF(CàlculsEV!AI10>0,1,\"No\"),\"\")","v":""},{"$f":"IF('II_Plantejar Ració'!$E11>0,IF(CàlculsEV!AJ10>0,1,\"No\"),\"\")","v":""},{"$f":"IF('II_Plantejar Ració'!$E11>0,IF(CàlculsEV!AK10>0,1,\"No\"),\"\")","v":""},{"$f":"IF('II_Plantejar Ració'!$E11>0,IF(CàlculsEV!AL10>0,1,\"No\"),\"\")","v":""},{"$f":"IF('II_Plantejar Ració'!$E11>0,IF(CàlculsEV!AM10>0,1,\"No\"),\"\")","v":""},0,0,0,0,0,0,0,0,0,0,0,0,0,0,0,0,0,0,0,0,0,0,0,0,0,0,0,0,0,0,0,0,0,0,0]
[null,{"$f":"IF(OFFSET('Taula Concentrats'!$A$1,C11,0,1,1)=0,\"\",OFFSET('Taula Concentrats'!$A$1,C11,0,1,1))","v":"Blat de moro gra"},3,{"$f":"OFFSET('Taula Concentrats'!$A$1,$C11,$D$2,1,1)","v":86},{"$f":"OFFSET('Taula Concentrats'!$A$1,$C11,$E$2,1,1)","v":0},{"$f":"OFFSET('Taula Concentrats'!$A$1,$C11,$F$2,1,1)","v":1.2447554097468898},{"$f":"OFFSET('Taula Concentrats'!$A$1,$C11,$G$2,1,1)","v":100.70571645287278},{"$f":"OFFSET('Taula Concentrats'!$A$1,$C11,$H$2,1,1)","v":-70.144731616400009},{"$f":"OFFSET('Taula Concentrats'!$A$1,$C11,$I$2,1,1)","v":2},{"$f":"OFFSET('Taula Concentrats'!$A$1,$C11,$J$2,1,1)","v":0.5},{"$f":"OFFSET('Taula Concentrats'!$A$1,$C11,$K$2,1,1)","v":2.9},{"$f":"OFFSET('Taula Concentrats'!$A$1,$C11,$L$2,1,1)","v":1.4},{"$f":"OFFSET('Taula Concentrats'!$A$1,$C11,$M$2,1,1)","v":3.6},{"$f":"OFFSET('Taula Concentrats'!$A$1,$C11,$N$2,1,1)","v":0.33},{"$f":"OFFSET('Taula Concentrats'!$A$1,$C11,$O$2,1,1)","v":0},{"$f":"OFFSET('Taula Concentrats'!$A$1,$C11,$P$2,1,1)","v":0},{"$f":"OFFSET('Taula Concentrats'!$A$1,$C11,$Q$2,1,1)","v":0.02},{"$f":"OFFSET('Taula Concentrats'!$A$1,$C11,$R$2,1,1)","v":2.2999999999999998},{"$f":"OFFSET('Taula Concentrats'!$A$1,$C11,$S$2,1,1)","v":10.8},{"$f":"OFFSET('Taula Concentrats'!$A$1,$C11,$T$2,1,1)","v":21.4},{"$f":"OFFSET('Taula Concentrats'!$A$1,$C11,$U$2,1,1)","v":0},{"$f":"OFFSET('Taula Concentrats'!$A$1,$C11,$V$2,1,1)","v":0.02},{"$f":"OFFSET('Taula Concentrats'!$A$1,$C11,$W$2,1,1)","v":0},{"$f":"OFFSET('Taula Concentrats'!$A$1,$C11,$X$2,1,1)","v":0},{"$f":"OFFSET('Taula Concentrats'!$A$1,$C11,$Y$2,1,1)","v":0},{"$f":"OFFSET('Taula Concentrats'!$A$1,$C11,$Z$2,1,1)","v":36.549999999999997},{"$f":"OFFSET('Taula Concentrats'!$A$1,$C11,$AA$2,1,1)","v":89},{"$f":"OFFSET('Taula Concentrats'!$A$1,$C11,$AB$2,1,1)","v":38.129888218376763},{"$f":"OFFSET('Taula Concentrats'!$A$1,$C11,$AC$2,1,1)","v":0.88284600000000013},{"$f":"OFFSET('Taula Concentrats'!$A$1,$C11,$AD$2,1,1)","v":870.48615600000005},{"$f":"OFFSET('Taula Concentrats'!$A$1,$C11,$AE$2,1,1)","v":43},{"$f":"OFFSET('Taula Concentrats'!$A$1,$C11,$AF$2,1,1)","v":26},{"$f":"OFFSET('Taula Concentrats'!$A$1,$C11,$AG$2,1,1)","v":125},{"$f":"OFFSET('Taula Concentrats'!$A$1,$C11,$AH$2,1,1)","v":31},{"$f":"OFFSET('Taula Concentrats'!$A$1,$C11,$AI$2,1,1)","v":60},{"$f":"OFFSET('Taula Concentrats'!$A$1,$C11,$AJ$2,1,1)","v":14},{"$f":"OFFSET('Taula Concentrats'!$A$1,$C11,$AK$2,1,1)","v":0.3},{"$f":"OFFSET('Taula Concentrats'!$A$1,$C11,$AL$2,1,1)","v":0.50925139963862587},{"$f":"OFFSET('Taula Concentrats'!$A$1,$C11,$AM$2,1,1)","v":783.80953056783778},{"$f":"IF('II_Plantejar Ració'!$E12>0,IF(CàlculsEV!E11>=0,1,\"No\"),\"\")","v":""},{"$f":"IF('II_Plantejar Ració'!$E12>0,IF(CàlculsEV!F11>0,1,\"No\"),\"\")","v":""},{"$f":"IF('II_Plantejar Ració'!$E12>0,IF(CàlculsEV!G11>0,1,\"No\"),\"\")","v":""},{"$f":"IF('II_Plantejar Ració'!$E12>0,IF(CàlculsEV!H11=0,\"No\",1),\"\")","v":""},{"$f":"IF('II_Plantejar Ració'!$E12>0,IF(CàlculsEV!I11>0,1,\"No\"),\"\")","v":""},{"$f":"IF('II_Plantejar Ració'!$E12>0,IF(CàlculsEV!J11>0,1,\"No\"),\"\")","v":""},{"$f":"IF('II_Plantejar Ració'!$E12>0,IF(CàlculsEV!K11>0,1,\"No\"),\"\")","v":""},{"$f":"IF('II_Plantejar Ració'!$E12>0,IF(CàlculsEV!L11>0,1,\"No\"),\"\")","v":""},{"$f":"IF('II_Plantejar Ració'!$E12>0,IF(CàlculsEV!M11>0,1,\"No\"),\"\")","v":""},{"$f":"IF('II_Plantejar Ració'!$E12>0,IF(CàlculsEV!N11>0,1,\"No\"),\"\")","v":""},{"$f":"IF('II_Plantejar Ració'!$E12>0,IF(CàlculsEV!O11>0,1,\"No\"),\"\")","v":""},{"$f":"IF('II_Plantejar Ració'!$E12>0,IF(CàlculsEV!P11>0,1,\"No\"),\"\")","v":""},{"$f":"IF('II_Plantejar Ració'!$E12>0,IF(CàlculsEV!Q11>0,1,\"No\"),\"\")","v":""},{"$f":"IF('II_Plantejar Ració'!$E12>0,IF(CàlculsEV!R11>0,1,\"No\"),\"\")","v":""},{"$f":"IF('II_Plantejar Ració'!$E12>0,IF(CàlculsEV!S11>0,1,\"No\"),\"\")","v":""},{"$f":"IF('II_Plantejar Ració'!$E12>0,IF(CàlculsEV!T11>0,1,\"No\"),\"\")","v":""},{"$f":"IF('II_Plantejar Ració'!$E12>0,IF(CàlculsEV!U11>0,1,\"No\"),\"\")","v":""},{"$f":"IF('II_Plantejar Ració'!$E12>0,IF(CàlculsEV!V11>0,1,\"No\"),\"\")","v":""},{"$f":"IF('II_Plantejar Ració'!$E12>0,IF(CàlculsEV!W11>0,1,\"No\"),\"\")","v":""},{"$f":"IF('II_Plantejar Ració'!$E12>0,IF(CàlculsEV!X11>0,1,\"No\"),\"\")","v":""},{"$f":"IF('II_Plantejar Ració'!$E12>0,IF(CàlculsEV!Y11>0,1,\"No\"),\"\")","v":""},{"$f":"IF('II_Plantejar Ració'!$E12>0,IF(CàlculsEV!Z11>0,1,\"No\"),\"\")","v":""},{"$f":"IF('II_Plantejar Ració'!$E12>0,IF(CàlculsEV!AA11>0,1,\"No\"),\"\")","v":""},{"$f":"IF('II_Plantejar Ració'!$E12>0,IF(CàlculsEV!AB11>0,1,\"No\"),\"\")","v":""},{"$f":"IF('II_Plantejar Ració'!$E12>0,IF(CàlculsEV!AC11>0,1,\"No\"),\"\")","v":""},{"$f":"IF('II_Plantejar Ració'!$E12>0,IF(CàlculsEV!AD11>0,1,\"No\"),\"\")","v":""},{"$f":"IF('II_Plantejar Ració'!$E12>0,IF(CàlculsEV!AE11>0,1,\"No\"),\"\")","v":""},{"$f":"IF('II_Plantejar Ració'!$E12>0,IF(CàlculsEV!AF11>0,1,\"No\"),\"\")","v":""},{"$f":"IF('II_Plantejar Ració'!$E12>0,IF(CàlculsEV!AG11>0,1,\"No\"),\"\")","v":""},{"$f":"IF('II_Plantejar Ració'!$E12>0,IF(CàlculsEV!AH11>0,1,\"No\"),\"\")","v":""},{"$f":"IF('II_Plantejar Ració'!$E12>0,IF(CàlculsEV!AI11>0,1,\"No\"),\"\")","v":""},{"$f":"IF('II_Plantejar Ració'!$E12>0,IF(CàlculsEV!AJ11>0,1,\"No\"),\"\")","v":""},{"$f":"IF('II_Plantejar Ració'!$E12>0,IF(CàlculsEV!AK11>0,1,\"No\"),\"\")","v":""},{"$f":"IF('II_Plantejar Ració'!$E12>0,IF(CàlculsEV!AL11>0,1,\"No\"),\"\")","v":""},{"$f":"IF('II_Plantejar Ració'!$E12>0,IF(CàlculsEV!AM11>0,1,\"No\"),\"\")","v":""},0,0,0,0,0,0,0,0,0,0,0,0,0,0,0,0,0,0,0,0,0,0,0,0,0,0,0,0,0,0,0,0,0,0,0]
[null,{"$f":"IF(OFFSET('Taula Concentrats'!$A$1,C12,0,1,1)=0,\"\",OFFSET('Taula Concentrats'!$A$1,C12,0,1,1))","v":"Soja tortó 44"},48,{"$f":"OFFSET('Taula Concentrats'!$A$1,$C12,$D$2,1,1)","v":87.2},{"$f":"OFFSET('Taula Concentrats'!$A$1,$C12,$E$2,1,1)","v":0},{"$f":"OFFSET('Taula Concentrats'!$A$1,$C12,$F$2,1,1)","v":1.1656258626018918},{"$f":"OFFSET('Taula Concentrats'!$A$1,$C12,$G$2,1,1)","v":207.06952650471396},{"$f":"OFFSET('Taula Concentrats'!$A$1,$C12,$H$2,1,1)","v":219.17261164349998},{"$f":"OFFSET('Taula Concentrats'!$A$1,$C12,$I$2,1,1)","v":2},{"$f":"OFFSET('Taula Concentrats'!$A$1,$C12,$J$2,1,1)","v":3.4},{"$f":"OFFSET('Taula Concentrats'!$A$1,$C12,$K$2,1,1)","v":7},{"$f":"OFFSET('Taula Concentrats'!$A$1,$C12,$L$2,1,1)","v":2.7},{"$f":"OFFSET('Taula Concentrats'!$A$1,$C12,$M$2,1,1)","v":20},{"$f":"OFFSET('Taula Concentrats'!$A$1,$C12,$N$2,1,1)","v":1.95},{"$f":"OFFSET('Taula Concentrats'!$A$1,$C12,$O$2,1,1)","v":0},{"$f":"OFFSET('Taula Concentrats'!$A$1,$C12,$P$2,1,1)","v":0},{"$f":"OFFSET('Taula Concentrats'!$A$1,$C12,$Q$2,1,1)","v":0.3},{"$f":"OFFSET('Taula Concentrats'!$A$1,$C12,$R$2,1,1)","v":17.100000000000001},{"$f":"OFFSET('Taula Concentrats'!$A$1,$C12,$S$2,1,1)","v":43.7},{"$f":"OFFSET('Taula Concentrats'!$A$1,$C12,$T$2,1,1)","v":54.6},{"$f":"OFFSET('Taula Concentrats'!$A$1,$C12,$U$2,1,1)","v":0},{"$f":"OFFSET('Taula Concentrats'!$A$1,$C12,$V$2,1,1)","v":0.2},{"$f":"OFFSET('Taula Concentrats'!$A$1,$C12,$W$2,1,1)","v":0},{"$f":"OFFSET('Taula Concentrats'!$A$1,$C12,$X$2,1,1)","v":0},{"$f":"OFFSET('Taula Concentrats'!$A$1,$C12,$Y$2,1,1)","v":7},{"$f":"OFFSET('Taula Concentrats'!$A$1,$C12,$Z$2,1,1)","v":16.5},{"$f":"OFFSET('Taula Concentrats'!$A$1,$C12,$AA$2,1,1)","v":488},{"$f":"OFFSET('Taula Concentrats'!$A$1,$C12,$AB$2,1,1)","v":153.41999795655397},{"$f":"OFFSET('Taula Concentrats'!$A$1,$C12,$AC$2,1,1)","v":0.84965499999999994},{"$f":"OFFSET('Taula Concentrats'!$A$1,$C12,$AD$2,1,1)","v":779.13363500000003},{"$f":"OFFSET('Taula Concentrats'!$A$1,$C12,$AE$2,1,1)","v":22},{"$f":"OFFSET('Taula Concentrats'!$A$1,$C12,$AF$2,1,1)","v":84},{"$f":"OFFSET('Taula Concentrats'!$A$1,$C12,$AG$2,1,1)","v":163},{"$f":"OFFSET('Taula Concentrats'!$A$1,$C12,$AH$2,1,1)","v":104},{"$f":"OFFSET('Taula Concentrats'!$A$1,$C12,$AI$2,1,1)","v":8},{"$f":"OFFSET('Taula Concentrats'!$A$1,$C12,$AJ$2,1,1)","v":83},{"$f":"OFFSET('Taula Concentrats'!$A$1,$C12,$AK$2,1,1)","v":2.2999999999999998},{"$f":"OFFSET('Taula Concentrats'!$A$1,$C12,$AL$2,1,1)","v":0.68199960346033861},{"$f":"OFFSET('Taula Concentrats'!$A$1,$C12,$AM$2,1,1)","v":601.94944148864533},{"$f":"IF('II_Plantejar Ració'!$E13>0,IF(CàlculsEV!E12>=0,1,\"No\"),\"\")","v":1},{"$f":"IF('II_Plantejar Ració'!$E13>0,IF(CàlculsEV!F12>0,1,\"No\"),\"\")","v":1},{"$f":"IF('II_Plantejar Ració'!$E13>0,IF(CàlculsEV!G12>0,1,\"No\"),\"\")","v":1},{"$f":"IF('II_Plantejar Ració'!$E13>0,IF(CàlculsEV!H12=0,\"No\",1),\"\")","v":1},{"$f":"IF('II_Plantejar Ració'!$E13>0,IF(CàlculsEV!I12>0,1,\"No\"),\"\")","v":1},{"$f":"IF('II_Plantejar Ració'!$E13>0,IF(CàlculsEV!J12>0,1,\"No\"),\"\")","v":1},{"$f":"IF('II_Plantejar Ració'!$E13>0,IF(CàlculsEV!K12>0,1,\"No\"),\"\")","v":1},{"$f":"IF('II_Plantejar Ració'!$E13>0,IF(CàlculsEV!L12>0,1,\"No\"),\"\")","v":1},{"$f":"IF('II_Plantejar Ració'!$E13>0,IF(CàlculsEV!M12>0,1,\"No\"),\"\")","v":1},{"$f":"IF('II_Plantejar Ració'!$E13>0,IF(CàlculsEV!N12>0,1,\"No\"),\"\")","v":1},{"$f":"IF('II_Plantejar Ració'!$E13>0,IF(CàlculsEV!O12>0,1,\"No\"),\"\")","v":"No"},{"$f":"IF('II_Plantejar Ració'!$E13>0,IF(CàlculsEV!P12>0,1,\"No\"),\"\")","v":"No"},{"$f":"IF('II_Plantejar Ració'!$E13>0,IF(CàlculsEV!Q12>0,1,\"No\"),\"\")","v":1},{"$f":"IF('II_Plantejar Ració'!$E13>0,IF(CàlculsEV!R12>0,1,\"No\"),\"\")","v":1},{"$f":"IF('II_Plantejar Ració'!$E13>0,IF(CàlculsEV!S12>0,1,\"No\"),\"\")","v":1},{"$f":"IF('II_Plantejar Ració'!$E13>0,IF(CàlculsEV!T12>0,1,\"No\"),\"\")","v":1},{"$f":"IF('II_Plantejar Ració'!$E13>0,IF(CàlculsEV!U12>0,1,\"No\"),\"\")","v":"No"},{"$f":"IF('II_Plantejar Ració'!$E13>0,IF(CàlculsEV!V12>0,1,\"No\"),\"\")","v":1},{"$f":"IF('II_Plantejar Ració'!$E13>0,IF(CàlculsEV!W12>0,1,\"No\"),\"\")","v":"No"},{"$f":"IF('II_Plantejar Ració'!$E13>0,IF(CàlculsEV!X12>0,1,\"No\"),\"\")","v":"No"},{"$f":"IF('II_Plantejar Ració'!$E13>0,IF(CàlculsEV!Y12>0,1,\"No\"),\"\")","v":1},{"$f":"IF('II_Plantejar Ració'!$E13>0,IF(CàlculsEV!Z12>0,1,\"No\"),\"\")","v":1},{"$f":"IF('II_Plantejar Ració'!$E13>0,IF(CàlculsEV!AA12>0,1,\"No\"),\"\")","v":1},{"$f":"IF('II_Plantejar Ració'!$E13>0,IF(CàlculsEV!AB12>0,1,\"No\"),\"\")","v":1},{"$f":"IF('II_Plantejar Ració'!$E13>0,IF(CàlculsEV!AC12>0,1,\"No\"),\"\")","v":1},{"$f":"IF('II_Plantejar Ració'!$E13>0,IF(CàlculsEV!AD12>0,1,\"No\"),\"\")","v":1},{"$f":"IF('II_Plantejar Ració'!$E13>0,IF(CàlculsEV!AE12>0,1,\"No\"),\"\")","v":1},{"$f":"IF('II_Plantejar Ració'!$E13>0,IF(CàlculsEV!AF12>0,1,\"No\"),\"\")","v":1},{"$f":"IF('II_Plantejar Ració'!$E13>0,IF(CàlculsEV!AG12>0,1,\"No\"),\"\")","v":1},{"$f":"IF('II_Plantejar Ració'!$E13>0,IF(CàlculsEV!AH12>0,1,\"No\"),\"\")","v":1},{"$f":"IF('II_Plantejar Ració'!$E13>0,IF(CàlculsEV!AI12>0,1,\"No\"),\"\")","v":1},{"$f":"IF('II_Plantejar Ració'!$E13>0,IF(CàlculsEV!AJ12>0,1,\"No\"),\"\")","v":1},{"$f":"IF('II_Plantejar Ració'!$E13>0,IF(CàlculsEV!AK12>0,1,\"No\"),\"\")","v":1},{"$f":"IF('II_Plantejar Ració'!$E13>0,IF(CàlculsEV!AL12>0,1,\"No\"),\"\")","v":1},{"$f":"IF('II_Plantejar Ració'!$E13>0,IF(CàlculsEV!AM12>0,1,\"No\"),\"\")","v":1},1,1,1,1,1,1,1,1,1,1,1,1,1,1,1,1,1,1,1,1,1,1,1,1,1,1,1,1,1,1,1,1,1,1,1]
[null,{"$f":"IF(OFFSET('Taula Concentrats'!$A$1,C13,0,1,1)=0,\"\",OFFSET('Taula Concentrats'!$A$1,C13,0,1,1))","v":"Mandioca"},78,{"$f":"OFFSET('Taula Concentrats'!$A$1,$C13,$D$2,1,1)","v":85},{"$f":"OFFSET('Taula Concentrats'!$A$1,$C13,$E$2,1,1)","v":0},{"$f":"OFFSET('Taula Concentrats'!$A$1,$C13,$F$2,1,1)","v":1.1420974625875657},{"$f":"OFFSET('Taula Concentrats'!$A$1,$C13,$G$2,1,1)","v":75.490022489380621},{"$f":"OFFSET('Taula Concentrats'!$A$1,$C13,$H$2,1,1)","v":-97.453437442000009},{"$f":"OFFSET('Taula Concentrats'!$A$1,$C13,$I$2,1,1)","v":2},{"$f":"OFFSET('Taula Concentrats'!$A$1,$C13,$J$2,1,1)","v":2.5},{"$f":"OFFSET('Taula Concentrats'!$A$1,$C13,$K$2,1,1)","v":1},{"$f":"OFFSET('Taula Concentrats'!$A$1,$C13,$L$2,1,1)","v":0.9},{"$f":"OFFSET('Taula Concentrats'!$A$1,$C13,$M$2,1,1)","v":7.5},{"$f":"OFFSET('Taula Concentrats'!$A$1,$C13,$N$2,1,1)","v":0.35},{"$f":"OFFSET('Taula Concentrats'!$A$1,$C13,$O$2,1,1)","v":0},{"$f":"OFFSET('Taula Concentrats'!$A$1,$C13,$P$2,1,1)","v":0},{"$f":"OFFSET('Taula Concentrats'!$A$1,$C13,$Q$2,1,1)","v":0},{"$f":"OFFSET('Taula Concentrats'!$A$1,$C13,$R$2,1,1)","v":2},{"$f":"OFFSET('Taula Concentrats'!$A$1,$C13,$S$2,1,1)","v":5},{"$f":"OFFSET('Taula Concentrats'!$A$1,$C13,$T$2,1,1)","v":30},{"$f":"OFFSET('Taula Concentrats'!$A$1,$C13,$U$2,1,1)","v":0},{"$f":"OFFSET('Taula Concentrats'!$A$1,$C13,$V$2,1,1)","v":0},{"$f":"OFFSET('Taula Concentrats'!$A$1,$C13,$W$2,1,1)","v":0},{"$f":"OFFSET('Taula Concentrats'!$A$1,$C13,$X$2,1,1)","v":0},{"$f":"OFFSET('Taula Concentrats'!$A$1,$C13,$Y$2,1,1)","v":0},{"$f":"OFFSET('Taula Concentrats'!$A$1,$C13,$Z$2,1,1)","v":6.56},{"$f":"OFFSET('Taula Concentrats'!$A$1,$C13,$AA$2,1,1)","v":31},{"$f":"OFFSET('Taula Concentrats'!$A$1,$C13,$AB$2,1,1)","v":10.1054225265006},{"$f":"OFFSET('Taula Concentrats'!$A$1,$C13,$AC$2,1,1)","v":0.91761999999999999},{"$f":"OFFSET('Taula Concentrats'!$A$1,$C13,$AD$2,1,1)","v":861.64517999999998},{"$f":"OFFSET('Taula Concentrats'!$A$1,$C13,$AE$2,1,1)","v":8.1999999999999993},{"$f":"OFFSET('Taula Concentrats'!$A$1,$C13,$AF$2,1,1)","v":54},{"$f":"OFFSET('Taula Concentrats'!$A$1,$C13,$AG$2,1,1)","v":118},{"$f":"OFFSET('Taula Concentrats'!$A$1,$C13,$AH$2,1,1)","v":59},{"$f":"OFFSET('Taula Concentrats'!$A$1,$C13,$AI$2,1,1)","v":14.01},{"$f":"OFFSET('Taula Concentrats'!$A$1,$C13,$AJ$2,1,1)","v":61},{"$f":"OFFSET('Taula Concentrats'!$A$1,$C13,$AK$2,1,1)","v":0},{"$f":"OFFSET('Taula Concentrats'!$A$1,$C13,$AL$2,1,1)","v":0.63899949400537248},{"$f":"OFFSET('Taula Concentrats'!$A$1,$C13,$AM$2,1,1)","v":842.25416431416647},{"$f":"IF('II_Plantejar Ració'!$E14>0,IF(CàlculsEV!E13>=0,1,\"No\"),\"\")","v":""},{"$f":"IF('II_Plantejar Ració'!$E14>0,IF(CàlculsEV!F13>0,1,\"No\"),\"\")","v":""},{"$f":"IF('II_Plantejar Ració'!$E14>0,IF(CàlculsEV!G13>0,1,\"No\"),\"\")","v":""},{"$f":"IF('II_Plantejar Ració'!$E14>0,IF(CàlculsEV!H13=0,\"No\",1),\"\")","v":""},{"$f":"IF('II_Plantejar Ració'!$E14>0,IF(CàlculsEV!I13>0,1,\"No\"),\"\")","v":""},{"$f":"IF('II_Plantejar Ració'!$E14>0,IF(CàlculsEV!J13>0,1,\"No\"),\"\")","v":""},{"$f":"IF('II_Plantejar Ració'!$E14>0,IF(CàlculsEV!K13>0,1,\"No\"),\"\")","v":""},{"$f":"IF('II_Plantejar Ració'!$E14>0,IF(CàlculsEV!L13>0,1,\"No\"),\"\")","v":""},{"$f":"IF('II_Plantejar Ració'!$E14>0,IF(CàlculsEV!M13>0,1,\"No\"),\"\")","v":""},{"$f":"IF('II_Plantejar Ració'!$E14>0,IF(CàlculsEV!N13>0,1,\"No\"),\"\")","v":""},{"$f":"IF('II_Plantejar Ració'!$E14>0,IF(CàlculsEV!O13>0,1,\"No\"),\"\")","v":""},{"$f":"IF('II_Plantejar Ració'!$E14>0,IF(CàlculsEV!P13>0,1,\"No\"),\"\")","v":""},{"$f":"IF('II_Plantejar Ració'!$E14>0,IF(CàlculsEV!Q13>0,1,\"No\"),\"\")","v":""},{"$f":"IF('II_Plantejar Ració'!$E14>0,IF(CàlculsEV!R13>0,1,\"No\"),\"\")","v":""},{"$f":"IF('II_Plantejar Ració'!$E14>0,IF(CàlculsEV!S13>0,1,\"No\"),\"\")","v":""},{"$f":"IF('II_Plantejar Ració'!$E14>0,IF(CàlculsEV!T13>0,1,\"No\"),\"\")","v":""},{"$f":"IF('II_Plantejar Ració'!$E14>0,IF(CàlculsEV!U13>0,1,\"No\"),\"\")","v":""},{"$f":"IF('II_Plantejar Ració'!$E14>0,IF(CàlculsEV!V13>0,1,\"No\"),\"\")","v":""},{"$f":"IF('II_Plantejar Ració'!$E14>0,IF(CàlculsEV!W13>0,1,\"No\"),\"\")","v":""},{"$f":"IF('II_Plantejar Ració'!$E14>0,IF(CàlculsEV!X13>0,1,\"No\"),\"\")","v":""},{"$f":"IF('II_Plantejar Ració'!$E14>0,IF(CàlculsEV!Y13>0,1,\"No\"),\"\")","v":""},{"$f":"IF('II_Plantejar Ració'!$E14>0,IF(CàlculsEV!Z13>0,1,\"No\"),\"\")","v":""},{"$f":"IF('II_Plantejar Ració'!$E14>0,IF(CàlculsEV!AA13>0,1,\"No\"),\"\")","v":""},{"$f":"IF('II_Plantejar Ració'!$E14>0,IF(CàlculsEV!AB13>0,1,\"No\"),\"\")","v":""},{"$f":"IF('II_Plantejar Ració'!$E14>0,IF(CàlculsEV!AC13>0,1,\"No\"),\"\")","v":""},{"$f":"IF('II_Plantejar Ració'!$E14>0,IF(CàlculsEV!AD13>0,1,\"No\"),\"\")","v":""},{"$f":"IF('II_Plantejar Ració'!$E14>0,IF(CàlculsEV!AE13>0,1,\"No\"),\"\")","v":""},{"$f":"IF('II_Plantejar Ració'!$E14>0,IF(CàlculsEV!AF13>0,1,\"No\"),\"\")","v":""},{"$f":"IF('II_Plantejar Ració'!$E14>0,IF(CàlculsEV!AG13>0,1,\"No\"),\"\")","v":""},{"$f":"IF('II_Plantejar Ració'!$E14>0,IF(CàlculsEV!AH13>0,1,\"No\"),\"\")","v":""},{"$f":"IF('II_Plantejar Ració'!$E14>0,IF(CàlculsEV!AI13>0,1,\"No\"),\"\")","v":""},{"$f":"IF('II_Plantejar Ració'!$E14>0,IF(CàlculsEV!AJ13>0,1,\"No\"),\"\")","v":""},{"$f":"IF('II_Plantejar Ració'!$E14>0,IF(CàlculsEV!AK13>0,1,\"No\"),\"\")","v":""},{"$f":"IF('II_Plantejar Ració'!$E14>0,IF(CàlculsEV!AL13>0,1,\"No\"),\"\")","v":""},{"$f":"IF('II_Plantejar Ració'!$E14>0,IF(CàlculsEV!AM13>0,1,\"No\"),\"\")","v":""},0,0,0,0,0,0,0,0,0,0,0,0,0,0,0,0,0,0,0,0,0,0,0,0,0,0,0,0,0,0,0,0,0,0,0]
[null,{"$f":"IF(OFFSET('Taula Concentrats'!$A$1,C14,0,1,1)=0,\"\",OFFSET('Taula Concentrats'!$A$1,C14,0,1,1))","v":"Ordi bagàs cerveseria sec"},24,{"$f":"OFFSET('Taula Concentrats'!$A$1,$C14,$D$2,1,1)","v":91.9},{"$f":"OFFSET('Taula Concentrats'!$A$1,$C14,$E$2,1,1)","v":0},{"$f":"OFFSET('Taula Concentrats'!$A$1,$C14,$F$2,1,1)","v":0.87119356499561229},{"$f":"OFFSET('Taula Concentrats'!$A$1,$C14,$G$2,1,1)","v":151.63839868082431},{"$f":"OFFSET('Taula Concentrats'!$A$1,$C14,$H$2,1,1)","v":35.094428351199994},{"$f":"OFFSET('Taula Concentrats'!$A$1,$C14,$I$2,1,1)","v":2},{"$f":"OFFSET('Taula Concentrats'!$A$1,$C14,$J$2,1,1)","v":2.2999999999999998},{"$f":"OFFSET('Taula Concentrats'!$A$1,$C14,$K$2,1,1)","v":6.3},{"$f":"OFFSET('Taula Concentrats'!$A$1,$C14,$L$2,1,1)","v":0},{"$f":"OFFSET('Taula Concentrats'!$A$1,$C14,$M$2,1,1)","v":0},{"$f":"OFFSET('Taula Concentrats'!$A$1,$C14,$N$2,1,1)","v":0},{"$f":"OFFSET('Taula Concentrats'!$A$1,$C14,$O$2,1,1)","v":0},{"$f":"OFFSET('Taula Concentrats'!$A$1,$C14,$P$2,1,1)","v":0},{"$f":"OFFSET('Taula Concentrats'!$A$1,$C14,$Q$2,1,1)","v":0.08},{"$f":"OFFSET('Taula Concentrats'!$A$1,$C14,$R$2,1,1)","v":22.2},{"$f":"OFFSET('Taula Concentrats'!$A$1,$C14,$S$2,1,1)","v":38.5},{"$f":"OFFSET('Taula Concentrats'!$A$1,$C14,$T$2,1,1)","v":85},{"$f":"OFFSET('Taula Concentrats'!$A$1,$C14,$U$2,1,1)","v":0},{"$f":"OFFSET('Taula Concentrats'!$A$1,$C14,$V$2,1,1)","v":0.06},{"$f":"OFFSET('Taula Concentrats'!$A$1,$C14,$W$2,1,1)","v":0},{"$f":"OFFSET('Taula Concentrats'!$A$1,$C14,$X$2,1,1)","v":0},{"$f":"OFFSET('Taula Concentrats'!$A$1,$C14,$Y$2,1,1)","v":29},{"$f":"OFFSET('Taula Concentrats'!$A$1,$C14,$Z$2,1,1)","v":35.955000000000005},{"$f":"OFFSET('Taula Concentrats'!$A$1,$C14,$AA$2,1,1)","v":262.39999999999998},{"$f":"OFFSET('Taula Concentrats'!$A$1,$C14,$AB$2,1,1)","v":107.61563282559231},{"$f":"OFFSET('Taula Concentrats'!$A$1,$C14,$AC$2,1,1)","v":0.62731999999999999},{"$f":"OFFSET('Taula Concentrats'!$A$1,$C14,$AD$2,1,1)","v":601.34895199999994},{"$f":"OFFSET('Taula Concentrats'!$A$1,$C14,$AE$2,1,1)","v":79.900000000000006},{"$f":"OFFSET('Taula Concentrats'!$A$1,$C14,$AF$2,1,1)","v":161.6},{"$f":"OFFSET('Taula Concentrats'!$A$1,$C14,$AG$2,1,1)","v":643.29999999999995},{"$f":"OFFSET('Taula Concentrats'!$A$1,$C14,$AH$2,1,1)","v":236.4},{"$f":"OFFSET('Taula Concentrats'!$A$1,$C14,$AI$2,1,1)","v":78.899999999999991},{"$f":"OFFSET('Taula Concentrats'!$A$1,$C14,$AJ$2,1,1)","v":41.4},{"$f":"OFFSET('Taula Concentrats'!$A$1,$C14,$AK$2,1,1)","v":0.5},{"$f":"OFFSET('Taula Concentrats'!$A$1,$C14,$AL$2,1,1)","v":0.53718506650710496},{"$f":"OFFSET('Taula Concentrats'!$A$1,$C14,$AM$2,1,1)","v":400.00631345146428},{"$f":"IF('II_Plantejar Ració'!$E15>0,IF(CàlculsEV!E14>=0,1,\"No\"),\"\")","v":""},{"$f":"IF('II_Plantejar Ració'!$E15>0,IF(CàlculsEV!F14>0,1,\"No\"),\"\")","v":""},{"$f":"IF('II_Plantejar Ració'!$E15>0,IF(CàlculsEV!G14>0,1,\"No\"),\"\")","v":""},{"$f":"IF('II_Plantejar Ració'!$E15>0,IF(CàlculsEV!H14=0,\"No\",1),\"\")","v":""},{"$f":"IF('II_Plantejar Ració'!$E15>0,IF(CàlculsEV!I14>0,1,\"No\"),\"\")","v":""},{"$f":"IF('II_Plantejar Ració'!$E15>0,IF(CàlculsEV!J14>0,1,\"No\"),\"\")","v":""},{"$f":"IF('II_Plantejar Ració'!$E15>0,IF(CàlculsEV!K14>0,1,\"No\"),\"\")","v":""},{"$f":"IF('II_Plantejar Ració'!$E15>0,IF(CàlculsEV!L14>0,1,\"No\"),\"\")","v":""},{"$f":"IF('II_Plantejar Ració'!$E15>0,IF(CàlculsEV!M14>0,1,\"No\"),\"\")","v":""},{"$f":"IF('II_Plantejar Ració'!$E15>0,IF(CàlculsEV!N14>0,1,\"No\"),\"\")","v":""},{"$f":"IF('II_Plantejar Ració'!$E15>0,IF(CàlculsEV!O14>0,1,\"No\"),\"\")","v":""},{"$f":"IF('II_Plantejar Ració'!$E15>0,IF(CàlculsEV!P14>0,1,\"No\"),\"\")","v":""},{"$f":"IF('II_Plantejar Ració'!$E15>0,IF(CàlculsEV!Q14>0,1,\"No\"),\"\")","v":""},{"$f":"IF('II_Plantejar Ració'!$E15>0,IF(CàlculsEV!R14>0,1,\"No\"),\"\")","v":""},{"$f":"IF('II_Plantejar Ració'!$E15>0,IF(CàlculsEV!S14>0,1,\"No\"),\"\")","v":""},{"$f":"IF('II_Plantejar Ració'!$E15>0,IF(CàlculsEV!T14>0,1,\"No\"),\"\")","v":""},{"$f":"IF('II_Plantejar Ració'!$E15>0,IF(CàlculsEV!U14>0,1,\"No\"),\"\")","v":""},{"$f":"IF('II_Plantejar Ració'!$E15>0,IF(CàlculsEV!V14>0,1,\"No\"),\"\")","v":""},{"$f":"IF('II_Plantejar Ració'!$E15>0,IF(CàlculsEV!W14>0,1,\"No\"),\"\")","v":""},{"$f":"IF('II_Plantejar Ració'!$E15>0,IF(CàlculsEV!X14>0,1,\"No\"),\"\")","v":""},{"$f":"IF('II_Plantejar Ració'!$E15>0,IF(CàlculsEV!Y14>0,1,\"No\"),\"\")","v":""},{"$f":"IF('II_Plantejar Ració'!$E15>0,IF(CàlculsEV!Z14>0,1,\"No\"),\"\")","v":""},{"$f":"IF('II_Plantejar Ració'!$E15>0,IF(CàlculsEV!AA14>0,1,\"No\"),\"\")","v":""},{"$f":"IF('II_Plantejar Ració'!$E15>0,IF(CàlculsEV!AB14>0,1,\"No\"),\"\")","v":""},{"$f":"IF('II_Plantejar Ració'!$E15>0,IF(CàlculsEV!AC14>0,1,\"No\"),\"\")","v":""},{"$f":"IF('II_Plantejar Ració'!$E15>0,IF(CàlculsEV!AD14>0,1,\"No\"),\"\")","v":""},{"$f":"IF('II_Plantejar Ració'!$E15>0,IF(CàlculsEV!AE14>0,1,\"No\"),\"\")","v":""},{"$f":"IF('II_Plantejar Ració'!$E15>0,IF(CàlculsEV!AF14>0,1,\"No\"),\"\")","v":""},{"$f":"IF('II_Plantejar Ració'!$E15>0,IF(CàlculsEV!AG14>0,1,\"No\"),\"\")","v":""},{"$f":"IF('II_Plantejar Ració'!$E15>0,IF(CàlculsEV!AH14>0,1,\"No\"),\"\")","v":""},{"$f":"IF('II_Plantejar Ració'!$E15>0,IF(CàlculsEV!AI14>0,1,\"No\"),\"\")","v":""},{"$f":"IF('II_Plantejar Ració'!$E15>0,IF(CàlculsEV!AJ14>0,1,\"No\"),\"\")","v":""},{"$f":"IF('II_Plantejar Ració'!$E15>0,IF(CàlculsEV!AK14>0,1,\"No\"),\"\")","v":""},{"$f":"IF('II_Plantejar Ració'!$E15>0,IF(CàlculsEV!AL14>0,1,\"No\"),\"\")","v":""},{"$f":"IF('II_Plantejar Ració'!$E15>0,IF(CàlculsEV!AM14>0,1,\"No\"),\"\")","v":""},0,0,0,0,0,0,0,0,0,0,0,0,0,0,0,0,0,0,0,0,0,0,0,0,0,0,0,0,0,0,0,0,0,0,0]
[null,{"$f":"IF(OFFSET('Taula Concentrats'!$A$1,C15,0,1,1)=0,\"\",OFFSET('Taula Concentrats'!$A$1,C15,0,1,1))","v":"Cotó, gra"},34,{"$f":"OFFSET('Taula Concentrats'!$A$1,$C15,$D$2,1,1)","v":92},{"$f":"OFFSET('Taula Concentrats'!$A$1,$C15,$E$2,1,1)","v":0},{"$f":"OFFSET('Taula Concentrats'!$A$1,$C15,$F$2,1,1)","v":1.1057454642423121},{"$f":"OFFSET('Taula Concentrats'!$A$1,$C15,$G$2,1,1)","v":91.654792821464014},{"$f":"OFFSET('Taula Concentrats'!$A$1,$C15,$H$2,1,1)","v":70.583837883999976},{"$f":"OFFSET('Taula Concentrats'!$A$1,$C15,$I$2,1,1)","v":2},{"$f":"OFFSET('Taula Concentrats'!$A$1,$C15,$J$2,1,1)","v":2.1},{"$f":"OFFSET('Taula Concentrats'!$A$1,$C15,$K$2,1,1)","v":6.4},{"$f":"OFFSET('Taula Concentrats'!$A$1,$C15,$L$2,1,1)","v":0},{"$f":"OFFSET('Taula Concentrats'!$A$1,$C15,$M$2,1,1)","v":0},{"$f":"OFFSET('Taula Concentrats'!$A$1,$C15,$N$2,1,1)","v":0},{"$f":"OFFSET('Taula Concentrats'!$A$1,$C15,$O$2,1,1)","v":0},{"$f":"OFFSET('Taula Concentrats'!$A$1,$C15,$P$2,1,1)","v":0},{"$f":"OFFSET('Taula Concentrats'!$A$1,$C15,$Q$2,1,1)","v":0},{"$f":"OFFSET('Taula Concentrats'!$A$1,$C15,$R$2,1,1)","v":0},{"$f":"OFFSET('Taula Concentrats'!$A$1,$C15,$S$2,1,1)","v":0},{"$f":"OFFSET('Taula Concentrats'!$A$1,$C15,$T$2,1,1)","v":0},{"$f":"OFFSET('Taula Concentrats'!$A$1,$C15,$U$2,1,1)","v":0},{"$f":"OFFSET('Taula Concentrats'!$A$1,$C15,$V$2,1,1)","v":0},{"$f":"OFFSET('Taula Concentrats'!$A$1,$C15,$W$2,1,1)","v":0},{"$f":"OFFSET('Taula Concentrats'!$A$1,$C15,$X$2,1,1)","v":0},{"$f":"OFFSET('Taula Concentrats'!$A$1,$C15,$Y$2,1,1)","v":0},{"$f":"OFFSET('Taula Concentrats'!$A$1,$C15,$Z$2,1,1)","v":188.1},{"$f":"OFFSET('Taula Concentrats'!$A$1,$C15,$AA$2,1,1)","v":220},{"$f":"OFFSET('Taula Concentrats'!$A$1,$C15,$AB$2,1,1)","v":48.764449067224007},{"$f":"OFFSET('Taula Concentrats'!$A$1,$C15,$AC$2,1,1)","v":0.64651999999999998},{"$f":"OFFSET('Taula Concentrats'!$A$1,$C15,$AD$2,1,1)","v":618.71964000000003},{"$f":"OFFSET('Taula Concentrats'!$A$1,$C15,$AE$2,1,1)","v":198},{"$f":"OFFSET('Taula Concentrats'!$A$1,$C15,$AF$2,1,1)","v":276},{"$f":"OFFSET('Taula Concentrats'!$A$1,$C15,$AG$2,1,1)","v":456},{"$f":"OFFSET('Taula Concentrats'!$A$1,$C15,$AH$2,1,1)","v":354},{"$f":"OFFSET('Taula Concentrats'!$A$1,$C15,$AI$2,1,1)","v":105},{"$f":"OFFSET('Taula Concentrats'!$A$1,$C15,$AJ$2,1,1)","v":43},{"$f":"OFFSET('Taula Concentrats'!$A$1,$C15,$AK$2,1,1)","v":0},{"$f":"OFFSET('Taula Concentrats'!$A$1,$C15,$AL$2,1,1)","v":0.73941085414823005},{"$f":"OFFSET('Taula Concentrats'!$A$1,$C15,$AM$2,1,1)","v":363.39002791261066},{"$f":"IF('II_Plantejar Ració'!$E16>0,IF(CàlculsEV!E15>=0,1,\"No\"),\"\")","v":""},{"$f":"IF('II_Plantejar Ració'!$E16>0,IF(CàlculsEV!F15>0,1,\"No\"),\"\")","v":""},{"$f":"IF('II_Plantejar Ració'!$E16>0,IF(CàlculsEV!G15>0,1,\"No\"),\"\")","v":""},{"$f":"IF('II_Plantejar Ració'!$E16>0,IF(CàlculsEV!H15=0,\"No\",1),\"\")","v":""},{"$f":"IF('II_Plantejar Ració'!$E16>0,IF(CàlculsEV!I15>0,1,\"No\"),\"\")","v":""},{"$f":"IF('II_Plantejar Ració'!$E16>0,IF(CàlculsEV!J15>0,1,\"No\"),\"\")","v":""},{"$f":"IF('II_Plantejar Ració'!$E16>0,IF(CàlculsEV!K15>0,1,\"No\"),\"\")","v":""},{"$f":"IF('II_Plantejar Ració'!$E16>0,IF(CàlculsEV!L15>0,1,\"No\"),\"\")","v":""},{"$f":"IF('II_Plantejar Ració'!$E16>0,IF(CàlculsEV!M15>0,1,\"No\"),\"\")","v":""},{"$f":"IF('II_Plantejar Ració'!$E16>0,IF(CàlculsEV!N15>0,1,\"No\"),\"\")","v":""},{"$f":"IF('II_Plantejar Ració'!$E16>0,IF(CàlculsEV!O15>0,1,\"No\"),\"\")","v":""},{"$f":"IF('II_Plantejar Ració'!$E16>0,IF(CàlculsEV!P15>0,1,\"No\"),\"\")","v":""},{"$f":"IF('II_Plantejar Ració'!$E16>0,IF(CàlculsEV!Q15>0,1,\"No\"),\"\")","v":""},{"$f":"IF('II_Plantejar Ració'!$E16>0,IF(CàlculsEV!R15>0,1,\"No\"),\"\")","v":""},{"$f":"IF('II_Plantejar Ració'!$E16>0,IF(CàlculsEV!S15>0,1,\"No\"),\"\")","v":""},{"$f":"IF('II_Plantejar Ració'!$E16>0,IF(CàlculsEV!T15>0,1,\"No\"),\"\")","v":""},{"$f":"IF('II_Plantejar Ració'!$E16>0,IF(CàlculsEV!U15>0,1,\"No\"),\"\")","v":""},{"$f":"IF('II_Plantejar Ració'!$E16>0,IF(CàlculsEV!V15>0,1,\"No\"),\"\")","v":""},{"$f":"IF('II_Plantejar Ració'!$E16>0,IF(CàlculsEV!W15>0,1,\"No\"),\"\")","v":""},{"$f":"IF('II_Plantejar Ració'!$E16>0,IF(CàlculsEV!X15>0,1,\"No\"),\"\")","v":""},{"$f":"IF('II_Plantejar Ració'!$E16>0,IF(CàlculsEV!Y15>0,1,\"No\"),\"\")","v":""},{"$f":"IF('II_Plantejar Ració'!$E16>0,IF(CàlculsEV!Z15>0,1,\"No\"),\"\")","v":""},{"$f":"IF('II_Plantejar Ració'!$E16>0,IF(CàlculsEV!AA15>0,1,\"No\"),\"\")","v":""},{"$f":"IF('II_Plantejar Ració'!$E16>0,IF(CàlculsEV!AB15>0,1,\"No\"),\"\")","v":""},{"$f":"IF('II_Plantejar Ració'!$E16>0,IF(CàlculsEV!AC15>0,1,\"No\"),\"\")","v":""},{"$f":"IF('II_Plantejar Ració'!$E16>0,IF(CàlculsEV!AD15>0,1,\"No\"),\"\")","v":""},{"$f":"IF('II_Plantejar Ració'!$E16>0,IF(CàlculsEV!AE15>0,1,\"No\"),\"\")","v":""},{"$f":"IF('II_Plantejar Ració'!$E16>0,IF(CàlculsEV!AF15>0,1,\"No\"),\"\")","v":""},{"$f":"IF('II_Plantejar Ració'!$E16>0,IF(CàlculsEV!AG15>0,1,\"No\"),\"\")","v":""},{"$f":"IF('II_Plantejar Ració'!$E16>0,IF(CàlculsEV!AH15>0,1,\"No\"),\"\")","v":""},{"$f":"IF('II_Plantejar Ració'!$E16>0,IF(CàlculsEV!AI15>0,1,\"No\"),\"\")","v":""},{"$f":"IF('II_Plantejar Ració'!$E16>0,IF(CàlculsEV!AJ15>0,1,\"No\"),\"\")","v":""},{"$f":"IF('II_Plantejar Ració'!$E16>0,IF(CàlculsEV!AK15>0,1,\"No\"),\"\")","v":""},{"$f":"IF('II_Plantejar Ració'!$E16>0,IF(CàlculsEV!AL15>0,1,\"No\"),\"\")","v":""},{"$f":"IF('II_Plantejar Ració'!$E16>0,IF(CàlculsEV!AM15>0,1,\"No\"),\"\")","v":""},0,0,0,0,0,0,0,0,0,0,0,0,0,0,0,0,0,0,0,0,0,0,0,0,0,0,0,0,0,0,0,0,0,0,0]
[null,{"$f":"IF(OFFSET('Taula Concentrats'!$A$1,C16,0,1,1)=0,\"\",OFFSET('Taula Concentrats'!$A$1,C16,0,1,1))","v":"Llevat cerveseria"},75,{"$f":"OFFSET('Taula Concentrats'!$A$1,$C16,$D$2,1,1)","v":93.3},{"$f":"OFFSET('Taula Concentrats'!$A$1,$C16,$E$2,1,1)","v":0},{"$f":"OFFSET('Taula Concentrats'!$A$1,$C16,$F$2,1,1)","v":1.18},{"$f":"OFFSET('Taula Concentrats'!$A$1,$C16,$G$2,1,1)","v":143},{"$f":"OFFSET('Taula Concentrats'!$A$1,$C16,$H$2,1,1)","v":278},{"$f":"OFFSET('Taula Concentrats'!$A$1,$C16,$I$2,1,1)","v":2},{"$f":"OFFSET('Taula Concentrats'!$A$1,$C16,$J$2,1,1)","v":3},{"$f":"OFFSET('Taula Concentrats'!$A$1,$C16,$K$2,1,1)","v":13.5},{"$f":"OFFSET('Taula Concentrats'!$A$1,$C16,$L$2,1,1)","v":2.4},{"$f":"OFFSET('Taula Concentrats'!$A$1,$C16,$M$2,1,1)","v":0},{"$f":"OFFSET('Taula Concentrats'!$A$1,$C16,$N$2,1,1)","v":0},{"$f":"OFFSET('Taula Concentrats'!$A$1,$C16,$O$2,1,1)","v":0},{"$f":"OFFSET('Taula Concentrats'!$A$1,$C16,$P$2,1,1)","v":0},{"$f":"OFFSET('Taula Concentrats'!$A$1,$C16,$Q$2,1,1)","v":0},{"$f":"OFFSET('Taula Concentrats'!$A$1,$C16,$R$2,1,1)","v":0},{"$f":"OFFSET('Taula Concentrats'!$A$1,$C16,$S$2,1,1)","v":0},{"$f":"OFFSET('Taula Concentrats'!$A$1,$C16,$T$2,1,1)","v":0},{"$f":"OFFSET('Taula Concentrats'!$A$1,$C16,$U$2,1,1)","v":0},{"$f":"OFFSET('Taula Concentrats'!$A$1,$C16,$V$2,1,1)","v":0},{"$f":"OFFSET('Taula Concentrats'!$A$1,$C16,$W$2,1,1)","v":0},{"$f":"OFFSET('Taula Concentrats'!$A$1,$C16,$X$2,1,1)","v":0},{"$f":"OFFSET('Taula Concentrats'!$A$1,$C16,$Y$2,1,1)","v":0},{"$f":"OFFSET('Taula Concentrats'!$A$1,$C16,$Z$2,1,1)","v":32},{"$f":"OFFSET('Taula Concentrats'!$A$1,$C16,$AA$2,1,1)","v":476},{"$f":"OFFSET('Taula Concentrats'!$A$1,$C16,$AB$2,1,1)","v":87},{"$f":"OFFSET('Taula Concentrats'!$A$1,$C16,$AC$2,1,1)","v":0.84},{"$f":"OFFSET('Taula Concentrats'!$A$1,$C16,$AD$2,1,1)","v":756},{"$f":"OFFSET('Taula Concentrats'!$A$1,$C16,$AE$2,1,1)","v":40},{"$f":"OFFSET('Taula Concentrats'!$A$1,$C16,$AF$2,1,1)","v":21},{"$f":"OFFSET('Taula Concentrats'!$A$1,$C16,$AG$2,1,1)","v":88},{"$f":"OFFSET('Taula Concentrats'!$A$1,$C16,$AH$2,1,1)","v":25},{"$f":"OFFSET('Taula Concentrats'!$A$1,$C16,$AI$2,1,1)","v":7},{"$f":"OFFSET('Taula Concentrats'!$A$1,$C16,$AJ$2,1,1)","v":32},{"$f":"OFFSET('Taula Concentrats'!$A$1,$C16,$AK$2,1,1)","v":0},{"$f":"OFFSET('Taula Concentrats'!$A$1,$C16,$AL$2,1,1)","v":0.81515770697868817},{"$f":"OFFSET('Taula Concentrats'!$A$1,$C16,$AM$2,1,1)","v":628.0150685218556},{"$f":"IF('II_Plantejar Ració'!$E17>0,IF(CàlculsEV!E16>=0,1,\"No\"),\"\")","v":1},{"$f":"IF('II_Plantejar Ració'!$E17>0,IF(CàlculsEV!F16>0,1,\"No\"),\"\")","v":1},{"$f":"IF('II_Plantejar Ració'!$E17>0,IF(CàlculsEV!G16>0,1,\"No\"),\"\")","v":1},{"$f":"IF('II_Plantejar Ració'!$E17>0,IF(CàlculsEV!H16=0,\"No\",1),\"\")","v":1},{"$f":"IF('II_Plantejar Ració'!$E17>0,IF(CàlculsEV!I16>0,1,\"No\"),\"\")","v":1},{"$f":"IF('II_Plantejar Ració'!$E17>0,IF(CàlculsEV!J16>0,1,\"No\"),\"\")","v":1},{"$f":"IF('II_Plantejar Ració'!$E17>0,IF(CàlculsEV!K16>0,1,\"No\"),\"\")","v":1},{"$f":"IF('II_Plantejar Ració'!$E17>0,IF(CàlculsEV!L16>0,1,\"No\"),\"\")","v":1},{"$f":"IF('II_Plantejar Ració'!$E17>0,IF(CàlculsEV!M16>0,1,\"No\"),\"\")","v":"No"},{"$f":"IF('II_Plantejar Ració'!$E17>0,IF(CàlculsEV!N16>0,1,\"No\"),\"\")","v":"No"},{"$f":"IF('II_Plantejar Ració'!$E17>0,IF(CàlculsEV!O16>0,1,\"No\"),\"\")","v":"No"},{"$f":"IF('II_Plantejar Ració'!$E17>0,IF(CàlculsEV!P16>0,1,\"No\"),\"\")","v":"No"},{"$f":"IF('II_Plantejar Ració'!$E17>0,IF(CàlculsEV!Q16>0,1,\"No\"),\"\")","v":"No"},{"$f":"IF('II_Plantejar Ració'!$E17>0,IF(CàlculsEV!R16>0,1,\"No\"),\"\")","v":"No"},{"$f":"IF('II_Plantejar Ració'!$E17>0,IF(CàlculsEV!S16>0,1,\"No\"),\"\")","v":"No"},{"$f":"IF('II_Plantejar Ració'!$E17>0,IF(CàlculsEV!T16>0,1,\"No\"),\"\")","v":"No"},{"$f":"IF('II_Plantejar Ració'!$E17>0,IF(CàlculsEV!U16>0,1,\"No\"),\"\")","v":"No"},{"$f":"IF('II_Plantejar Ració'!$E17>0,IF(CàlculsEV!V16>0,1,\"No\"),\"\")","v":"No"},{"$f":"IF('II_Plantejar Ració'!$E17>0,IF(CàlculsEV!W16>0,1,\"No\"),\"\")","v":"No"},{"$f":"IF('II_Plantejar Ració'!$E17>0,IF(CàlculsEV!X16>0,1,\"No\"),\"\")","v":"No"},{"$f":"IF('II_Plantejar Ració'!$E17>0,IF(CàlculsEV!Y16>0,1,\"No\"),\"\")","v":"No"},{"$f":"IF('II_Plantejar Ració'!$E17>0,IF(CàlculsEV!Z16>0,1,\"No\"),\"\")","v":1},{"$f":"IF('II_Plantejar Ració'!$E17>0,IF(CàlculsEV!AA16>0,1,\"No\"),\"\")","v":1},{"$f":"IF('II_Plantejar Ració'!$E17>0,IF(CàlculsEV!AB16>0,1,\"No\"),\"\")","v":1},{"$f":"IF('II_Plantejar Ració'!$E17>0,IF(CàlculsEV!AC16>0,1,\"No\"),\"\")","v":1},{"$f":"IF('II_Plantejar Ració'!$E17>0,IF(CàlculsEV!AD16>0,1,\"No\"),\"\")","v":1},{"$f":"IF('II_Plantejar Ració'!$E17>0,IF(CàlculsEV!AE16>0,1,\"No\"),\"\")","v":1},{"$f":"IF('II_Plantejar Ració'!$E17>0,IF(CàlculsEV!AF16>0,1,\"No\"),\"\")","v":1},{"$f":"IF('II_Plantejar Ració'!$E17>0,IF(CàlculsEV!AG16>0,1,\"No\"),\"\")","v":1},{"$f":"IF('II_Plantejar Ració'!$E17>0,IF(CàlculsEV!AH16>0,1,\"No\"),\"\")","v":1},{"$f":"IF('II_Plantejar Ració'!$E17>0,IF(CàlculsEV!AI16>0,1,\"No\"),\"\")","v":1},{"$f":"IF('II_Plantejar Ració'!$E17>0,IF(CàlculsEV!AJ16>0,1,\"No\"),\"\")","v":1},{"$f":"IF('II_Plantejar Ració'!$E17>0,IF(CàlculsEV!AK16>0,1,\"No\"),\"\")","v":"No"},{"$f":"IF('II_Plantejar Ració'!$E17>0,IF(CàlculsEV!AL16>0,1,\"No\"),\"\")","v":1},{"$f":"IF('II_Plantejar Ració'!$E17>0,IF(CàlculsEV!AM16>0,1,\"No\"),\"\")","v":1},1,1,1,1,1,1,1,1,1,1,1,1,1,1,1,1,1,1,1,1,1,1,1,1,1,1,1,1,1,1,1,1,1,1,1]
[null,{"$f":"IF(OFFSET('Taula Concentrats'!$A$1,C17,0,1,1)=0,\"\",OFFSET('Taula Concentrats'!$A$1,C17,0,1,1))","v":"Grassa vegetal, mantega de porc (tots els tipus)"},74,{"$f":"OFFSET('Taula Concentrats'!$A$1,$C17,$D$2,1,1)","v":99.9},{"$f":"OFFSET('Taula Concentrats'!$A$1,$C17,$E$2,1,1)","v":0},{"$f":"OFFSET('Taula Concentrats'!$A$1,$C17,$F$2,1,1)","v":3.61},{"$f":"OFFSET('Taula Concentrats'!$A$1,$C17,$G$2,1,1)","v":9.9999999999999995E-8},{"$f":"OFFSET('Taula Concentrats'!$A$1,$C17,$H$2,1,1)","v":-14},{"$f":"OFFSET('Taula Concentrats'!$A$1,$C17,$I$2,1,1)","v":2},{"$f":"OFFSET('Taula Concentrats'!$A$1,$C17,$J$2,1,1)","v":9.9999999999999995E-8},{"$f":"OFFSET('Taula Concentrats'!$A$1,$C17,$K$2,1,1)","v":9.9999999999999995E-8},{"$f":"OFFSET('Taula Concentrats'!$A$1,$C17,$L$2,1,1)","v":9.9999999999999995E-8},{"$f":"OFFSET('Taula Concentrats'!$A$1,$C17,$M$2,1,1)","v":9.9999999999999995E-8},{"$f":"OFFSET('Taula Concentrats'!$A$1,$C17,$N$2,1,1)","v":9.9999999999999995E-8},{"$f":"OFFSET('Taula Concentrats'!$A$1,$C17,$O$2,1,1)","v":9.9999999999999995E-8},{"$f":"OFFSET('Taula Concentrats'!$A$1,$C17,$P$2,1,1)","v":9.9999999999999995E-8},{"$f":"OFFSET('Taula Concentrats'!$A$1,$C17,$Q$2,1,1)","v":9.9999999999999995E-8},{"$f":"OFFSET('Taula Concentrats'!$A$1,$C17,$R$2,1,1)","v":9.9999999999999995E-8},{"$f":"OFFSET('Taula Concentrats'!$A$1,$C17,$S$2,1,1)","v":9.9999999999999995E-8},{"$f":"OFFSET('Taula Concentrats'!$A$1,$C17,$T$2,1,1)","v":9.9999999999999995E-8},{"$f":"OFFSET('Taula Concentrats'!$A$1,$C17,$U$2,1,1)","v":9.9999999999999995E-8},{"$f":"OFFSET('Taula Concentrats'!$A$1,$C17,$V$2,1,1)","v":9.9999999999999995E-8},{"$f":"OFFSET('Taula Concentrats'!$A$1,$C17,$W$2,1,1)","v":1300},{"$f":"OFFSET('Taula Concentrats'!$A$1,$C17,$X$2,1,1)","v":9.9999999999999995E-8},{"$f":"OFFSET('Taula Concentrats'!$A$1,$C17,$Y$2,1,1)","v":95},{"$f":"OFFSET('Taula Concentrats'!$A$1,$C17,$Z$2,1,1)","v":999},{"$f":"OFFSET('Taula Concentrats'!$A$1,$C17,$AA$2,1,1)","v":9.9999999999999995E-8},{"$f":"OFFSET('Taula Concentrats'!$A$1,$C17,$AB$2,1,1)","v":9.9999999999999995E-8},{"$f":"OFFSET('Taula Concentrats'!$A$1,$C17,$AC$2,1,1)","v":0.9},{"$f":"OFFSET('Taula Concentrats'!$A$1,$C17,$AD$2,1,1)","v":9.9999999999999995E-8},{"$f":"OFFSET('Taula Concentrats'!$A$1,$C17,$AE$2,1,1)","v":999},{"$f":"OFFSET('Taula Concentrats'!$A$1,$C17,$AF$2,1,1)","v":9.9999999999999995E-8},{"$f":"OFFSET('Taula Concentrats'!$A$1,$C17,$AG$2,1,1)","v":9.9999999999999995E-8},{"$f":"OFFSET('Taula Concentrats'!$A$1,$C17,$AH$2,1,1)","v":9.9999999999999995E-8},{"$f":"OFFSET('Taula Concentrats'!$A$1,$C17,$AI$2,1,1)","v":9.9999999999999995E-8},{"$f":"OFFSET('Taula Concentrats'!$A$1,$C17,$AJ$2,1,1)","v":9.9999999999999995E-8},{"$f":"OFFSET('Taula Concentrats'!$A$1,$C17,$AK$2,1,1)","v":9.9999999999999995E-8},{"$f":"OFFSET('Taula Concentrats'!$A$1,$C17,$AL$2,1,1)","v":0},{"$f":"OFFSET('Taula Concentrats'!$A$1,$C17,$AM$2,1,1)","v":0},{"$f":"IF('II_Plantejar Ració'!$E18>0,IF(CàlculsEV!E17>=0,1,\"No\"),\"\")","v":1},{"$f":"IF('II_Plantejar Ració'!$E18>0,IF(CàlculsEV!F17>0,1,\"No\"),\"\")","v":1},{"$f":"IF('II_Plantejar Ració'!$E18>0,IF(CàlculsEV!G17>0,1,\"No\"),\"\")","v":1},{"$f":"IF('II_Plantejar Ració'!$E18>0,IF(CàlculsEV!H17=0,\"No\",1),\"\")","v":1},{"$f":"IF('II_Plantejar Ració'!$E18>0,IF(CàlculsEV!I17>0,1,\"No\"),\"\")","v":1},{"$f":"IF('II_Plantejar Ració'!$E18>0,IF(CàlculsEV!J17>0,1,\"No\"),\"\")","v":1},{"$f":"IF('II_Plantejar Ració'!$E18>0,IF(CàlculsEV!K17>0,1,\"No\"),\"\")","v":1},{"$f":"IF('II_Plantejar Ració'!$E18>0,IF(CàlculsEV!L17>0,1,\"No\"),\"\")","v":1},{"$f":"IF('II_Plantejar Ració'!$E18>0,IF(CàlculsEV!M17>0,1,\"No\"),\"\")","v":1},{"$f":"IF('II_Plantejar Ració'!$E18>0,IF(CàlculsEV!N17>0,1,\"No\"),\"\")","v":1},{"$f":"IF('II_Plantejar Ració'!$E18>0,IF(CàlculsEV!O17>0,1,\"No\"),\"\")","v":1},{"$f":"IF('II_Plantejar Ració'!$E18>0,IF(CàlculsEV!P17>0,1,\"No\"),\"\")","v":1},{"$f":"IF('II_Plantejar Ració'!$E18>0,IF(CàlculsEV!Q17>0,1,\"No\"),\"\")","v":1},{"$f":"IF('II_Plantejar Ració'!$E18>0,IF(CàlculsEV!R17>0,1,\"No\"),\"\")","v":1},{"$f":"IF('II_Plantejar Ració'!$E18>0,IF(CàlculsEV!S17>0,1,\"No\"),\"\")","v":1},{"$f":"IF('II_Plantejar Ració'!$E18>0,IF(CàlculsEV!T17>0,1,\"No\"),\"\")","v":1},{"$f":"IF('II_Plantejar Ració'!$E18>0,IF(CàlculsEV!U17>0,1,\"No\"),\"\")","v":1},{"$f":"IF('II_Plantejar Ració'!$E18>0,IF(CàlculsEV!V17>0,1,\"No\"),\"\")","v":1},{"$f":"IF('II_Plantejar Ració'!$E18>0,IF(CàlculsEV!W17>0,1,\"No\"),\"\")","v":1},{"$f":"IF('II_Plantejar Ració'!$E18>0,IF(CàlculsEV!X17>0,1,\"No\"),\"\")","v":1},{"$f":"IF('II_Plantejar Ració'!$E18>0,IF(CàlculsEV!Y17>0,1,\"No\"),\"\")","v":1},{"$f":"IF('II_Plantejar Ració'!$E18>0,IF(CàlculsEV!Z17>0,1,\"No\"),\"\")","v":1},{"$f":"IF('II_Plantejar Ració'!$E18>0,IF(CàlculsEV!AA17>0,1,\"No\"),\"\")","v":1},{"$f":"IF('II_Plantejar Ració'!$E18>0,IF(CàlculsEV!AB17>0,1,\"No\"),\"\")","v":1},{"$f":"IF('II_Plantejar Ració'!$E18>0,IF(CàlculsEV!AC17>0,1,\"No\"),\"\")","v":1},{"$f":"IF('II_Plantejar Ració'!$E18>0,IF(CàlculsEV!AD17>0,1,\"No\"),\"\")","v":1},{"$f":"IF('II_Plantejar Ració'!$E18>0,IF(CàlculsEV!AE17>0,1,\"No\"),\"\")","v":1},{"$f":"IF('II_Plantejar Ració'!$E18>0,IF(CàlculsEV!AF17>0,1,\"No\"),\"\")","v":1},{"$f":"IF('II_Plantejar Ració'!$E18>0,IF(CàlculsEV!AG17>0,1,\"No\"),\"\")","v":1},{"$f":"IF('II_Plantejar Ració'!$E18>0,IF(CàlculsEV!AH17>0,1,\"No\"),\"\")","v":1},{"$f":"IF('II_Plantejar Ració'!$E18>0,IF(CàlculsEV!AI17>0,1,\"No\"),\"\")","v":1},{"$f":"IF('II_Plantejar Ració'!$E18>0,IF(CàlculsEV!AJ17>0,1,\"No\"),\"\")","v":1},{"$f":"IF('II_Plantejar Ració'!$E18>0,IF(CàlculsEV!AK17>0,1,\"No\"),\"\")","v":1},{"$f":"IF('II_Plantejar Ració'!$E18>0,IF(CàlculsEV!AL17>0,1,\"No\"),\"\")","v":"No"},{"$f":"IF('II_Plantejar Ració'!$E18>0,IF(CàlculsEV!AM17>0,1,\"No\"),\"\")","v":"No"},1,1,1,1,1,1,1,1,1,1,1,1,1,1,1,1,1,1,1,1,1,1,1,1,1,1,1,1,1,1,1,1,1,1,1]
[null,{"$f":"IF(OFFSET('Taula Concentrats'!$A$1,C18,0,1,1)=0,\"\",OFFSET('Taula Concentrats'!$A$1,C18,0,1,1))","v":"Urea"},76,{"$f":"OFFSET('Taula Concentrats'!$A$1,$C18,$D$2,1,1)","v":99},{"$f":"OFFSET('Taula Concentrats'!$A$1,$C18,$E$2,1,1)","v":0},{"$f":"OFFSET('Taula Concentrats'!$A$1,$C18,$F$2,1,1)","v":0.26},{"$f":"OFFSET('Taula Concentrats'!$A$1,$C18,$G$2,1,1)","v":71},{"$f":"OFFSET('Taula Concentrats'!$A$1,$C18,$H$2,1,1)","v":2557},{"$f":"OFFSET('Taula Concentrats'!$A$1,$C18,$I$2,1,1)","v":2},{"$f":"OFFSET('Taula Concentrats'!$A$1,$C18,$J$2,1,1)","v":9.9999999999999995E-7},{"$f":"OFFSET('Taula Concentrats'!$A$1,$C18,$K$2,1,1)","v":9.9999999999999995E-7},{"$f":"OFFSET('Taula Concentrats'!$A$1,$C18,$L$2,1,1)","v":9.9999999999999995E-7},{"$f":"OFFSET('Taula Concentrats'!$A$1,$C18,$M$2,1,1)","v":9.9999999999999995E-7},{"$f":"OFFSET('Taula Concentrats'!$A$1,$C18,$N$2,1,1)","v":9.9999999999999995E-7},{"$f":"OFFSET('Taula Concentrats'!$A$1,$C18,$O$2,1,1)","v":9.9999999999999995E-7},{"$f":"OFFSET('Taula Concentrats'!$A$1,$C18,$P$2,1,1)","v":9.9999999999999995E-7},{"$f":"OFFSET('Taula Concentrats'!$A$1,$C18,$Q$2,1,1)","v":9.9999999999999995E-7},{"$f":"OFFSET('Taula Concentrats'!$A$1,$C18,$R$2,1,1)","v":9.9999999999999995E-7},{"$f":"OFFSET('Taula Concentrats'!$A$1,$C18,$S$2,1,1)","v":9.9999999999999995E-7},{"$f":"OFFSET('Taula Concentrats'!$A$1,$C18,$T$2,1,1)","v":9.9999999999999995E-7},{"$f":"OFFSET('Taula Concentrats'!$A$1,$C18,$U$2,1,1)","v":9.9999999999999995E-7},{"$f":"OFFSET('Taula Concentrats'!$A$1,$C18,$V$2,1,1)","v":9.9999999999999995E-7},{"$f":"OFFSET('Taula Concentrats'!$A$1,$C18,$W$2,1,1)","v":9.9999999999999995E-7},{"$f":"OFFSET('Taula Concentrats'!$A$1,$C18,$X$2,1,1)","v":9.9999999999999995E-7},{"$f":"OFFSET('Taula Concentrats'!$A$1,$C18,$Y$2,1,1)","v":9.9999999999999995E-7},{"$f":"OFFSET('Taula Concentrats'!$A$1,$C18,$Z$2,1,1)","v":0},{"$f":"OFFSET('Taula Concentrats'!$A$1,$C18,$AA$2,1,1)","v":2870},{"$f":"OFFSET('Taula Concentrats'!$A$1,$C18,$AB$2,1,1)","v":9.9999999999999995E-7},{"$f":"OFFSET('Taula Concentrats'!$A$1,$C18,$AC$2,1,1)","v":0.99},{"$f":"OFFSET('Taula Concentrats'!$A$1,$C18,$AD$2,1,1)","v":9.9999999999999995E-7},{"$f":"OFFSET('Taula Concentrats'!$A$1,$C18,$AE$2,1,1)","v":9.9999999999999995E-7},{"$f":"OFFSET('Taula Concentrats'!$A$1,$C18,$AF$2,1,1)","v":9.9999999999999995E-7},{"$f":"OFFSET('Taula Concentrats'!$A$1,$C18,$AG$2,1,1)","v":9.9999999999999995E-7},{"$f":"OFFSET('Taula Concentrats'!$A$1,$C18,$AH$2,1,1)","v":9.9999999999999995E-7},{"$f":"OFFSET('Taula Concentrats'!$A$1,$C18,$AI$2,1,1)","v":9.9999999999999995E-7},{"$f":"OFFSET('Taula Concentrats'!$A$1,$C18,$AJ$2,1,1)","v":9.9999999999999995E-7},{"$f":"OFFSET('Taula Concentrats'!$A$1,$C18,$AK$2,1,1)","v":9.9999999999999995E-7},{"$f":"OFFSET('Taula Concentrats'!$A$1,$C18,$AL$2,1,1)","v":0},{"$f":"OFFSET('Taula Concentrats'!$A$1,$C18,$AM$2,1,1)","v":0},{"$f":"IF('II_Plantejar Ració'!$E19>0,IF(CàlculsEV!E18>=0,1,\"No\"),\"\")","v":1},{"$f":"IF('II_Plantejar Ració'!$E19>0,IF(CàlculsEV!F18>0,1,\"No\"),\"\")","v":1},{"$f":"IF('II_Plantejar Ració'!$E19>0,IF(CàlculsEV!G18>0,1,\"No\"),\"\")","v":1},{"$f":"IF('II_Plantejar Ració'!$E19>0,IF(CàlculsEV!H18=0,\"No\",1),\"\")","v":1},{"$f":"IF('II_Plantejar Ració'!$E19>0,IF(CàlculsEV!I18>0,1,\"No\"),\"\")","v":1},{"$f":"IF('II_Plantejar Ració'!$E19>0,IF(CàlculsEV!J18>0,1,\"No\"),\"\")","v":1},{"$f":"IF('II_Plantejar Ració'!$E19>0,IF(CàlculsEV!K18>0,1,\"No\"),\"\")","v":1},{"$f":"IF('II_Plantejar Ració'!$E19>0,IF(CàlculsEV!L18>0,1,\"No\"),\"\")","v":1},{"$f":"IF('II_Plantejar Ració'!$E19>0,IF(CàlculsEV!M18>0,1,\"No\"),\"\")","v":1},{"$f":"IF('II_Plantejar Ració'!$E19>0,IF(CàlculsEV!N18>0,1,\"No\"),\"\")","v":1},{"$f":"IF('II_Plantejar Ració'!$E19>0,IF(CàlculsEV!O18>0,1,\"No\"),\"\")","v":1},{"$f":"IF('II_Plantejar Ració'!$E19>0,IF(CàlculsEV!P18>0,1,\"No\"),\"\")","v":1},{"$f":"IF('II_Plantejar Ració'!$E19>0,IF(CàlculsEV!Q18>0,1,\"No\"),\"\")","v":1},{"$f":"IF('II_Plantejar Ració'!$E19>0,IF(CàlculsEV!R18>0,1,\"No\"),\"\")","v":1},{"$f":"IF('II_Plantejar Ració'!$E19>0,IF(CàlculsEV!S18>0,1,\"No\"),\"\")","v":1},{"$f":"IF('II_Plantejar Ració'!$E19>0,IF(CàlculsEV!T18>0,1,\"No\"),\"\")","v":1},{"$f":"IF('II_Plantejar Ració'!$E19>0,IF(CàlculsEV!U18>0,1,\"No\"),\"\")","v":1},{"$f":"IF('II_Plantejar Ració'!$E19>0,IF(CàlculsEV!V18>0,1,\"No\"),\"\")","v":1},{"$f":"IF('II_Plantejar Ració'!$E19>0,IF(CàlculsEV!W18>0,1,\"No\"),\"\")","v":1},{"$f":"IF('II_Plantejar Ració'!$E19>0,IF(CàlculsEV!X18>0,1,\"No\"),\"\")","v":1},{"$f":"IF('II_Plantejar Ració'!$E19>0,IF(CàlculsEV!Y18>0,1,\"No\"),\"\")","v":1},{"$f":"IF('II_Plantejar Ració'!$E19>0,IF(CàlculsEV!Z18>0,1,\"No\"),\"\")","v":"No"},{"$f":"IF('II_Plantejar Ració'!$E19>0,IF(CàlculsEV!AA18>0,1,\"No\"),\"\")","v":1},{"$f":"IF('II_Plantejar Ració'!$E19>0,IF(CàlculsEV!AB18>0,1,\"No\"),\"\")","v":1},{"$f":"IF('II_Plantejar Ració'!$E19>0,IF(CàlculsEV!AC18>0,1,\"No\"),\"\")","v":1},{"$f":"IF('II_Plantejar Ració'!$E19>0,IF(CàlculsEV!AD18>0,1,\"No\"),\"\")","v":1},{"$f":"IF('II_Plantejar Ració'!$E19>0,IF(CàlculsEV!AE18>0,1,\"No\"),\"\")","v":1},{"$f":"IF('II_Plantejar Ració'!$E19>0,IF(CàlculsEV!AF18>0,1,\"No\"),\"\")","v":1},{"$f":"IF('II_Plantejar Ració'!$E19>0,IF(CàlculsEV!AG18>0,1,\"No\"),\"\")","v":1},{"$f":"IF('II_Plantejar Ració'!$E19>0,IF(CàlculsEV!AH18>0,1,\"No\"),\"\")","v":1},{"$f":"IF('II_Plantejar Ració'!$E19>0,IF(CàlculsEV!AI18>0,1,\"No\"),\"\")","v":1},{"$f":"IF('II_Plantejar Ració'!$E19>0,IF(CàlculsEV!AJ18>0,1,\"No\"),\"\")","v":1},{"$f":"IF('II_Plantejar Ració'!$E19>0,IF(CàlculsEV!AK18>0,1,\"No\"),\"\")","v":1},{"$f":"IF('II_Plantejar Ració'!$E19>0,IF(CàlculsEV!AL18>0,1,\"No\"),\"\")","v":"No"},{"$f":"IF('II_Plantejar Ració'!$E19>0,IF(CàlculsEV!AM18>0,1,\"No\"),\"\")","v":"No"},1,1,1,1,1,1,1,1,1,1,1,1,1,1,1,1,1,1,1,1,1,1,1,1,1,1,1,1,1,1,1,1,1,1,1]
[null,{"$f":"IF(OFFSET('Taula Concentrats'!$A$1,C19,0,1,1)=0,\"\",OFFSET('Taula Concentrats'!$A$1,C19,0,1,1))","v":""},1,{"$f":"OFFSET('Taula Concentrats'!$A$1,$C19,$D$2,1,1)","v":0},{"$f":"OFFSET('Taula Concentrats'!$A$1,$C19,$E$2,1,1)","v":0},{"$f":"OFFSET('Taula Concentrats'!$A$1,$C19,$F$2,1,1)","v":0},{"$f":"OFFSET('Taula Concentrats'!$A$1,$C19,$G$2,1,1)","v":0},{"$f":"OFFSET('Taula Concentrats'!$A$1,$C19,$H$2,1,1)","v":0},{"$f":"OFFSET('Taula Concentrats'!$A$1,$C19,$I$2,1,1)","v":0},{"$f":"OFFSET('Taula Concentrats'!$A$1,$C19,$J$2,1,1)","v":0},{"$f":"OFFSET('Taula Concentrats'!$A$1,$C19,$K$2,1,1)","v":0},{"$f":"OFFSET('Taula Concentrats'!$A$1,$C19,$L$2,1,1)","v":0},{"$f":"OFFSET('Taula Concentrats'!$A$1,$C19,$M$2,1,1)","v":0},{"$f":"OFFSET('Taula Concentrats'!$A$1,$C19,$N$2,1,1)","v":0},{"$f":"OFFSET('Taula Concentrats'!$A$1,$C19,$O$2,1,1)","v":0},{"$f":"OFFSET('Taula Concentrats'!$A$1,$C19,$P$2,1,1)","v":0},{"$f":"OFFSET('Taula Concentrats'!$A$1,$C19,$Q$2,1,1)","v":0},{"$f":"OFFSET('Taula Concentrats'!$A$1,$C19,$R$2,1,1)","v":0},{"$f":"OFFSET('Taula Concentrats'!$A$1,$C19,$S$2,1,1)","v":0},{"$f":"OFFSET('Taula Concentrats'!$A$1,$C19,$T$2,1,1)","v":0},{"$f":"OFFSET('Taula Concentrats'!$A$1,$C19,$U$2,1,1)","v":0},{"$f":"OFFSET('Taula Concentrats'!$A$1,$C19,$V$2,1,1)","v":0},{"$f":"OFFSET('Taula Concentrats'!$A$1,$C19,$W$2,1,1)","v":0},{"$f":"OFFSET('Taula Concentrats'!$A$1,$C19,$X$2,1,1)","v":0},{"$f":"OFFSET('Taula Concentrats'!$A$1,$C19,$Y$2,1,1)","v":0},{"$f":"OFFSET('Taula Concentrats'!$A$1,$C19,$Z$2,1,1)","v":0},{"$f":"OFFSET('Taula Concentrats'!$A$1,$C19,$AA$2,1,1)","v":0},{"$f":"OFFSET('Taula Concentrats'!$A$1,$C19,$AB$2,1,1)","v":0},{"$f":"OFFSET('Taula Concentrats'!$A$1,$C19,$AC$2,1,1)","v":0},{"$f":"OFFSET('Taula Concentrats'!$A$1,$C19,$AD$2,1,1)","v":0},{"$f":"OFFSET('Taula Concentrats'!$A$1,$C19,$AE$2,1,1)","v":0},{"$f":"OFFSET('Taula Concentrats'!$A$1,$C19,$AF$2,1,1)","v":0},{"$f":"OFFSET('Taula Concentrats'!$A$1,$C19,$AG$2,1,1)","v":0},{"$f":"OFFSET('Taula Concentrats'!$A$1,$C19,$AH$2,1,1)","v":0},{"$f":"OFFSET('Taula Concentrats'!$A$1,$C19,$AI$2,1,1)","v":0},{"$f":"OFFSET('Taula Concentrats'!$A$1,$C19,$AJ$2,1,1)","v":0},{"$f":"OFFSET('Taula Concentrats'!$A$1,$C19,$AK$2,1,1)","v":0},{"$f":"OFFSET('Taula Concentrats'!$A$1,$C19,$AL$2,1,1)","v":0},{"$f":"OFFSET('Taula Concentrats'!$A$1,$C19,$AM$2,1,1)","v":0},{"$f":"IF('II_Plantejar Ració'!$E20>0,IF(CàlculsEV!E19>=0,1,\"No\"),\"\")","v":""},{"$f":"IF('II_Plantejar Ració'!$E20>0,IF(CàlculsEV!F19>0,1,\"No\"),\"\")","v":""},{"$f":"IF('II_Plantejar Ració'!$E20>0,IF(CàlculsEV!G19>0,1,\"No\"),\"\")","v":""},{"$f":"IF('II_Plantejar Ració'!$E20>0,IF(CàlculsEV!H19=0,\"No\",1),\"\")","v":""},{"$f":"IF('II_Plantejar Ració'!$E20>0,IF(CàlculsEV!I19>0,1,\"No\"),\"\")","v":""},{"$f":"IF('II_Plantejar Ració'!$E20>0,IF(CàlculsEV!J19>0,1,\"No\"),\"\")","v":""},{"$f":"IF('II_Plantejar Ració'!$E20>0,IF(CàlculsEV!K19>0,1,\"No\"),\"\")","v":""},{"$f":"IF('II_Plantejar Ració'!$E20>0,IF(CàlculsEV!L19>0,1,\"No\"),\"\")","v":""},{"$f":"IF('II_Plantejar Ració'!$E20>0,IF(CàlculsEV!M19>0,1,\"No\"),\"\")","v":""},{"$f":"IF('II_Plantejar Ració'!$E20>0,IF(CàlculsEV!N19>0,1,\"No\"),\"\")","v":""},{"$f":"IF('II_Plantejar Ració'!$E20>0,IF(CàlculsEV!O19>0,1,\"No\"),\"\")","v":""},{"$f":"IF('II_Plantejar Ració'!$E20>0,IF(CàlculsEV!P19>0,1,\"No\"),\"\")","v":""},{"$f":"IF('II_Plantejar Ració'!$E20>0,IF(CàlculsEV!Q19>0,1,\"No\"),\"\")","v":""},{"$f":"IF('II_Plantejar Ració'!$E20>0,IF(CàlculsEV!R19>0,1,\"No\"),\"\")","v":""},{"$f":"IF('II_Plantejar Ració'!$E20>0,IF(CàlculsEV!S19>0,1,\"No\"),\"\")","v":""},{"$f":"IF('II_Plantejar Ració'!$E20>0,IF(CàlculsEV!T19>0,1,\"No\"),\"\")","v":""},{"$f":"IF('II_Plantejar Ració'!$E20>0,IF(CàlculsEV!U19>0,1,\"No\"),\"\")","v":""},{"$f":"IF('II_Plantejar Ració'!$E20>0,IF(CàlculsEV!V19>0,1,\"No\"),\"\")","v":""},{"$f":"IF('II_Plantejar Ració'!$E20>0,IF(CàlculsEV!W19>0,1,\"No\"),\"\")","v":""},{"$f":"IF('II_Plantejar Ració'!$E20>0,IF(CàlculsEV!X19>0,1,\"No\"),\"\")","v":""},{"$f":"IF('II_Plantejar Ració'!$E20>0,IF(CàlculsEV!Y19>0,1,\"No\"),\"\")","v":""},{"$f":"IF('II_Plantejar Ració'!$E20>0,IF(CàlculsEV!Z19>0,1,\"No\"),\"\")","v":""},{"$f":"IF('II_Plantejar Ració'!$E20>0,IF(CàlculsEV!AA19>0,1,\"No\"),\"\")","v":""},{"$f":"IF('II_Plantejar Ració'!$E20>0,IF(CàlculsEV!AB19>0,1,\"No\"),\"\")","v":""},{"$f":"IF('II_Plantejar Ració'!$E20>0,IF(CàlculsEV!AC19>0,1,\"No\"),\"\")","v":""},{"$f":"IF('II_Plantejar Ració'!$E20>0,IF(CàlculsEV!AD19>0,1,\"No\"),\"\")","v":""},{"$f":"IF('II_Plantejar Ració'!$E20>0,IF(CàlculsEV!AE19>0,1,\"No\"),\"\")","v":""},{"$f":"IF('II_Plantejar Ració'!$E20>0,IF(CàlculsEV!AF19>0,1,\"No\"),\"\")","v":""},{"$f":"IF('II_Plantejar Ració'!$E20>0,IF(CàlculsEV!AG19>0,1,\"No\"),\"\")","v":""},{"$f":"IF('II_Plantejar Ració'!$E20>0,IF(CàlculsEV!AH19>0,1,\"No\"),\"\")","v":""},{"$f":"IF('II_Plantejar Ració'!$E20>0,IF(CàlculsEV!AI19>0,1,\"No\"),\"\")","v":""},{"$f":"IF('II_Plantejar Ració'!$E20>0,IF(CàlculsEV!AJ19>0,1,\"No\"),\"\")","v":""},{"$f":"IF('II_Plantejar Ració'!$E20>0,IF(CàlculsEV!AK19>0,1,\"No\"),\"\")","v":""},{"$f":"IF('II_Plantejar Ració'!$E20>0,IF(CàlculsEV!AL19>0,1,\"No\"),\"\")","v":""},{"$f":"IF('II_Plantejar Ració'!$E20>0,IF(CàlculsEV!AM19>0,1,\"No\"),\"\")","v":""},0,0,0,0,0,0,0,0,0,0,0,0,0,0,0,0,0,0,0,0,0,0,0,0,0,0,0,0,0,0,0,0,0,0,0]
["MINERALS",{"$f":"IF(OFFSET('Taula Minerals-aa'!$A$1,C20,0,1,1)=0,\"\",OFFSET('Taula Minerals-aa'!$A$1,C20,0,1,1))","v":"Carbonat de cobalt"},10,{"$f":"OFFSET('Taula Minerals-aa'!$A$1,$C20,D2,1,1)","v":100},{"$f":"OFFSET('Taula Minerals-aa'!$A$1,$C20,E2,1,1)","v":0},{"$f":"OFFSET('Taula Minerals-aa'!$A$1,$C20,F2,1,1)","v":0},{"$f":"OFFSET('Taula Minerals-aa'!$A$1,$C20,G2,1,1)","v":0},{"$f":"OFFSET('Taula Minerals-aa'!$A$1,$C20,H2,1,1)","v":0},{"$f":"OFFSET('Taula Minerals-aa'!$A$1,$C20,I2,1,1)","v":0},{"$f":"OFFSET('Taula Minerals-aa'!$A$1,$C20,J2,1,1)","v":0},{"$f":"OFFSET('Taula Minerals-aa'!$A$1,$C20,K2,1,1)","v":0},{"$f":"OFFSET('Taula Minerals-aa'!$A$1,$C20,L$2,1,1)","v":0},{"$f":"OFFSET('Taula Minerals-aa'!$A$1,$C20,M$2,1,1)","v":0},{"$f":"OFFSET('Taula Minerals-aa'!$A$1,$C20,N$2,1,1)","v":0},{"$f":"OFFSET('Taula Minerals-aa'!$A$1,$C20,O$2,1,1)","v":0},{"$f":"OFFSET('Taula Minerals-aa'!$A$1,$C20,P$2,1,1)","v":0},{"$f":"OFFSET('Taula Minerals-aa'!$A$1,$C20,Q$2,1,1)","v":49},{"$f":"OFFSET('Taula Minerals-aa'!$A$1,$C20,R$2,1,1)","v":0},{"$f":"OFFSET('Taula Minerals-aa'!$A$1,$C20,S$2,1,1)","v":0},{"$f":"OFFSET('Taula Minerals-aa'!$A$1,$C20,T$2,1,1)","v":0},{"$f":"OFFSET('Taula Minerals-aa'!$A$1,$C20,U$2,1,1)","v":0},{"$f":"OFFSET('Taula Minerals-aa'!$A$1,$C20,V$2,1,1)","v":0},{"$f":"OFFSET('Taula Minerals-aa'!$A$1,$C20,W$2,1,1)","v":0},{"$f":"OFFSET('Taula Minerals-aa'!$A$1,$C20,X$2,1,1)","v":0},{"$f":"OFFSET('Taula Minerals-aa'!$A$1,$C20,Y$2,1,1)","v":0},{"$f":"OFFSET('Taula Minerals-aa'!$A$1,$C20,Z$2,1,1)","v":0},{"$f":"OFFSET('Taula Minerals-aa'!$A$1,$C20,AA$2,1,1)","v":0},{"$f":"OFFSET('Taula Minerals-aa'!$A$1,$C20,AB$2,1,1)","v":0},{"$f":"OFFSET('Taula Minerals-aa'!$A$1,$C20,AC$2,1,1)","v":0},{"$f":"OFFSET('Taula Minerals-aa'!$A$1,$C20,AD$2,1,1)","v":0},{"$f":"OFFSET('Taula Minerals-aa'!$A$1,$C20,AE$2,1,1)","v":0},{"$f":"OFFSET('Taula Minerals-aa'!$A$1,$C20,AF$2,1,1)","v":0},{"$f":"OFFSET('Taula Minerals-aa'!$A$1,$C20,AG$2,1,1)","v":0},{"$f":"OFFSET('Taula Minerals-aa'!$A$1,$C20,AH$2,1,1)","v":0},{"$f":"OFFSET('Taula Minerals-aa'!$A$1,$C20,AI$2,1,1)","v":0},{"$f":"OFFSET('Taula Minerals-aa'!$A$1,$C20,AJ$2,1,1)","v":0},{"$f":"OFFSET('Taula Minerals-aa'!$A$1,$C20,AK$2,1,1)","v":0},{"$f":"OFFSET('Taula Minerals-aa'!$A$1,$C20,AL$2,1,1)","v":0},{"$f":"OFFSET('Taula Minerals-aa'!$A$1,$C20,AM$2,1,1)","v":0},{"$f":"SUM(AN3:AN19)","v":6},6,6,6,6,6,6,5,4,4,2,2,4,4,4,4,2,4,4,3,5,5,6,6,6,6,6,6,6,6,6,6,4,4,4,{"$f":"SUM(BW3:BW19)","v":6},6,6,6,6,6,6,6,6,6,6,6,6,6,6,6,6,6,6,6,6,6,6,6,6,6,6,6,6,{"$f":"SUM(CZ3:CZ19)","v":6},6,6,6,6,6]
[null,{"$f":"IF(OFFSET('Taula Minerals-aa'!$A$1,C21,0,1,1)=0,\"\",OFFSET('Taula Minerals-aa'!$A$1,C21,0,1,1))","v":"Fosfat bicàlcic"},3,{"$f":"OFFSET('Taula Minerals-aa'!$A$1,$C21,D2,1,1)","v":98.8},{"$f":"OFFSET('Taula Minerals-aa'!$A$1,$C21,E2,1,1)","v":0},{"$f":"OFFSET('Taula Minerals-aa'!$A$1,$C21,F2,1,1)","v":0},{"$f":"OFFSET('Taula Minerals-aa'!$A$1,$C21,G2,1,1)","v":0},{"$f":"OFFSET('Taula Minerals-aa'!$A$1,$C21,H2,1,1)","v":0},{"$f":"OFFSET('Taula Minerals-aa'!$A$1,$C21,I2,1,1)","v":0},{"$f":"OFFSET('Taula Minerals-aa'!$A$1,$C21,J2,1,1)","v":244},{"$f":"OFFSET('Taula Minerals-aa'!$A$1,$C21,K2,1,1)","v":122.4},{"$f":"OFFSET('Taula Minerals-aa'!$A$1,$C21,L$2,1,1)","v":5},{"$f":"OFFSET('Taula Minerals-aa'!$A$1,$C21,M$2,1,1)","v":1.2},{"$f":"OFFSET('Taula Minerals-aa'!$A$1,$C21,N$2,1,1)","v":0.8},{"$f":"OFFSET('Taula Minerals-aa'!$A$1,$C21,O$2,1,1)","v":11},{"$f":"OFFSET('Taula Minerals-aa'!$A$1,$C21,P$2,1,1)","v":0.4},{"$f":"OFFSET('Taula Minerals-aa'!$A$1,$C21,Q$2,1,1)","v":0},{"$f":"OFFSET('Taula Minerals-aa'!$A$1,$C21,R$2,1,1)","v":15},{"$f":"OFFSET('Taula Minerals-aa'!$A$1,$C21,S$2,1,1)","v":0},{"$f":"OFFSET('Taula Minerals-aa'!$A$1,$C21,T$2,1,1)","v":0},{"$f":"OFFSET('Taula Minerals-aa'!$A$1,$C21,U$2,1,1)","v":0},{"$f":"OFFSET('Taula Minerals-aa'!$A$1,$C21,V$2,1,1)","v":0},{"$f":"OFFSET('Taula Minerals-aa'!$A$1,$C21,W$2,1,1)","v":0},{"$f":"OFFSET('Taula Minerals-aa'!$A$1,$C21,X$2,1,1)","v":0},{"$f":"OFFSET('Taula Minerals-aa'!$A$1,$C21,Y$2,1,1)","v":0},{"$f":"OFFSET('Taula Minerals-aa'!$A$1,$C21,Z$2,1,1)","v":0},{"$f":"OFFSET('Taula Minerals-aa'!$A$1,$C21,AA$2,1,1)","v":0},{"$f":"OFFSET('Taula Minerals-aa'!$A$1,$C21,AB$2,1,1)","v":0},{"$f":"OFFSET('Taula Minerals-aa'!$A$1,$C21,AC$2,1,1)","v":0},{"$f":"OFFSET('Taula Minerals-aa'!$A$1,$C21,AD$2,1,1)","v":0},{"$f":"OFFSET('Taula Minerals-aa'!$A$1,$C21,AE$2,1,1)","v":0},{"$f":"OFFSET('Taula Minerals-aa'!$A$1,$C21,AF$2,1,1)","v":0},{"$f":"OFFSET('Taula Minerals-aa'!$A$1,$C21,AG$2,1,1)","v":0},{"$f":"OFFSET('Taula Minerals-aa'!$A$1,$C21,AH$2,1,1)","v":0},{"$f":"OFFSET('Taula Minerals-aa'!$A$1,$C21,AI$2,1,1)","v":0},{"$f":"OFFSET('Taula Minerals-aa'!$A$1,$C21,AJ$2,1,1)","v":836},{"$f":"OFFSET('Taula Minerals-aa'!$A$1,$C21,AK$2,1,1)","v":0},{"$f":"OFFSET('Taula Minerals-aa'!$A$1,$C21,AL$2,1,1)","v":0},{"$f":"OFFSET('Taula Minerals-aa'!$A$1,$C21,AM$2,1,1)","v":0},{"$f":"IF(AN20/BW20=1,\"\",AN2)","v":""},"","","","","","",{"$f":"IF(AU20/CD20=1,\"\", AU2)","v":"Mg"},"K","Na","S","Cl","Co","Cu","Mn","Zn","Iode","Se","Vit A","Vit D","Vit E","AG","","","","","","","","","","","Mo","DT_N","MOF"]
[null,{"$f":"IF(OFFSET('Taula Minerals-aa'!$A$1,C22,0,1,1)=0,\"\",OFFSET('Taula Minerals-aa'!$A$1,C22,0,1,1))","v":"Carbonat càlcic"},2,{"$f":"OFFSET('Taula Minerals-aa'!$A$1,$C22,D2,1,1)","v":98},{"$f":"OFFSET('Taula Minerals-aa'!$A$1,$C22,E2,1,1)","v":0},{"$f":"OFFSET('Taula Minerals-aa'!$A$1,$C22,F2,1,1)","v":0},{"$f":"OFFSET('Taula Minerals-aa'!$A$1,$C22,G2,1,1)","v":0},{"$f":"OFFSET('Taula Minerals-aa'!$A$1,$C22,H2,1,1)","v":0},{"$f":"OFFSET('Taula Minerals-aa'!$A$1,$C22,I2,1,1)","v":0},{"$f":"OFFSET('Taula Minerals-aa'!$A$1,$C22,J2,1,1)","v":145.54},{"$f":"OFFSET('Taula Minerals-aa'!$A$1,$C22,K2,1,1)","v":0},{"$f":"OFFSET('Taula Minerals-aa'!$A$1,$C22,L$2,1,1)","v":14},{"$f":"OFFSET('Taula Minerals-aa'!$A$1,$C22,M$2,1,1)","v":0.7},{"$f":"OFFSET('Taula Minerals-aa'!$A$1,$C22,N$2,1,1)","v":0.7},{"$f":"OFFSET('Taula Minerals-aa'!$A$1,$C22,O$2,1,1)","v":0.7},{"$f":"OFFSET('Taula Minerals-aa'!$A$1,$C22,P$2,1,1)","v":0.2},{"$f":"OFFSET('Taula Minerals-aa'!$A$1,$C22,Q$2,1,1)","v":0},{"$f":"OFFSET('Taula Minerals-aa'!$A$1,$C22,R$2,1,1)","v":12},{"$f":"OFFSET('Taula Minerals-aa'!$A$1,$C22,S$2,1,1)","v":0},{"$f":"OFFSET('Taula Minerals-aa'!$A$1,$C22,T$2,1,1)","v":0},{"$f":"OFFSET('Taula Minerals-aa'!$A$1,$C22,U$2,1,1)","v":0},{"$f":"OFFSET('Taula Minerals-aa'!$A$1,$C22,V$2,1,1)","v":0},{"$f":"OFFSET('Taula Minerals-aa'!$A$1,$C22,W$2,1,1)","v":0},{"$f":"OFFSET('Taula Minerals-aa'!$A$1,$C22,X$2,1,1)","v":0},{"$f":"OFFSET('Taula Minerals-aa'!$A$1,$C22,Y$2,1,1)","v":0},{"$f":"OFFSET('Taula Minerals-aa'!$A$1,$C22,Z$2,1,1)","v":0},{"$f":"OFFSET('Taula Minerals-aa'!$A$1,$C22,AA$2,1,1)","v":0},{"$f":"OFFSET('Taula Minerals-aa'!$A$1,$C22,AB$2,1,1)","v":0},{"$f":"OFFSET('Taula Minerals-aa'!$A$1,$C22,AC$2,1,1)","v":0},{"$f":"OFFSET('Taula Minerals-aa'!$A$1,$C22,AD$2,1,1)","v":0},{"$f":"OFFSET('Taula Minerals-aa'!$A$1,$C22,AE$2,1,1)","v":0},{"$f":"OFFSET('Taula Minerals-aa'!$A$1,$C22,AF$2,1,1)","v":0},{"$f":"OFFSET('Taula Minerals-aa'!$A$1,$C22,AG$2,1,1)","v":0},{"$f":"OFFSET('Taula Minerals-aa'!$A$1,$C22,AH$2,1,1)","v":0},{"$f":"OFFSET('Taula Minerals-aa'!$A$1,$C22,AI$2,1,1)","v":0},{"$f":"OFFSET('Taula Minerals-aa'!$A$1,$C22,AJ$2,1,1)","v":955},{"$f":"OFFSET('Taula Minerals-aa'!$A$1,$C22,AK$2,1,1)","v":0},{"$f":"OFFSET('Taula Minerals-aa'!$A$1,$C22,AL$2,1,1)","v":0},{"$f":"OFFSET('Taula Minerals-aa'!$A$1,$C22,AM$2,1,1)","v":0}]
[null,{"$f":"IF(OFFSET('Taula Minerals-aa'!$A$1,C23,0,1,1)=0,\"\",OFFSET('Taula Minerals-aa'!$A$1,C23,0,1,1))","v":"Fosfat sòdic"},7,{"$f":"OFFSET('Taula Minerals-aa'!$A$1,$C23,D2,1,1)","v":100},{"$f":"OFFSET('Taula Minerals-aa'!$A$1,$C23,E2,1,1)","v":0},{"$f":"OFFSET('Taula Minerals-aa'!$A$1,$C23,F2,1,1)","v":0},{"$f":"OFFSET('Taula Minerals-aa'!$A$1,$C23,G2,1,1)","v":0},{"$f":"OFFSET('Taula Minerals-aa'!$A$1,$C23,H2,1,1)","v":0},{"$f":"OFFSET('Taula Minerals-aa'!$A$1,$C23,I2,1,1)","v":0},{"$f":"OFFSET('Taula Minerals-aa'!$A$1,$C23,J2,1,1)","v":0},{"$f":"OFFSET('Taula Minerals-aa'!$A$1,$C23,K2,1,1)","v":13.600000000000001},{"$f":"OFFSET('Taula Minerals-aa'!$A$1,$C23,L$2,1,1)","v":0},{"$f":"OFFSET('Taula Minerals-aa'!$A$1,$C23,M$2,1,1)","v":0},{"$f":"OFFSET('Taula Minerals-aa'!$A$1,$C23,N$2,1,1)","v":19},{"$f":"OFFSET('Taula Minerals-aa'!$A$1,$C23,O$2,1,1)","v":0},{"$f":"OFFSET('Taula Minerals-aa'!$A$1,$C23,P$2,1,1)","v":0},{"$f":"OFFSET('Taula Minerals-aa'!$A$1,$C23,Q$2,1,1)","v":0},{"$f":"OFFSET('Taula Minerals-aa'!$A$1,$C23,R$2,1,1)","v":0},{"$f":"OFFSET('Taula Minerals-aa'!$A$1,$C23,S$2,1,1)","v":0},{"$f":"OFFSET('Taula Minerals-aa'!$A$1,$C23,T$2,1,1)","v":0},{"$f":"OFFSET('Taula Minerals-aa'!$A$1,$C23,U$2,1,1)","v":0},{"$f":"OFFSET('Taula Minerals-aa'!$A$1,$C23,V$2,1,1)","v":0},{"$f":"OFFSET('Taula Minerals-aa'!$A$1,$C23,W$2,1,1)","v":0},{"$f":"OFFSET('Taula Minerals-aa'!$A$1,$C23,X$2,1,1)","v":0},{"$f":"OFFSET('Taula Minerals-aa'!$A$1,$C23,Y$2,1,1)","v":0},{"$f":"OFFSET('Taula Minerals-aa'!$A$1,$C23,Z$2,1,1)","v":0},{"$f":"OFFSET('Taula Minerals-aa'!$A$1,$C23,AA$2,1,1)","v":0},{"$f":"OFFSET('Taula Minerals-aa'!$A$1,$C23,AB$2,1,1)","v":0},{"$f":"OFFSET('Taula Minerals-aa'!$A$1,$C23,AC$2,1,1)","v":0},{"$f":"OFFSET('Taula Minerals-aa'!$A$1,$C23,AD$2,1,1)","v":0},{"$f":"OFFSET('Taula Minerals-aa'!$A$1,$C23,AE$2,1,1)","v":0},{"$f":"OFFSET('Taula Minerals-aa'!$A$1,$C23,AF$2,1,1)","v":0},{"$f":"OFFSET('Taula Minerals-aa'!$A$1,$C23,AG$2,1,1)","v":0},{"$f":"OFFSET('Taula Minerals-aa'!$A$1,$C23,AH$2,1,1)","v":0},{"$f":"OFFSET('Taula Minerals-aa'!$A$1,$C23,AI$2,1,1)","v":0},{"$f":"OFFSET('Taula Minerals-aa'!$A$1,$C23,AJ$2,1,1)","v":0},{"$f":"OFFSET('Taula Minerals-aa'!$A$1,$C23,AK$2,1,1)","v":0},{"$f":"OFFSET('Taula Minerals-aa'!$A$1,$C23,AL$2,1,1)","v":0},{"$f":"OFFSET('Taula Minerals-aa'!$A$1,$C23,AM$2,1,1)","v":0}]
[null,{"$f":"IF(OFFSET('Taula Minerals-aa'!$A$1,C24,0,1,1)=0,\"\",OFFSET('Taula Minerals-aa'!$A$1,C24,0,1,1))","v":""},1,{"$f":"OFFSET('Taula Minerals-aa'!$A$1,$C24,D2,1,1)","v":0},{"$f":"OFFSET('Taula Minerals-aa'!$A$1,$C24,E2,1,1)","v":0},{"$f":"OFFSET('Taula Minerals-aa'!$A$1,$C24,F2,1,1)","v":0},{"$f":"OFFSET('Taula Minerals-aa'!$A$1,$C24,G2,1,1)","v":0},{"$f":"OFFSET('Taula Minerals-aa'!$A$1,$C24,H2,1,1)","v":0},{"$f":"OFFSET('Taula Minerals-aa'!$A$1,$C24,I2,1,1)","v":0},{"$f":"OFFSET('Taula Minerals-aa'!$A$1,$C24,J2,1,1)","v":0},{"$f":"OFFSET('Taula Minerals-aa'!$A$1,$C24,K2,1,1)","v":0},{"$f":"OFFSET('Taula Minerals-aa'!$A$1,$C24,L$2,1,1)","v":0},{"$f":"OFFSET('Taula Minerals-aa'!$A$1,$C24,M$2,1,1)","v":0},{"$f":"OFFSET('Taula Minerals-aa'!$A$1,$C24,N$2,1,1)","v":0},{"$f":"OFFSET('Taula Minerals-aa'!$A$1,$C24,O$2,1,1)","v":0},{"$f":"OFFSET('Taula Minerals-aa'!$A$1,$C24,P$2,1,1)","v":0},{"$f":"OFFSET('Taula Minerals-aa'!$A$1,$C24,Q$2,1,1)","v":0},{"$f":"OFFSET('Taula Minerals-aa'!$A$1,$C24,R$2,1,1)","v":0},{"$f":"OFFSET('Taula Minerals-aa'!$A$1,$C24,S$2,1,1)","v":0},{"$f":"OFFSET('Taula Minerals-aa'!$A$1,$C24,T$2,1,1)","v":0},{"$f":"OFFSET('Taula Minerals-aa'!$A$1,$C24,U$2,1,1)","v":0},{"$f":"OFFSET('Taula Minerals-aa'!$A$1,$C24,V$2,1,1)","v":0},{"$f":"OFFSET('Taula Minerals-aa'!$A$1,$C24,W$2,1,1)","v":0},{"$f":"OFFSET('Taula Minerals-aa'!$A$1,$C24,X$2,1,1)","v":0},{"$f":"OFFSET('Taula Minerals-aa'!$A$1,$C24,Y$2,1,1)","v":0},{"$f":"OFFSET('Taula Minerals-aa'!$A$1,$C24,Z$2,1,1)","v":0},{"$f":"OFFSET('Taula Minerals-aa'!$A$1,$C24,AA$2,1,1)","v":0},{"$f":"OFFSET('Taula Minerals-aa'!$A$1,$C24,AB$2,1,1)","v":0},{"$f":"OFFSET('Taula Minerals-aa'!$A$1,$C24,AC$2,1,1)","v":0},{"$f":"OFFSET('Taula Minerals-aa'!$A$1,$C24,AD$2,1,1)","v":0},{"$f":"OFFSET('Taula Minerals-aa'!$A$1,$C24,AE$2,1,1)","v":0},{"$f":"OFFSET('Taula Minerals-aa'!$A$1,$C24,AF$2,1,1)","v":0},{"$f":"OFFSET('Taula Minerals-aa'!$A$1,$C24,AG$2,1,1)","v":0},{"$f":"OFFSET('Taula Minerals-aa'!$A$1,$C24,AH$2,1,1)","v":0},{"$f":"OFFSET('Taula Minerals-aa'!$A$1,$C24,AI$2,1,1)","v":0},{"$f":"OFFSET('Taula Minerals-aa'!$A$1,$C24,AJ$2,1,1)","v":0},{"$f":"OFFSET('Taula Minerals-aa'!$A$1,$C24,AK$2,1,1)","v":0},{"$f":"OFFSET('Taula Minerals-aa'!$A$1,$C24,AL$2,1,1)","v":0},{"$f":"OFFSET('Taula Minerals-aa'!$A$1,$C24,AM$2,1,1)","v":0}]
[null,{"$f":"IF(OFFSET('Taula Minerals-aa'!$A$1,C25,0,1,1)=0,\"\",OFFSET('Taula Minerals-aa'!$A$1,C25,0,1,1))","v":""},1,{"$f":"OFFSET('Taula Minerals-aa'!$A$1,$C25,D2,1,1)","v":0},{"$f":"OFFSET('Taula Minerals-aa'!$A$1,$C25,E2,1,1)","v":0},{"$f":"OFFSET('Taula Minerals-aa'!$A$1,$C25,F2,1,1)","v":0},{"$f":"OFFSET('Taula Minerals-aa'!$A$1,$C25,G2,1,1)","v":0},{"$f":"OFFSET('Taula Minerals-aa'!$A$1,$C25,H2,1,1)","v":0},{"$f":"OFFSET('Taula Minerals-aa'!$A$1,$C25,I2,1,1)","v":0},{"$f":"OFFSET('Taula Minerals-aa'!$A$1,$C25,J2,1,1)","v":0},{"$f":"OFFSET('Taula Minerals-aa'!$A$1,$C25,K2,1,1)","v":0},{"$f":"OFFSET('Taula Minerals-aa'!$A$1,$C25,L$2,1,1)","v":0},{"$f":"OFFSET('Taula Minerals-aa'!$A$1,$C25,M$2,1,1)","v":0},{"$f":"OFFSET('Taula Minerals-aa'!$A$1,$C25,N$2,1,1)","v":0},{"$f":"OFFSET('Taula Minerals-aa'!$A$1,$C25,O$2,1,1)","v":0},{"$f":"OFFSET('Taula Minerals-aa'!$A$1,$C25,P$2,1,1)","v":0},{"$f":"OFFSET('Taula Minerals-aa'!$A$1,$C25,Q$2,1,1)","v":0},{"$f":"OFFSET('Taula Minerals-aa'!$A$1,$C25,R$2,1,1)","v":0},{"$f":"OFFSET('Taula Minerals-aa'!$A$1,$C25,S$2,1,1)","v":0},{"$f":"OFFSET('Taula Minerals-aa'!$A$1,$C25,T$2,1,1)","v":0},{"$f":"OFFSET('Taula Minerals-aa'!$A$1,$C25,U$2,1,1)","v":0},{"$f":"OFFSET('Taula Minerals-aa'!$A$1,$C25,V$2,1,1)","v":0},{"$f":"OFFSET('Taula Minerals-aa'!$A$1,$C25,W$2,1,1)","v":0},{"$f":"OFFSET('Taula Minerals-aa'!$A$1,$C25,X$2,1,1)","v":0},{"$f":"OFFSET('Taula Minerals-aa'!$A$1,$C25,Y$2,1,1)","v":0},{"$f":"OFFSET('Taula Minerals-aa'!$A$1,$C25,Z$2,1,1)","v":0},{"$f":"OFFSET('Taula Minerals-aa'!$A$1,$C25,AA$2,1,1)","v":0},{"$f":"OFFSET('Taula Minerals-aa'!$A$1,$C25,AB$2,1,1)","v":0},{"$f":"OFFSET('Taula Minerals-aa'!$A$1,$C25,AC$2,1,1)","v":0},{"$f":"OFFSET('Taula Minerals-aa'!$A$1,$C25,AD$2,1,1)","v":0},{"$f":"OFFSET('Taula Minerals-aa'!$A$1,$C25,AE$2,1,1)","v":0},{"$f":"OFFSET('Taula Minerals-aa'!$A$1,$C25,AF$2,1,1)","v":0},{"$f":"OFFSET('Taula Minerals-aa'!$A$1,$C25,AG$2,1,1)","v":0},{"$f":"OFFSET('Taula Minerals-aa'!$A$1,$C25,AH$2,1,1)","v":0},{"$f":"OFFSET('Taula Minerals-aa'!$A$1,$C25,AI$2,1,1)","v":0},{"$f":"OFFSET('Taula Minerals-aa'!$A$1,$C25,AJ$2,1,1)","v":0},{"$f":"OFFSET('Taula Minerals-aa'!$A$1,$C25,AK$2,1,1)","v":0},{"$f":"OFFSET('Taula Minerals-aa'!$A$1,$C25,AL$2,1,1)","v":0},{"$f":"OFFSET('Taula Minerals-aa'!$A$1,$C25,AM$2,1,1)","v":0}]
[null,null,null,null,{"$f":"SUMPRODUCT(E3:E25,'II_Plantejar Ració'!$E$4:$E$26)","v":2.8041681860355374},{"$f":"SUMPRODUCT(F3:F25,'II_Plantejar Ració'!$E$4:$E$26)","v":4.0848623018708468},{"$f":"SUMPRODUCT(G3:G25,'II_Plantejar Ració'!$E$4:$E$26)","v":313.3377464958175},{"$f":"SUMPRODUCT(H3:H25,'II_Plantejar Ració'!$E$4:$E$26)","v":30.54371661296749},{"$f":"SUMPRODUCT(I3:I25,'II_Plantejar Ració'!$E$4:$E$26)/SUM('II_Plantejar Ració'!$E$4:$E$26)","v":2.0339419661111404},{"$f":"SUMPRODUCT(J3:J25,'II_Plantejar Ració'!$E$4:$E$26)","v":14.001250558643488},{"$f":"SUMPRODUCT(K3:K25,'II_Plantejar Ració'!$E$4:$E$26)","v":9.4172719128748898},{"$f":"SUMPRODUCT(L3:L25,'II_Plantejar Ració'!$E$4:$E$26)","v":1.6237633889098109},{"$f":"SUMPRODUCT(M3:M25,'II_Plantejar Ració'!$E$4:$E$26)","v":6.4136015911240944},{"$f":"SUMPRODUCT(N3:N25,'II_Plantejar Ració'!$E$4:$E$26)","v":0.42310661638329106},{"$f":"SUMPRODUCT(O3:O25,'II_Plantejar Ració'!$E$4:$E$26)","v":0.28313717276281358},{"$f":"SUMPRODUCT(P3:P25,'II_Plantejar Ració'!$E$4:$E$26)","v":1.0295916444839778E-2},{"$f":"SUMPRODUCT(Q3:Q25,'II_Plantejar Ració'!$E$4:$E$26)","v":1.1497857833220966E-2},{"$f":"SUMPRODUCT(R3:R25,'II_Plantejar Ració'!$E$4:$E$26)","v":5.101386374250934},{"$f":"SUMPRODUCT(S3:S25,'II_Plantejar Ració'!$E$4:$E$26)","v":20.239803795385711},{"$f":"SUMPRODUCT(T3:T25,'II_Plantejar Ració'!$E$4:$E$26)","v":28.060573160756306},{"$f":"SUMPRODUCT(U3:U25,'II_Plantejar Ració'!$E$4:$E$26)","v":1.9980010575724315E-8},{"$f":"SUMPRODUCT(V3:V25,'II_Plantejar Ració'!$E$4:$E$26)","v":2.29999106677682E-2},{"$f":"SUMPRODUCT(W3:W25,'II_Plantejar Ració'!$E$4:$E$26)","v":136347.17647883049},{"$f":"SUMPRODUCT(X3:X25,'II_Plantejar Ració'!$E$4:$E$26)","v":134.93731845039636},{"$f":"SUMPRODUCT(Y3:Y25,'II_Plantejar Ració'!$E$4:$E$26)","v":61.226965252163367},{"$f":"SUMPRODUCT(Z3:Z25,'II_Plantejar Ració'!$E$4:$E$26)","v":275.78064126875262},{"$f":"SUMPRODUCT(AA3:AA25,'II_Plantejar Ració'!$E$4:$E$26)","v":601.09795019563489},{"$f":"SUMPRODUCT(AB3:AB25,'II_Plantejar Ració'!$E$4:$E$26)","v":144.1401607162525},{"$f":"SUMPRODUCT(AC3:AC25,'II_Plantejar Ració'!$E$4:$E$26)/SUM('II_Plantejar Ració'!$E$4:$E$26)","v":0.68251766784696088},{"$f":"SUMPRODUCT(AD3:AD25,'II_Plantejar Ració'!$E$4:$E$26)","v":2470.4892436617943},{"$f":"SUMPRODUCT(AE3:AE25,'II_Plantejar Ració'!$E$4:$E$26)","v":291.62051543584835},{"$f":"SUMPRODUCT(AF3:AF25,'II_Plantejar Ració'!$E$4:$E$26)","v":844.73936319738277},{"$f":"SUMPRODUCT(AG3:AG25,'II_Plantejar Ració'!$E$4:$E$26)","v":1812.5415021185242},{"$f":"SUMPRODUCT(AH3:AH25,'II_Plantejar Ració'!$E$4:$E$26)","v":1019.3133779540362},{"$f":"SUMPRODUCT(AI3:AI25,'II_Plantejar Ració'!$E$4:$E$26)","v":121.74889066688635},{"$f":"SUMPRODUCT(AJ3:AJ25,'II_Plantejar Ració'!$E$4:$E$26)","v":225.68755290289488},{"$f":"SUMPRODUCT(AK3:AK25,'II_Plantejar Ració'!$E$4:$E$26)","v":0.34501799830846597},{"$f":"SUMPRODUCT(AL3:AL25,'II_Plantejar Ració'!$E$4:$E$26)/SUM('II_Plantejar Ració'!$E$4:$E$26)","v":0.64461648115342962},{"$f":"SUMPRODUCT(AM3:AM25,'II_Plantejar Ració'!$E$4:$E$26)","v":2156.064849546724}]
[null,null,null,null,{"$f":"SUMPRODUCT(E8:E19,'II_Plantejar Ració'!$E$9:$E$20)","v":0},{"$f":"SUMPRODUCT(F8:F19,'II_Plantejar Ració'!$E$9:$E$20)","v":1.9622337881614476}]
[null,null,null,null,{"$f":"E26-E27","v":2.8041681860355374},{"$f":"F26-F27","v":2.1226285137093992}]
[null,null,null,null,{"$f":"IF(I_Necessitats!B14=\"UFL\",1,2)","v":1}]
[]
[]
[]
[]
[]
[]
[]
[null,{"$f":"CàlculsEV!B3","v":"FENC Civada Inici espigat"}]
[null,{"$f":"CàlculsEV!B4","v":"ENSITJAT prefenificat Alfals rebrots floració"}]
[null,{"$f":"CàlculsEV!B5","v":""}]
[null,{"$f":"CàlculsEV!B6","v":""}]
[null,{"$f":"CàlculsEV!B7","v":""}]
[null,{"$f":"CàlculsEV!B8","v":""}]
[null,{"$f":"CàlculsEV!B9","v":"Ordi gra"}]
[null,{"$f":"CàlculsEV!B10","v":"Colza, turtó "}]
[null,{"$f":"CàlculsEV!B11","v":"Blat de moro gra"}]
[null,{"$f":"CàlculsEV!B12","v":"Soja tortó 44"}]
[null,{"$f":"CàlculsEV!B13","v":"Mandioca"}]
[null,{"$f":"CàlculsEV!B14","v":"Ordi bagàs cerveseria sec"}]
[null,{"$f":"CàlculsEV!B15","v":"Cotó, gra"}]
[null,{"$f":"CàlculsEV!B16","v":"Llevat cerveseria"}]
[null,{"$f":"CàlculsEV!B17","v":"Grassa vegetal, mantega de porc (tots els tipus)"}]
[null,{"$f":"CàlculsEV!B18","v":"Urea"}]
[null,{"$f":"CàlculsEV!B19","v":""}]

{"sheet":"Apunts Cria","index":5,"n_rows":31,"n_cols":17,"rows_kept":31,"cut":false,"hidden":false,"merged":[[18,4,18,5],[25,3,25,7],[26,3,26,7],[19,4,19,5],[21,3,21,6],[22,3,22,5],[20,1,20,6],[10,7,10,8],[11,7,11,8],[14,1,14,7],[16,1,16,7],[17,4,17,5],[28,11,28,12],[29,11,29,12],[30,11,30,16],[7,1,7,5],[0,1,0,19],[1,1,5,19],[11,11,11,13],[11,15,11,16],[12,11,13,11],[12,12,12,14],[12,15,13,15],[12,16,13,16],[8,11,10,16],[7,11,7,16],[7,7,7,9],[9,7,9,8]]}
[null,"Cria vedells per engreix o reposició (Guia)"]
[null,"Del naixement al deslletament (6 mesos lleteres; 8,5 mesos altres). Objectiu: pes final de la cria tres vegades el pes al naixement. Després de la cria: mascles a engreix, femelles a reposició (creixement de 700 a 1.000 g/dia, potencial elevat creixement esquelet i muscles). Objectiu reposició: si part precoç, creixement alt. Objectiu engreix: si edat sacrifici precoç, creixement alt. Increment volum rumen: més farratges que concentrats. Concentrat ric en energia assegura un augment de pes alt després del deslletament.  La cria té tres períodes: 1) Calostre; 2) Fins deslletament; 3) Postdeslletament\n"]
[]
[]
[]
[]
[]
[null,"1.- Període CALOSTRE. Exemple o recomanació INRA\n",null,null,null,null,null,"Dades per a la cria",null,null,null,"2.- Període fins deslletament"]
[null,null,null,null,null,null,null,"Pes naixement, kg",null,45,null,"Setmana deslletament 8ena. Objectiu: doblar pes en néixer"]
[null,null,null,null,null,null,null,"Temps, mesos",null,4]
[null,null,null,null,null,null,null,"Pes final, kg",null,{"$f":"J9*3","v":135}]
[null,null,null,null,null,null,null,"Creixement mitjà, g/dia",null,{"$f":"1000*(J11-J9)/(J10*30.5)","v":737.70491803278685},null,"Pes objectiu al deslletament",null,null,{"$f":"2*J9","v":90},"kg"]
[null,null,null,null,null,null,null,null,null,null,null,"Tipus  aliment","Composició %",null,null,"Subm. al dia","Tª ºC"]
[null,null,null,null,null,null,null,null,null,null,null,null,"Llet entera","Aliment alletament","Aigua"]
[null,"3.- Període postdeslletament",null,null,null,null,null,null,null,null,null,"A",100,0,0,2,40]
[null,"Temps, dies",{"$f":"J10*30.5-8*7","v":66},{"$f":"C16/30.5","v":2.1639344262295084},"mesos",null,null,null,null,null,null,"B",0,13,87,2,40]
[null,"Càlcul aportacions diàries de farratges i concentrat",null,null,null,null,null,null,null,null,null,"C",0,22,78,1,40]
[null,"Farratges (bona qualitat)","MS %","UE","Composició a la ració",null,"kg MS/dia","Kg fresc/dia",null,null,null,"D",75,12.5,12.5,1,40]
[null,"Fenc",0.85,1.1000000000000001,0.32,null,{"$f":"(C26-C27)*E19","v":0.54349058745574996},{"$f":"G19/C19","v":0.63940069112441178},null,null,null,null,null,"Quantitat (kg) tipus aliment"]
[null,"Ensitjat",0.33,1.2,{"$f":"1-E19","v":0.67999999999999994},null,{"$f":"(C26-C27)*E20","v":1.1549174983434687},{"$f":"G20/C20","v":3.499749994980208},null,null,null,"Setmana","Nº dies","A","B","C","D"]
[null,"kg mescla concentrats (75 a 80% cereals; resta turtós) 1,16 UFL i 120 PDI ",null,null,null,null,null,{"$f":"IF(J12<901,1.5,3)","v":1.5},null,null,null,1,1,6,6,3,3]
[null,"CI inici període, UE",{"$f":"0.039*(J11-8*7*J12/1000)^0.9","v":2.3205042425704452},"0,039 x (Pes final - Δ kg/dia x 7 x 8)0,9",null,null,null,null,null,null,null,2,7,8,8,4,4]
[null,"CI, final període, UE",{"$f":"0.039*J11^0.9","v":3.2237770458565289},"0,039 x Pes final0,9",null,null,null,null,null,null,null,"3*",7,8,8,5,5]
[null,"CI, mitjana",{"$f":"AVERAGE(C22:C23)","v":2.7721406442134873},null,null,null,null,null,null,null,null,4,7,8,8,5,5]
[null,"UE mescla farratgera",{"$f":"D19*E19+D20*E20","v":1.1679999999999999},null,null,null,null,null,null,null,null,5,7,8,8,5,5]
[null,"Kg MS farratgera",{"$f":"C24/C25","v":2.3734080857992188},"kg MS mescla farratgera = CI/(UE mescla farratgera)",null,null,null,null,null,null,null,6,7,8,8,5,5]
[null,null,{"$f":"0.45*H21","v":0.67500000000000004},"kg MS mescla farratgera que deixa de menjar si incoporem concentrat Sg= 0,45",null,null,null,null,null,null,null,7,7,6,6,3.5,3.5]
[null,"FENC, kg",{"$f":"H19","v":0.63940069112441178},null,null,null,null,null,null,null,null,8,7,3,3,2,2]
[null,"ENSITJAT, kg",{"$f":"H20","v":3.499749994980208},null,null,null,null,null,null,null,null,"kg llet entera",null,{"$f":"SUMPRODUCT(M21:M28,N21:N28)","v":349},0,0,{"$f":"SUMPRODUCT(M21:M28,Q21:Q28)*M18/100","v":157.125}]
[null,"MESCLA CONCENTRAT, kg",{"$f":"H21","v":1.5},null,null,null,null,null,null,null,null,"kg aliment alletament",null,0,{"$f":"N29*N16/100","v":45.37},{"$f":"SUMPRODUCT(M21:M28,P21:P28)*N17/100","v":46.09},{"$f":"SUMPRODUCT(M21:M28,Q21:Q28)*N18/100","v":26.1875}]
[null,null,null,null,null,null,null,null,null,null,null,"*  A la tercera setmana s'introdueix fenc ben conservat"]

{"sheet":"NR","index":6,"n_rows":56,"n_cols":77,"rows_kept":56,"cut":false,"hidden":false,"merged":[[32,0,32,6],[33,0,33,6],[26,0,26,6],[27,0,27,6],[28,0,28,6],[29,0,29,6],[30,0,30,6],[31,0,31,6]]}
[null,null,null,null,null,null,null,null,null,null,null,null,null,null,null,null,null,null,null,null,null,null,null,null,null,null,null,null,null,null,null,null,null,null,null,null,null,null,"ok","ok"]
[null,"Pvinicial","Pvfinal","d1","d2","CDinicial %PV","CDfinal %Pv","Lipinicial %Pvbuit","Lipfinal %Pvbuit","recEN_mant Kcla/KgPV0,75","Pv adult","Pv t","GMD","Pes v t","ΔPv t","Pvbuit inicial","Pv buit final","c1","c0","Pvbuit t1","Pv buit t2","Dif pv buit","Lip_corp_i","Lip_corp_t","b1","b0","Lip_corp t1","Lip_corp t2","Dif Lip_corp","Mdel t1","Mdel t2","Dif Mdel","Prot_corp_t1","Prot_corp_t2","Dif Prot_corp ","q","km","EN mant","NecEN_guany","Ep","kpf","kf","kmf","NecUFL_mant","NecUFLguany","EfPDI","BPR máx","BPR mín","MOND g/kg MS","CI MSI","NecPDI_PEF","NecPDI_Uendo","NecPDI_epidèrmiques","NecPDI_guany","Itip","c","UFV","PDI","CI UEB","Pabs","Caabs","Mgabs","Cl","K","Na","S","Co","Cu","Mo","Iode","Fe","Mn","Se","Zn","Vit A","Vit D","Vit E"]
["1.-Vedells Engreix (finalització) gran format tardans (Xarolés, p.e)",300,800,1.1028,3.7000000000000002E-3,16,11,8,16,102,{"$f":"B3*EXP(D3)","v":903.77684284297129},{"$f":"IF(I_Necessitats!$C$6=1,I_Necessitats!$C$10,\"\")","v":""},{"$f":"IF(I_Necessitats!$C$6=1,I_Necessitats!$C$11,\"\")","v":""},{"$f":"IF(L3=\"\",\"\",L3+M3)","v":""},{"$f":"IF(L3=\"\",\"\",E3*L3*LN(K3/L3))","v":""},{"$f":"B3*(100-F3)/100","v":252},{"$f":"C3*(100-G3)/100","v":712},{"$f":"LN(Q3/P3)/LN(C3/B3)","v":1.0589496802947975},{"$f":"EXP(LN(P3)-R3*LN(B3))","v":0.60014166668340529},{"$f":"IF(L3=\"\",\"\",S3*L3^R3)","v":""},{"$f":"IF(M3=\"\",\"\",S3*N3^R3)","v":""},{"$f":"IF(L3=\"\",\"\",U3-T3)","v":""},{"$f":"H3*P3/100","v":20.16},{"$f":"I3*Q3/100","v":113.92},{"$f":"LN(X3/W3)/LN(Q3/P3)","v":1.66735470604674},{"$f":"EXP(LN(X3)-Y3*LN(Q3))","v":1.9975793277195834E-3},{"$f":"IF(L3=\"\",\"\",Z3*T3^Y3)","v":""},{"$f":"IF(M3=\"\",\"\",Z3*U3^Y3)","v":""},{"$f":"IF(L3=\"\",\"\",AB3-AA3)","v":""},{"$f":"IF(L3=\"\",\"\",T3-AA3)","v":""},{"$f":"IF(L3=\"\",\"\",U3-AB3)","v":""},{"$f":"IF(L3=\"\",\"\",AE3-AD3)","v":""},{"$f":"IF(L3=\"\",\"\",0.1436*AD3^1.0723)","v":""},{"$f":"IF(L3=\"\",\"\",0.1436*AE3^1.0723)","v":""},{"$f":"IF(L3=\"\",\"\",AH3-AG3)","v":""},{"$f":"IF(M3=\"\",\"\",IF(M3>1,0.6,0.62-0.262*EXP(-3.175*M3)))","v":""},{"$f":"IF(L3=\"\",\"\",0.287*AJ3+0.554)","v":""},{"$f":"IF(L3=\"\",\"\",(J3*L3^0.75)/1000)","v":""},{"$f":"IF(L3=\"\",\"\",5.48*AI3+9.39*AC3)","v":""},{"$f":"IF(L3=\"\",\"\",5.48*AI3/(5.48*AI3+9.39*AC3))","v":""},{"$f":"IF(L3=\"\",\"\",0.35+0.25*(1-AN3)^2)","v":""},{"$f":"IF(L3=\"\",\"\",0.78*0.6+0.006)","v":""},{"$f":"IF(L3=\"\",\"\",(AK3*AP3*1.5)/(AP3+0.5*AK3))","v":""},{"$f":"IF(L3=\"\",\"\",AM3/AO3*AQ3/1.76)","v":""},{"$f":"IF(L3=\"\",\"\",AL3/AK3*AQ3/1.76)","v":""},{"$f":"IF(L3=\"\",\"\",IF(L3<550,0.64,0.47))","v":""},{"$f":"IF(L3=\"\",\"\",IF(L3<550,-2,-6.6))","v":""},{"$f":"IF(L3=\"\",\"\",IF(L3<550,-7.5,-13.3))","v":""},{"$f":"IF(L3=\"\",\"\",IF(L3<550,262,240))","v":""},{"$f":"IF(L3=\"\",\"\",95*L3^0.75/1000)","v":""},{"$f":"IF(AX3=\"\",\"\",(AX3*(0.5*(5.7+0.074*AW3)))/AT3)","v":""},{"$f":"IF(L3=\"\",\"\",0.312*L3)","v":""},{"$f":"IF(L3=\"\",\"\",(0.2*L3^0.6)/AT3)","v":""},{"$f":"IF(AI3=\"\",\"\",AI3*1000/AT3)","v":""},0.28399999999999997,0.54,{"$f":"IF(L3=\"\",\"\",AR3+AS3)","v":""},{"$f":"IF(L3=\"\",\"\",AY3+AZ3+BA3+BB3)","v":""},{"$f":"IF(L3=\"\",\"\",BC3*L3^BD3)","v":""},{"$f":"IF(L3=\"\",\"\",0.025*L3+(((1.2+((4.655*K3^0.22)*(L3^-0.22)))*M3)))","v":""},{"$f":"IF(L3=\"\",\"\",0.015*L3+(((9.83*(K3^0.22)*(L3^-0.22)*M3))))","v":""},{"$f":"IF(L3=\"\",\"\",(0.003*L3+0.45*M3))","v":""},{"$f":"IF(L3=\"\",\"\",(0.003*L3+0.45*M3)/0.16)","v":""},{"$f":"IF(L3=\"\",\"\",((2.6*AX3)+0.038*L3+1.6*M3)/0.9)","v":""},{"$f":"IF(L3=\"\",\"\",(0.015*L3+1.4*M3)/0.99)","v":""},{"$f":"IF(BP3=\"\",\"\",2*AX3)","v":""},{"$f":"IF(BP3=\"\",\"\",0.11*AX3)","v":""},{"$f":"IF(L3=\"\",\"\",(0.0071*L3+1.15*M3)/0.04)","v":""},null,{"$f":"IF(L3=\"\",\"\",0.006*L3)","v":""},{"$f":"IF(M3=\"\",\"\",34*M3/0.1)","v":""},{"$f":"IF(M3=\"\",\"\",(0.002*L3+0.7*M3)/0.0075)","v":""},{"$f":"IF(BP3=\"\",\"\",0.3*AX3)","v":""},{"$f":"IF(L3=\"\",\"\",(0.045*L3+24*M3)/0.15)","v":""},{"$f":"IF(L3=\"\",\"\",110*L3)","v":""},{"$f":"IF(L3=\"\",\"\",16*L3)","v":""},{"$f":"IF(L3=\"\",\"\",2.6*L3)","v":""}]
["2.-Vedells Engreix (finalització)  tardans (Limousins, p.e)",330,730,1.1028,3.7000000000000002E-3,15,10.8,8,15,98,{"$f":"B4*EXP(D4)","v":994.15452712726835},{"$f":"IF(I_Necessitats!$C$6=2,I_Necessitats!$C$10,\"\")","v":""},{"$f":"IF(I_Necessitats!$C$6=2,I_Necessitats!$C$11,\"\")","v":""},{"$f":"IF(L4=\"\",\"\",L4+M4)","v":""},{"$f":"IF(L4=\"\",\"\",E4*L4*LN(K4/L4))","v":""},{"$f":"B4*(100-F4)/100","v":280.5},651.16,{"$f":"LN(Q4/P4)/LN(C4/B4)","v":1.0607464814051075},{"$f":"EXP(LN(P4)-R4*LN(B4))","v":0.59762404884316622},{"$f":"IF(L4=\"\",\"\",S4*L4^R4)","v":""},{"$f":"IF(M4=\"\",\"\",S4*N4^R4)","v":""},{"$f":"IF(L4=\"\",\"\",U4-T4)","v":""},{"$f":"H4*P4/100","v":22.44},97.673999999999992,{"$f":"LN(X4/W4)/LN(Q4/P4)","v":1.7464050658015879},{"$f":"EXP(LN(X4)-Y4*LN(Q4))","v":1.1910788018160768E-3},{"$f":"IF(L4=\"\",\"\",Z4*T4^Y4)","v":""},{"$f":"IF(M4=\"\",\"\",Z4*U4^Y4)","v":""},{"$f":"IF(L4=\"\",\"\",AB4-AA4)","v":""},{"$f":"IF(L4=\"\",\"\",T4-AA4)","v":""},{"$f":"IF(L4=\"\",\"\",U4-AB4)","v":""},{"$f":"IF(L4=\"\",\"\",AE4-AD4)","v":""},{"$f":"IF(L4=\"\",\"\",0.1436*AD4^1.0723)","v":""},{"$f":"IF(L4=\"\",\"\",0.1436*AE4^1.0723)","v":""},{"$f":"IF(L4=\"\",\"\",AH4-AG4)","v":""},{"$f":"IF(M4=\"\",\"\",IF(M4>1,0.6,0.62-0.262*EXP(-3.175*M4)))","v":""},{"$f":"IF(L4=\"\",\"\",0.287*AJ4+0.554)","v":""},{"$f":"IF(L4=\"\",\"\",(J4*L4^0.75)/1000)","v":""},{"$f":"IF(L4=\"\",\"\",5.48*AI4+9.39*AC4)","v":""},{"$f":"IF(L4=\"\",\"\",5.48*AI4/(5.48*AI4+9.39*AC4))","v":""},{"$f":"IF(L4=\"\",\"\",0.35+0.25*(1-AN4)^2)","v":""},{"$f":"IF(L4=\"\",\"\",0.78*0.6+0.006)","v":""},{"$f":"IF(L4=\"\",\"\",(AK4*AP4*1.5)/(AP4+0.5*AK4))","v":""},{"$f":"IF(L4=\"\",\"\",AM4/AO4*AQ4/1.76)","v":""},{"$f":"IF(L4=\"\",\"\",AL4/AK4*AQ4/1.76)","v":""},{"$f":"IF(L4=\"\",\"\",IF(L4<550,0.64,0.47))","v":""},{"$f":"IF(L4=\"\",\"\",IF(L4<550,-2,-6.6))","v":""},{"$f":"IF(L4=\"\",\"\",IF(L4<550,-7.5,-13.3))","v":""},{"$f":"IF(L4=\"\",\"\",IF(L4<550,262,240))","v":""},"",{"$f":"IF(AX4=\"\",\"\",(AX4*(0.5*(5.7+0.074*AW4)))/AT4)","v":""},"","","",0.22,0.56999999999999995,"","","",{"$f":"IF(L4=\"\",\"\",0.025*L4+(((1.2+((4.655*K4^0.22)*(L4^-0.22))))*M4))","v":""},"",{"$f":"IF(L4=\"\",\"\",(0.003*L4+0.45*M4)/0.16)","v":""},"","","",{"$f":"IF(BP4=\"\",\"\",2*AX4)","v":""},{"$f":"IF(BP4=\"\",\"\",0.11*AX4)","v":""},"",null,"","","",{"$f":"IF(BP4=\"\",\"\",0.3*AX4)","v":""},"","","",""]
["3.-Vedells Engreix (finalització)  precocitat mitjana (vaques rústiques)",250,680,1.4077999999999999,3.7629999999999999E-3,18,12,10,19.5,100,1021.7385517823345,{"$f":"IF(I_Necessitats!$C$6=3,I_Necessitats!$C$10,\"\")","v":""},{"$f":"IF(I_Necessitats!$C$6=3,I_Necessitats!$C$11,\"\")","v":""},"","",205,598.4,1.070572973541702,0.55537214745381425,"","","",20.5,116.68799999999999,1.6234116378034613,3.6209767752185414E-3,"","","","","","","","","","","","","","","","","","","","","","","","","","","","",0.23300000000000001,0.57499999999999996,"","","",{"$f":"IF(L5=\"\",\"\",0.025*L5+(((1.2+((4.655*K5^0.22)*(L5^-0.22)))*M5)))","v":""},"","","","","","","","",null,"","","","","","","",""]
["4.-Vedells Engreix (finalització)  precocitat alta (vaques lleteres)",200,550,1.4077999999999999,3.7629999999999999E-3,20,12,7.5,21,95,{"$f":"B6*EXP(D6)","v":817.39084142586762},{"$f":"IF(I_Necessitats!$C$6=4,I_Necessitats!$C$10,\"\")","v":""},{"$f":"IF(I_Necessitats!$C$6=4,I_Necessitats!$C$11,\"\")","v":""},"","",{"$f":"B6*(100-F6)/100","v":160},{"$f":"C6*(100-G6)/100","v":484},{"$f":"LN(Q6/P6)/LN(C6/B6)","v":1.0942171746822404},{"$f":"EXP(LN(P6)-R6*LN(B6))","v":0.48561650828981223},"","","",{"$f":"H6*P6/100","v":12},{"$f":"I6*Q6/100","v":101.64},{"$f":"LN(X6/W6)/LN(Q6/P6)","v":1.9301735479060855},{"$f":"EXP(LN(X6)-Y6*LN(Q6))","v":6.6810874924829323E-4},"","","","","","","","","","","","","","","","","","","","","","","","","","","","",0.157,0.65200000000000002,"","","","","","","","","","","","",null,"","","","","","","",""]
["5.-Bous tardans Engreix (finalització) de 20 a 33 mesos",500,750,0.629,3.5000000000000001E-3,12,10,11,16.5,106,{"$f":"B7*EXP(D7)","v":937.86695358875579},{"$f":"IF(I_Necessitats!$C$6=5,I_Necessitats!$C$10,\"\")","v":""},{"$f":"IF(I_Necessitats!$C$6=5,I_Necessitats!$C$11,\"\")","v":""},"","",{"$f":"B7*(100-F7)/100","v":440},675,{"$f":"LN(Q7/P7)/LN(C7/B7)","v":1.0554248821974188},{"$f":"EXP(LN(P7)-R7*LN(B7))","v":0.62358057424616431},"","","",{"$f":"H7*P7/100","v":48.4},111.375,{"$f":"LN(X7/W7)/LN(Q7/P7)","v":1.9474857158171002},{"$f":"EXP(LN(X7)-Y7*LN(Q7))","v":3.4415892281846515E-4},"","","","","","","","","","","","","","","","","","","","","","","","","","","","",0.2205,0.6,"","","","","","","","","","","","",null,"","","","","","","",""]
["6.-Bous precoces Engreix (finalització) de 24 a 28 mesos",540,660,0.629,3.5000000000000001E-3,13,11,16,21.2,108,1012.8963098758563,{"$f":"IF(I_Necessitats!$C$6=6,I_Necessitats!$C$10,\"\")","v":""},{"$f":"IF(I_Necessitats!$C$6=6,I_Necessitats!$C$11,\"\")","v":""},"","",469.8,587.4,1.1132614357328656,0.426623144468049,"","","",75.168000000000006,124.52879999999999,2.2596857048659671,6.8920648659404643E-5,"","","","","","","","","","","","","","","","","","","","","","","","","","","","",0.24249999999999999,0.6,"","","","","","","","","","","","",null,"","","","","","","",""]
["7.-Vedelles tardanes Engreix (finalització)  de 15 a 30 mesos",450,700,0.61739999999999995,3.5000000000000001E-3,13,10,13,18,106,834.34549800259833,{"$f":"IF(I_Necessitats!$C$6=7,I_Necessitats!$C$10,\"\")","v":""},{"$f":"IF(I_Necessitats!$C$6=7,I_Necessitats!$C$11,\"\")","v":""},"","",391.5,630,1.0767293766720827,0.54442731971748293,"","","",50.895000000000003,113.4,1.6840423272600518,2.1898031737106927E-3,"","","","","","","","","","","","","","","","","","","","","","","","","","","","",0.2205,0.6,"","","","","","","","","","","","",null,"","","","","","","",""]
["8.-Vedells tardans Creixement  de 8 a 24 mesos",300,540,1.1140000000000001,2.5000000000000001E-3,16,12,8,11,94,913.95604058383685,{"$f":"IF(I_Necessitats!$C$6=8,I_Necessitats!$C$10,\"\")","v":""},{"$f":"IF(I_Necessitats!$C$6=8,I_Necessitats!$C$11,\"\")","v":""},"","",252,475.2,1.0791443876030082,0.53484635613701059,"","","",20.16,52.271999999999998,1.5020500979887643,4.9827214589203243E-3,"","","","","","","","","","","","","","","","","","","","","","","","","","","","",3.4590000000000003E-2,0.9,"","","","","","","","","","","","",null,"","","","","","","",""]
["9.-Vedells precoces Creixement de 6 a 24 mesos",200,520,1.5013000000000001,2.5000000000000001E-3,20,13,7.5,18,94,897.50381095966964,{"$f":"IF(I_Necessitats!$C$6=9,I_Necessitats!$C$10,\"\")","v":200},{"$f":"IF(I_Necessitats!$C$6=9,I_Necessitats!$C$11,\"\")","v":0.75065000000000004},200.75065000000001,0.75065000000000004,160,452.4,1.0877870007912813,0.50244608307753336,159.99999999999994,160.65334534366346,0.65334534366351704,12,81.432000000000002,1.8422885252734345,1.0436534033345067E-3,11.999999999999963,12.090429008150808,9.0429008150845647E-2,147.99999999999997,148.56291633551265,0.56291633551268205,30.50184271852789,30.62626098882475,0.12441827029686081,0.59583196834771213,0.72500377491579338,4.9991981431282868,1.5309405077632379,0.44535507276043712,0.42690774882814497,0.47399999999999998,0.61623015045626472,1.255609382009053,2.4142951282771148,0.64,-2,-7.5,262,5.0523811020977361,99.026669601115614,62.4,7.5070277123839428,194.40354733884502,3.1150000000000001E-2,0.9,3.6699045102861678,363.33724465234457,3.6676260362049162,10.762596481007826,13.266735984598695,5.8612031250000003,5.8612031250000003,24.37470096161568,4.091828282828283,10.104762204195472,0.55576192123075097,57.081187499999999,null,1.2,255.221,123.39400000000001,1.5157143306293208,180.10400000000001,22000,3200,520]
["10.-Vedelles tardanes Creixement de 8 a 28 mesos",300,600,1.1140000000000001,2.5000000000000001E-3,18,13,9,14,94,913.95604058383685,{"$f":"IF(I_Necessitats!$C$6=10,I_Necessitats!$C$10,\"\")","v":""},{"$f":"IF(I_Necessitats!$C$6=10,I_Necessitats!$C$11,\"\")","v":""},"","",246,522,1.0853914912306448,0.50383551168200769,"","","",22.14,73.08,1.5872811107930809,3.5488813836110746E-3,"","","","","","","","","","","","","","","","","","","","","","","","","","","","",3.4590000000000003E-2,0.9,"","","","","","","","","","","","",null,"","","","","","","",""]
["11.-Vedelles lleteres Creixement de 6 a 24 mesos",150,600,1.5013000000000001,2.5000000000000001E-3,20,13,9,21,94,673.12785821975217,{"$f":"IF(I_Necessitats!$C$6=11,I_Necessitats!$C$10,\"\")","v":""},{"$f":"IF(I_Necessitats!$C$6=11,I_Necessitats!$C$11,\"\")","v":""},"","",120,522,1.0605077004806829,0.59077173527844518,"","","",10.8,109.62,1.5763241609572423,5.7011192121906463E-3,"","","","","","","","","","","","","","","","","","","","","","","","","","","","",3.9149999999999997E-2,0.9,"","","","","","","","","","","","",null,"","","","","","","",""]
[]
[{"$f":"I_Necessitats!C6","v":9}]
[{"$f":"IF($A$15=1,A3,IF($A$15=2,A4,IF($A$15=3,A5,IF($A$15=4,A6,IF($A$15=5,A7,IF($A$15=6,A8,IF($A$15=7,A9,IF($A$15=8,A10,IF($A$15=9,A11,IF($A$15=10,A12,A13))))))))))","v":"9.-Vedells precoces Creixement de 6 a 24 mesos"},{"$f":"IF($A$15=1,B3,IF($A$15=2,B4,IF($A$15=3,B5,IF($A$15=4,B6,IF($A$15=5,B7,IF($A$15=6,B8,IF($A$15=7,B9,IF($A$15=8,B10,IF($A$15=9,B11,IF($A$15=10,B12,B13))))))))))","v":200},{"$f":"IF($A$15=1,C3,IF($A$15=2,C4,IF($A$15=3,C5,IF($A$15=4,C6,IF($A$15=5,C7,IF($A$15=6,C8,IF($A$15=7,C9,IF($A$15=8,C10,IF($A$15=9,C11,IF($A$15=10,C12,C13))))))))))","v":520},null,null,null,null,null,null,null,{"$f":"IF($A$15=1,K3,IF($A$15=2,K4,IF($A$15=3,K5,IF($A$15=4,K6,IF($A$15=5,K7,IF($A$15=6,K8,IF($A$15=7,K9,IF($A$15=8,K10,IF($A$15=9,K11,IF($A$15=10,K12,K13))))))))))","v":897.50381095966964},{"$f":"SUM(L3:L13)","v":200},{"$f":"SUM(M3:M13)","v":0.75065000000000004},200.75065000000001,0.75065000000000004,2976.8,6309.5599999999995,11.842732584631831,5.965285095876891,159.99999999999994,160.65334534366346,0.65334534366351704,314.66300000000001,1095.6298000000002,19.366502600513517,2.535700185724761E-2,{"$f":"SUM(AA3:AA13)","v":11.999999999999963},{"$f":"SUM(AB3:AB13)","v":12.090429008150808},9.0429008150845647E-2,147.99999999999997,148.56291633551265,0.56291633551268205,30.50184271852789,30.62626098882475,0.12441827029686081,0.59583196834771213,0.72500377491579338,4.9991981431282868,1.5309405077632379,0.44535507276043712,0.42690774882814497,0.47399999999999998,0.61623015045626472,1.255609382009053,2.4142951282771148,0.64,-2,-7.5,262,5.0523811020977361,99.026669601115614,62.4,7.5070277123839428,194.40354733884502,1.7169799999999997,7.737000000000001,3.6699045102861678,363.33724465234457,3.6676260362049162,10.762596481007826,13.266735984598695,5.8612031250000003,5.8612031250000003,24.37470096161568,4.091828282828283,10.104762204195472,0.55576192123075097,57.081187499999999,0,1.2,255.221,123.39400000000001,1.5157143306293208,180.10400000000001,22000,3200,520]
[null,null,null,null,null,null,null,null,null,null,null,null,null,null,null,null,null,null,null,null,null,null,null,null,null,null,null,null,null,null,null,null,null,null,null,null,null,null,null,null,null,null,null,null,null,null,null,null,null,null,null,{"$f":"AZ16/AY16","v":0.63013327875561531}]
[null,null,null,null,"Pes inici",{"$f":"L9","v":""},null,null,null,null,"Pfinal","TempsdiesT","TempsDies"]
[null,null,null,null,"Pes a assolir",720,null,null,null,null,{"$f":"IF(I_Necessitats!$C$6=1,I_Necessitats!$H$12,\"\")","v":""},{"$f":"IF(I_Necessitats!$C$6=1,I_Necessitats!$I$13,\"\")","v":""},{"$f":"IF(I_Necessitats!$C$6=1,I_Necessitats!$H$13,\"\")","v":""}]
["Farratge i complementació",null,null,null,"guany",{"$f":"M9","v":""},null,null,null,null,{"$f":"IF(I_Necessitats!$C$6=2,I_Necessitats!$H$12,\"\")","v":""},{"$f":"IF(I_Necessitats!$C$6=2,I_Necessitats!$I$13,\"\")","v":""},{"$f":"IF(I_Necessitats!$C$6=2,I_Necessitats!$H$13,\"\")","v":""}]
["Pinso i palla",null,null,null,"Temps necessari",{"$f":"(F19-F18)/F20","v":{"$error":"#VALUE!"}},null,null,null,null,{"$f":"IF(I_Necessitats!$C$6=3,I_Necessitats!$H$12,\"\")","v":""},{"$f":"IF(I_Necessitats!$C$6=3,I_Necessitats!$I$13,\"\")","v":""},{"$f":"IF(I_Necessitats!$C$6=3,I_Necessitats!$H$13,\"\")","v":""}]
[null,null,null,null,null,null,null,null,null,null,{"$f":"IF(I_Necessitats!$C$6=4,I_Necessitats!$H$12,\"\")","v":""},{"$f":"IF(I_Necessitats!$C$6=4,I_Necessitats!$I$13,\"\")","v":""},{"$f":"IF(I_Necessitats!$C$6=4,I_Necessitats!$H$13,\"\")","v":""}]
[null,null,null,null,null,null,null,null,null,null,{"$f":"IF(I_Necessitats!$C$6=5,I_Necessitats!$H$12,\"\")","v":""},{"$f":"IF(I_Necessitats!$C$6=5,I_Necessitats!$I$13,\"\")","v":""},{"$f":"IF(I_Necessitats!$C$6=5,I_Necessitats!$H$13,\"\")","v":""}]
[null,null,null,null,null,null,null,null,null,null,{"$f":"IF(I_Necessitats!$C$6=6,I_Necessitats!$H$12,\"\")","v":""},{"$f":"IF(I_Necessitats!$C$6=6,I_Necessitats!$I$13,\"\")","v":""},{"$f":"IF(I_Necessitats!$C$6=6,I_Necessitats!$H$13,\"\")","v":""}]
[null,null,null,null,null,null,null,null,null,null,{"$f":"IF(I_Necessitats!$C$6=7,I_Necessitats!$H$12,\"\")","v":""},{"$f":"IF(I_Necessitats!$C$6=7,I_Necessitats!$I$13,\"\")","v":""},{"$f":"IF(I_Necessitats!$C$6=7,I_Necessitats!$H$13,\"\")","v":""}]
[null,null,null,null,null,null,null,null,null,null,{"$f":"IF(I_Necessitats!$C$6=8,I_Necessitats!$H$12,\"\")","v":""},{"$f":"IF(I_Necessitats!$C$6=8,I_Necessitats!$I$13,\"\")","v":""},{"$f":"IF(I_Necessitats!$C$6=8,I_Necessitats!$H$13,\"\")","v":""}]
["Dades orientatives: Vedelles precoces de 350 a 600 kg; GPV de 0,8 a 1,2 kg; Pv adult = 700 kg",null,null,null,null,null,null,null,null,null,{"$f":"IF(I_Necessitats!$C$6=9,I_Necessitats!$H$12,\"\")","v":620},{"$f":"IF(I_Necessitats!$C$6=9,I_Necessitats!$I$13,\"\")","v":559.5150869246653},{"$f":"IF(I_Necessitats!$C$6=9,I_Necessitats!$H$13,\"\")","v":559.5150869246653}]
["Dades orientatives: Vedelles carn gran format (Llemosina, Blonda) de 450 a 600 kg; GPV de 0,8 a 1,2 kg.; Pv adult = 850 kg",null,null,null,null,null,null,null,null,null,{"$f":"IF(I_Necessitats!$C$6=10,I_Necessitats!$H$12,\"\")","v":""},{"$f":"IF(I_Necessitats!$C$6=10,I_Necessitats!$I$13,\"\")","v":""},{"$f":"IF(I_Necessitats!$C$6=10,I_Necessitats!$H$13,\"\")","v":""}]
["Dades orientatives: Vedelles carn tardanes (Xarolés i creuaments) de 450 a 600 kg; GPV de 0,8 a 1,2 kg; Pv adult = 850 kg\n",null,null,null,null,null,null,null,null,null,{"$f":"IF(I_Necessitats!$C$6=11,I_Necessitats!$H$12,\"\")","v":""},{"$f":"IF(I_Necessitats!$C$6=11,I_Necessitats!$I$13,\"\")","v":""},{"$f":"IF(I_Necessitats!$C$6=11,I_Necessitats!$H$13,\"\")","v":""}]
["Dades orientatives: Vedells frisons de 150 a 650 kg; GPV de 0,8 a 1,6 kg. Pv adult = 750 kg\n"]
["Dades orientatives: Vedells altres lleteres i creuaments Xarolés de 200 a 550 kg; GPV d'1 a 1,6 kg; Pv adult = 750 kg\n"]
["Dades orientatives: Vedells rústiques de 250 a 800 kg; GPV d'1 a 2 kg; Pv adult = 750 kg",null,null,null,null,null,null,"Padult",{"$f":"450*EXP(I9*(1-EXP(-J9*B9)))","v":29546986111.798729},{"$f":"J9*I32*LN((D9*EXP(I9))/I32)","v":-20644405017598.027},null,{"$f":"(I32-D9)/B9","v":65659969.135958508}]
["Dades orientatives: Vedells carn gran format (Llemosina, Blonda) de 300 a 650 kg; GPV d'1 a 2 kg; Pv adult = 900 kg\n\n"]
["Dades orientatives: Vedells carn tardanes  (Xarolés i creuaments alletants) de 300 a 700 kg; GPV d'1 a 2 kg; Pv adult = 900 kg\n"]
[]
[]
[]
["Pes naixement 47 kg. Deslletament a 6-8 mesos. Vedell de 15 mesos Pv = 550 kg. Guany mitjà diari 1.400 g. IC (4,6) Rendiment a la canal 65-70%. Rendiment carnisser 79-85% carn.",null,null,null,null,null,null,null,null,null,null,null,null,null,null,null,null,null,null,null,null,null,"Charolais"]
["Pes naixement 42 kg. Deslletament a 7-8 mesos. Vedell de 15 mesos Pv = 550 kg Guany mitjà diari 1.500 g. Rendiment canal 70%. Rendiment carnisser 73% carn.",null,null,null,null,null,null,null,null,null,null,null,null,null,null,null,null,null,null,null,null,null,"Limousin"]
["Guany mitjà diari 1.500 a 1.700 g. Aprofitament dels vedells en escorxador de 65 fins a 68 %. Aprofitament de carn neta 75% fins a 80 %.",null,null,null,null,null,null,null,null,null,null,null,null,null,null,null,null,null,null,null,null,null,"Blonde d’Aquitaine"]
["Guany mitjà diari:  1.400 g. Vedell a  12 mesos (480 kg); Vedell 15-16 mesos (650 kg); Precoç; Edat al primer part 32 mesos; Rendiment canal 66%. ",null,null,null,null,null,null,null,null,null,null,null,null,null,null,null,null,null,null,null,null,null,"Blanc blau belga"]
["Pes naixement 47 kg. Guany mitjà diari: 1.300 a 1.400 g. Vedell a 12 mesos (510 kg); Rendiments canal de 57 a 60%. ",null,null,null,null,null,null,null,null,null,null,null,null,null,null,null,null,null,null,null,null,null,"Fleckvieh-Simmenthal"]
["Guany mitjà diari: 1.560 g. IC (4,1) fins 460 kg.; Guany mitjà diari: 1.580 g. IC (4,3) fins 550 kg. Rendiment canal: 60%. Rendiment carnisser 73% carn, 8,8% greix, 18,1% os. Producció de añojo (anoll): cicle curt (14 mesos i 500 kg), cicle mitjà (18 mesos i 600 kg). Guany mitjà diari:1.400 g. IC (4,2) fins 460 kg.; Guany mitjà diari:1.530 g. IC (4,3) fins 550 kg.; Rendiment canal: 64%. Rendiment carnisser 76,9% carn, 7,1% greix, 16% os.",null,null,null,null,null,null,null,null,null,null,null,null,null,null,null,null,null,null,null,null,null,"Rubia Gallega"]
["Vedells 9-10 mesos (300-350 kg), Vedells 12 mesos (430 kg). Anoll pesat (550-600 kg). Guany mitjà diari:1.540 g. IC (4,3) fins 300 kg.; Guany mitjà diari:1.670 g. IC (4,1) fins 460 kg.; Guany mitjà diari:1.750 g. IC (4,3) fins 550 kg.",null,null,null,null,null,null,null,null,null,null,null,null,null,null,null,null,null,null,null,null,null,"Pirinenca"]
["Vedells “pastero”  5-6 mesos (120-130 kg).  ",null,null,null,null,null,null,null,null,null,null,null,null,null,null,null,null,null,null,null,null,null,"Tudanca"]
["Vedell 12 mesos (323 kg), Guany mitjà diari:1.940 g. IC (3,6) fins 300 kg.; Guany mitjà diari:1.350 g. IC (4,4) fins 460 kg.; Guany mitjà diari:1.590 g. IC (4,6) fins 550 kg.",null,null,null,null,null,null,null,null,null,null,null,null,null,null,null,null,null,null,null,null,null,"Avileña-Negra Iberica"]
["Vedell 12 mesos (393 kg). Guany mitjà diari:1.360 g. IC (5,1) fins 300 kg.; Guany mitjà diari:1.510 g. IC (4,8) fins 460 kg.; Guany mitjà diari:1.400 g. IC (5,1) fins 550 kg.",null,null,null,null,null,null,null,null,null,null,null,null,null,null,null,null,null,null,null,null,null,"Retinto"]
["Vedell pastero 5-9 mesos (pesos escassos i variables). Guany mitjà diari:1.200 g. IC (4,1) fins 300 kg.; Guany mitjà diari:1.240 g. IC (4,6) fins 460 kg.; Guany mitjà diari:1.280 g. IC (4,9) fins 550 kg. Rendiment canal: 56%. ",null,null,null,null,null,null,null,null,null,null,null,null,null,null,null,null,null,null,null,null,null,"Morucha"]
["Pes mitjà vaques 600-700 kg, mascles 800-1.100 kg. Pes viu sacrifici 550 kg.  Guany mitjà diari:1.850 g. IC (3,9) fins 300 kg.; Guany mitjà diari: 1.690 g. IC (4,1) fins 460 kg.; Guany mitjà diari: 1.740 g. IC (4,2) fins 550 kg. Rendiment canal: 60,9%. Rendiment carnisser: 71,7% carn, 10% greix, 18,3% os.",null,null,null,null,null,null,null,null,null,null,null,null,null,null,null,null,null,null,null,null,null,"Bruna, Parda"]
[]
["Frisona-Holstein; Bruna Suïssa; Jersey; Ayshire;  Guernsey; Menorquina; Shorthorn; Tarentaise;  Normanda; Montbeliarda; Abondance; Danesa  vermella; Bretona; Simental o Fleckvieh, etc."]
["Blonde d’Aquitaine; Charolaise; Blanc blau belga;  Limousin; Hereford; Aberdeen angus;  Shorthorn  Durhan; Piamontesa; Rubia Gallega;  Asturiana de los  valles; Retinta; Bruna; etc.",null,null,null,null,null,null,null,null,null,null,null,null,null,null,null,null,null,null,null,null,null,"Llet "]
["Brunes, Aubrac, Salers, Retinta, Avilenya,  Morucha, Cachena, Tudanca, Asturiana de los montes, etc.",null,null,null,null,null,null,null,null,null,null,null,null,null,null,null,null,null,null,null,null,null,"Carn"]
[null,null,null,null,null,null,null,null,null,null,null,null,null,null,null,null,null,null,null,null,null,null,"Rústiques"]
[]
["Fase d’engreix (del deslletament endavant): En el punt d’inflexió el creixement és màxim, el pes a la pubertat és 2/3 del pes adult. Si l’alimentació és adequada les vedelles de raça lletera arriben a la pubertat entre 9 i 11 mesos, i els vedells entre 11 i 12 mesos. A les races de carn el període és més llarg. "]

{"sheet":"I_Necessitats","index":7,"n_rows":39,"n_cols":15,"rows_kept":39,"cut":false,"hidden":false,"merged":[[3,9,9,13],[41,0,62,5],[41,6,51,9],[52,6,62,9],[46,10,56,13],[17,4,17,5],[18,4,18,5],[12,4,12,6],[3,14,9,16],[10,9,13,16],[0,9,0,16],[2,0,3,8],[4,1,4,6],[1,9,1,13],[1,14,1,16],[0,0,1,8],[10,3,10,5],[11,3,11,4],[11,5,11,6],[11,1,11,2],[12,1,12,2],[7,1,7,2],[8,1,8,2],[9,3,9,5]]}
["Producció de carn: Engreix i finalització",null,null,null,null,null,null,null,null,"Guies"]
[null,null,null,null,null,null,null,null,null,"Característiques d'algunes races",null,null,null,null,"Races de llet, carn, rústiques"]
[null,null,null,null,null,null,null,null,null,7,null,null,null,null,1]
[null,null,null,null,null,null,null,null,null,{"$f":"IF(J3=1,NR!A38,IF(J3=2,NR!A39,IF(J3=3,NR!A40,IF(J3=4,NR!A41,IF(J3=5,NR!A42,IF(J3=6,NR!A43,IF(J3=7,NR!A44,IF(J3=8,NR!A45,IF(J3=9,NR!A46,IF(J3=10,NR!A47,IF(J3=11,NR!A48,IF(J3=12,NR!A49))))))))))))","v":"Vedells 9-10 mesos (300-350 kg), Vedells 12 mesos (430 kg). Anoll pesat (550-600 kg). Guany mitjà diari:1.540 g. IC (4,3) fins 300 kg.; Guany mitjà diari:1.670 g. IC (4,1) fins 460 kg.; Guany mitjà diari:1.750 g. IC (4,3) fins 550 kg."},null,null,null,null,{"$f":"IF(O3=1,NR!A51,IF(O3=2,NR!A52,IF(O3=3,NR!A53)))","v":"Frisona-Holstein; Bruna Suïssa; Jersey; Ayshire;  Guernsey; Menorquina; Shorthorn; Tarentaise;  Normanda; Montbeliarda; Abondance; Danesa  vermella; Bretona; Simental o Fleckvieh, etc."}]
[null,"Elegir tipus de boví"]
[null,null,9]
[null,"Dades orientatives"]
[null,"Pes viu inicial a partir de",null,{"$f":"NR!B16","v":200}]
[null,"Pes viu final fins a ",null,{"$f":"NR!C16","v":520},"Pes adult",{"$f":"NR!K16","v":897.50381095966964},null,"GMD,Kg/dia objectiu",0.8]
[null,"Pes inici",200,"Per al pes inicial: GMD, kg/dia al voltant de...",null,null,{"$f":"NR!O16","v":0.75065000000000004},2,{"$f":"IF(I9>1.15*G10,\"GMD excessiu\",IF(I9<0.85*G10,\"GMD tan baix?\",\"GMD normal\"))","v":"GMD normal"}]
[null,"GMD, kg/dia",{"$f":"IF(H10=1,I9,G10)","v":0.75065000000000004},"Període racionament, temps en dies",null,null,{"$f":"IF(H10=1,H13,I13)","v":559.5150869246653},"Pes final",null,"Fase d’engreix (del deslletament endavant): En el punt d’inflexió el creixement és màxim, el pes a la pubertat és 2/3 del pes adult. Si l’alimentació és adequada les vedelles de raça lletera arriben a la pubertat entre 9 i 11 mesos, i els vedells entre 11 i 12 mesos. A les races de carn el període és més llarg. "]
[null,{"$f":"IF(C11>1.15*G10,\"GMD excessiu\",IF(C11<0.85*G10,\"GMD tan baix?\",\"GMD normal\"))","v":"GMD normal"},null,"Possible pes final assolit",null,{"$f":"H12","v":620},null,620,"teòric"]
[null,"Necessitats Totals",null,null,"Període racionament, temps en dies",null,null,{"$f":"(H12-C10)/C11","v":559.5150869246653},{"$f":"(H12-C10)/G10","v":559.5150869246653}]
[null,{"$f":"IF(C6>=8,\"UFL\",\"UFV\")","v":"UFL"},{"$f":"NR!BE16","v":3.6699045102861678},null,"Dades per al racionament"]
[null,"PDI",{"$f":"NR!BF16","v":363.33724465234457},null,"Elegir modalitat racionament"]
[null,"Ca",{"$f":"NR!BI16","v":13.266735984598695},null,2]
[null,"P",{"$f":"NR!BH16","v":10.762596481007826}]
[null,"CI, UEB",{"$f":"NR!BG16","v":3.6676260362049162},null,"Tolerància càlculs (%)",null,12.5,null,{"$f":"E16","v":2}]
[null,"Mg",{"$f":"NR!BJ16","v":5.8612031250000003},null,"Mínim % MS Farratge",null,40]
[null,"Cl",{"$f":"NR!BK16","v":5.8612031250000003},null,{"$f":"IF(C10<D8,\"Pes inferior a tipus de boví\",IF(C10>0.9*F9,\"Valor superior a pes adult\",\"\"))","v":""},null,"                                                                                                                                 "]
[null,"K",{"$f":"NR!BL16","v":24.37470096161568},null,{"$f":"IF(H12<=C10,\"Ha de ser superior al pes inicial\",IF(H12>=0.9*F9,\"Valor massa alt\",\"\"))","v":""}]
[null,"Na",{"$f":"NR!BM16","v":4.091828282828283}]
[null,"S",{"$f":"NR!BN16","v":10.104762204195472}]
[null,"Co",{"$f":"NR!BO16","v":0.55576192123075097}]
[null,"Cu",{"$f":"NR!BP16","v":57.081187499999999}]
[null,"Mo",{"$f":"NR!BQ16","v":0}]
[null,"Iode",{"$f":"NR!BR16","v":1.2}]
[null,"Fe",{"$f":"NR!BS16","v":255.221}]
[null,"Mn",{"$f":"NR!BT16","v":123.39400000000001}]
[null,"Se",{"$f":"NR!BU16","v":1.5157143306293208}]
[null,"Zn",{"$f":"NR!BV16","v":180.10400000000001}]
[null,"Vit A",{"$f":"NR!BW16","v":22000}]
[null,"Vit D",{"$f":"NR!BX16","v":3200}]
[null,"Vit E",{"$f":"NR!BY16","v":520}]
[null,"Gproteïnes/EfPDI",{"$f":"NR!AI16*1000/NR!AT16","v":194.40354733884502}]
[null,"CI, MSI",{"$f":"NR!AX16","v":5.0523811020977361}]
[null,"EfPDI",{"$f":"NR!AT16","v":0.64}]
[null,"BPR màxim",{"$f":"NR!AU16","v":-2}]
[null,"BPR mínim",{"$f":"NR!AV16","v":-7.5}]

{"sheet":"II_Plantejar Ració","index":8,"n_rows":81,"n_cols":15,"rows_kept":81,"cut":false,"hidden":false,"merged":[[27,4,27,6],[32,4,32,5],[9,12,9,13],[7,13,7,14],[8,12,8,13],[9,7,9,9],[16,7,16,9],[17,7,17,9],[15,7,15,9],[19,11,21,11],[19,12,21,12],[10,7,10,9],[18,7,18,11],[14,7,14,9],[10,11,10,12],[11,7,11,9],[0,0,0,6],[1,0,2,0],[1,1,1,2],[1,3,1,5],[2,7,3,9],[0,7,1,14],[12,7,12,9],[13,7,13,9],[4,7,4,9],[5,7,5,9],[6,7,6,9],[7,7,7,9],[8,7,8,9]]}
["Selecció d'ingredients, límits d'incorporació i preu",null,null,null,null,null,null,"Full no protegit. Només s'han de seleccionar els ingredients, i per a cadascun d'ells afegir les quantitats mínimes i màximes, que mai no han de ser negatives, i el preu de cadacun d'ells"]
[null,"Límits d'incorporació",null,"Càlculs",null,null,"Preu Ingredient"]
[null,"kg mín","kg màx","kg fresc","kg MS","% fresc ració","€/kg fresc","kg fresc total"]
[null,0,100,2.9986070762314747,{"$f":"D4*CàlculsEV!D3/100","v":2.6987463686083273},{"$f":"(D4*100)/$K$4","v":65.996205589564497},0.04,null,null,null,{"$f":"SUM(D4:D26)","v":4.5436052716121944},{"$f":"K22","v":89.673466754531688},"%MS"]
[0,0,5,0,{"$f":"D5*CàlculsEV!D4/100","v":0},0,0.03,"kg farratge fresc total",null,null,{"$f":"SUM(D4:D8)","v":2.9986070762314747}]
[0,0,0,0,{"$f":"D6*CàlculsEV!D5/100","v":0},0,0.03,"kg concentrat fresc total",null,null,{"$f":"K4-K5","v":1.5449981953807197}]
[0,0,0,0,{"$f":"D7*CàlculsEV!D6/100","v":0},0,0.01,"Aportacions totals UE",null,null,{"$f":"SUMPRODUCT($E$4:$E$8,CàlculsEV!E3:E7)","v":2.8041681860355374},{"$f":"L23","v":0.8477713070826226},"UE/kg MS"]
[0,0,0,0,{"$f":"D8*CàlculsEV!D7/100","v":0},0,0.03,"kg MS total",null,null,{"$f":"SUM(E4:E26)","v":4.0744083626963112},{"$f":"I_Necessitats!C36","v":5.0523811020977361},{"$f":"K8-L8","v":-0.97797273940142482},"<--- Diferència MSI real i calculada"]
[0,0,0,0,{"$f":"D9*CàlculsEV!D8/100","v":0},0,0.21,"kg MS total farratge",null,null,{"$f":"SUM(E4:E8)","v":2.6987463686083273},null,{"$f":"I_Necessitats!E18","v":"Tolerància càlculs (%)"},null,{"$f":"I_Necessitats!G18","v":12.5}]
[0,0,4,1.3189427160712417,{"$f":"D10*CàlculsEV!D9/100","v":1.1501180484141229},29.028549735863063,0.21,"kg MS total concentrat",null,null,{"$f":"K8-K9","v":1.375661994087984},{"$f":"K7/K9","v":1.0390632549443961},{"$f":"I_Necessitats!E19","v":"Mínim % MS Farratge"},null,{"$f":"I_Necessitats!G19","v":40}]
[0,0,6,-3.9970966317260535E-5,{"$f":"D11*CàlculsEV!D10/100","v":-3.5973869685534481E-5},-8.7971916414028095E-4,0.3,"% MS farratge a la ració",null,null,{"$f":"(K9*100)/K8","v":66.236521437492442}]
[0,0,8,0,{"$f":"D12*CàlculsEV!D11/100","v":0},0,0.64300000000000002,"PCO",null,null,{"$f":"(K10)/K8","v":0.33763478562507548},"Auxiliar càlcul Sg","A",{"$f":"IF(N17-0.85<0,1,1-(1.26*(N17-0.85)^0.84))","v":0.68902853850027845}]
[0,0,2,2.7460064882977688E-7,{"$f":"D13*CàlculsEV!D12/100","v":2.3945176577956544E-7},6.0436730836950788E-6,0.15,"Relació UF/UEB farratge",null,null,{"$f":"SUMPRODUCT($E$4:$E$8,CàlculsEV!$F$3:$F$7)/SUMPRODUCT($E$4:$E$8,CàlculsEV!$E$3:$E$7)","v":0.75695478048708553},null,"D",{"$f":"(1/N17)-N12","v":0.27337677728919529}]
[0,0,0,0,{"$f":"D14*CàlculsEV!D13/100","v":0},0,0.12,"Taxa de substitució global",null,null,{"$f":"(0.86/N17)*(1-N15*EXP(-N14/(1-K12)))","v":0.62556183572352986},null,"B",{"$f":"N17/(2.04*N13)","v":1.8631602064613679}]
[0,0,0,0,{"$f":"D15*CàlculsEV!D14/100","v":0},0,0.312,null,null,null,null,null,"K",{"$f":"N17*N13*EXP(N14/0.7)","v":4.0676796647755982}]
[0,0,0,0,{"$f":"D16*CàlculsEV!D15/100","v":0},0,0.215,"VALOR FUNCIÓ OBJECTIU €/ració",null,null,{"$f":"SUMPRODUCT(D4:D26,G4:G26)","v":0.42586206543167809},null,"UEc",{"$f":"0.86*(1-N15*EXP(-N14/(1-K12)))","v":0.64999831719588264},{"$f":"N16/N17","v":0.62556183572352997}]
[0,0,0.5,4.2791662284867861E-5,{"$f":"D17*CàlculsEV!D16/100","v":3.9924620911781713E-5},9.4179973230122205E-4,0.14599999999999999,"COST PART FARRATGERA",null,null,{"$f":"SUMPRODUCT(D4:D8,G4:G8)","v":0.11994428304925898},null,"UEf",{"$f":"K7/K9","v":1.0390632549443961}]
[null,0,0.2,0.2,{"$f":"D18*CàlculsEV!D17/100","v":0.19980000000000003},4.4017908256593463,0.13600000000000001,"COST PART CONCENTRADA",null,null,{"$f":"K16-K17","v":0.30591778238241912}]
[0,0,0.3,1.06825498127418E-8,{"$f":"D19*CàlculsEV!D18/100","v":1.0575724314614382E-8},2.3511174880187911E-7,0.438,"Paràmetres nutritius, límits, valors finals"]
[0,0,0,0,{"$f":"D20*CàlculsEV!D19/100","v":0},0,0.6,"Paràmetres","Mínim","Màxim","Valor","Valor/kg MS o %","En alguns ingredients de la ració no hi consten els nutrients ..."]
[0,0,1,3.7330715914718265E-9,{"$f":"D21*CàlculsEV!D20/100","v":3.7330715914718265E-9},8.2161001414351108E-8,0.28999999999999998,"MSI (kg/dia)",0,999,{"$f":"K8","v":4.0744083626963112}]
[0,0,1,2.6052369597239881E-2,{"$f":"D22*CàlculsEV!D21/100","v":2.5739741162073001E-2},0.57338540739908495,6.7000000000000004E-2,"%MS ració",0,999,{"$f":"SUMPRODUCT(F4:F26,CàlculsEV!D3:D25)/100","v":89.673466754531688}]
[null,0,0,0,{"$f":"D23*CàlculsEV!D22/100","v":0},0,0.28499999999999998,"UEB",{"$f":"((100-$O$9)/100)*I_Necessitats!C18","v":3.2091727816793019},{"$f":"I_Necessitats!C18","v":3.6676260362049162},{"$f":"CàlculsEV!E26+0.86*(1-'II_Plantejar Ració'!N15*EXP(-'II_Plantejar Ració'!N14/(1-'II_Plantejar Ració'!K12)))","v":3.4541665032314199},{"$f":"K23/$K$8","v":0.8477713070826226},{"$f":"CàlculsEV!AN$21","v":""}]
[null,0,0,0,{"$f":"D24*CàlculsEV!D23/100","v":0},0,0.01,{"$f":"I_Necessitats!B14","v":"UFL"},{"$f":"IF(I_Necessitats!E16=2,((100-$O$9)/100)*I_Necessitats!C14,((100-$O$9)/100)*I_Necessitats!C14*B47/B48)","v":3.2111664465003971},{"$f":"IF(I_Necessitats!E16=2,((100+$O$9)/100)*I_Necessitats!C14,((100+$O$9)/100)*I_Necessitats!C14*B47/B48)","v":4.1286425740719386},{"$f":"CàlculsEV!F26","v":4.0848623018708468},{"$f":"K24/$K$8","v":1.0025657563611561},{"$f":"CàlculsEV!AO$21","v":""}]
[null,0,0,0,{"$f":"D25*CàlculsEV!D24/100","v":0},0,0.01,"PDI",{"$f":"((100-$O$9)/100)*(G32+(G33+M8*0.5*(5.7+0.074*B57)/B79)*G34/B79)","v":264.0229841836063},{"$f":"((100+$O$9)/100)*(G32+(G33+M8*0.5*(5.7+0.074*B57)/B79)*G34/B79)","v":339.45812252177956},{"$f":"CàlculsEV!G26","v":313.3377464958175},{"$f":"K25/$K$8","v":76.903863973139096},{"$f":"CàlculsEV!AP$21","v":""}]
[null,0,0,0,{"$f":"D26*CàlculsEV!D25/100","v":0},0,0.01,"BPR",{"$f":"ABS(I_Necessitats!C39)","v":7.5},{"$f":"ABS(I_Necessitats!C38)","v":2},{"$f":"CàlculsEV!H26","v":30.54371661296749},{"$f":"ABS(K26/K21)","v":7.4964789716744669},{"$f":"CàlculsEV!AQ$21","v":""}]
[null,null,null,null,null,{"$f":"SUM(F4:F26)","v":99.999999999999986},null,"NI",{"$f":"CàlculsEV!I26","v":2.0339419661111404},{"$f":"CàlculsEV!I26","v":2.0339419661111404},{"$f":"K21*100/I_Necessitats!C10","v":2.0372041813481556},{"$f":"K27","v":2.0372041813481556},{"$f":"CàlculsEV!AR$21","v":""}]
["Efecte NI",null,null,null,{"$f":"I_Necessitats!B7","v":"Dades orientatives"},null,null,"Ca",{"$f":"((100-$O$9)/100)*I_Necessitats!C16","v":11.608393986523858},{"$f":"(100+$O$9)/100*I_Necessitats!C16","v":14.925077982673532},{"$f":"CàlculsEV!J26","v":14.001250558643488},{"$f":"K28/$K$8","v":3.436388626833152},{"$f":"CàlculsEV!AS$21","v":""}]
["NIref",{"$f":"J27","v":2.0339419661111404},null,null,null,"CI",{"$f":"I_Necessitats!C18","v":3.6676260362049162},"P",{"$f":"((100-$O$9)/100)*I_Necessitats!C17","v":9.4172719208818485},{"$f":"(100+$O$9)/100*I_Necessitats!C17","v":12.107921041133803},{"$f":"CàlculsEV!K26","v":9.4172719128748898},2.3113225466292842,{"$f":"CàlculsEV!AT21","v":""}]
["NI % PV",{"$f":"K27","v":2.0372041813481556},null,null,null,"UFV",{"$f":"I_Necessitats!C14","v":3.6699045102861678},"Mg",{"$f":"((100-$O$9)/100)*I_Necessitats!C19","v":5.1285527343749999},{"$f":"(100+$O$9)/100*I_Necessitats!C19","v":6.5938535156250007},{"$f":"CàlculsEV!L26","v":1.6237633889098109},0.39852740431625683,{"$f":"CàlculsEV!AU21","v":"Mg"}]
["dMOm",{"$f":"76-2.74*B30","v":70.418060543106051},null,null,null,"PDI",{"$f":"I_Necessitats!C15","v":363.33724465234457},"K",{"$f":"((100-$O$9)/100)*I_Necessitats!C21","v":21.327863341413721},{"$f":"(100+$O$9)/100*I_Necessitats!C21","v":27.421538581817639},{"$f":"CàlculsEV!M26","v":6.4136015911240944},1.5741185026627476,{"$f":"CàlculsEV!AV21","v":"K"}]
["Δ dMO_NI ",{"$f":"-2.74*(B30-B29)/100","v":-8.9384697494216433E-5},null,null,null,"NecPDI_PUendo",{"$f":"B68","v":62.4},"Na",{"$f":"((100-$O$9)/100)*I_Necessitats!C22","v":3.5803497474747479},{"$f":"(100+$O$9)/100*I_Necessitats!C22","v":4.6033068181818182},{"$f":"CàlculsEV!N26","v":0.42310661638329106},0.10384492145094971,{"$f":"CàlculsEV!AW21","v":"Na"}]
["Efecte %Co (PCO)",null,null,null,"PDI - NecPDI_PUendo",null,{"$f":"G31-G32","v":300.93724465234459},"S",{"$f":"((100-$O$9)/100)*I_Necessitats!C23","v":8.8416669286710388},{"$f":"(100+$O$9)/100*I_Necessitats!C23","v":11.367857479719905},{"$f":"CàlculsEV!O26","v":0.28313717276281358},6.9491604070693241E-2,{"$f":"CàlculsEV!AX21","v":"S"}]
["PCO",{"$f":"K12","v":0.33763478562507548},null,null,null,"EfPDI",{"$f":"I_Necessitats!C37","v":0.64},"Cl",{"$f":"((100-$O$9)/100)*I_Necessitats!C20","v":5.1285527343749999},{"$f":"(100+$O$9)/100*I_Necessitats!C20","v":6.5938535156250007},{"$f":"CàlculsEV!P26","v":1.0295916444839778E-2},2.5269721462151807E-3,{"$f":"CàlculsEV!AY21","v":"Cl"}]
["Δ dMO_CO ",{"$f":"IF(B34=0,0,(-6.5/(1+(0.35/B34)^3))/100)","v":-3.0748241882195999E-2},null,null,null,null,null,"Co",{"$f":"((100-$O$9)/100)*I_Necessitats!C24","v":0.48629168107690712},{"$f":"(100+$O$9)/100*I_Necessitats!C24","v":0.62523216138459481},{"$f":"CàlculsEV!Q26","v":1.1497857833220966E-2},2.8219699180108831E-3,{"$f":"CàlculsEV!AZ21","v":"Co"}]
["Efecte balanç proteic rumen",null,null,null,null,null,null,"Cu",{"$f":"((100-$O$9)/100)*I_Necessitats!C25","v":49.946039062499999},{"$f":"(100+$O$9)/100*I_Necessitats!C25","v":64.216335937499991},{"$f":"CàlculsEV!R26","v":5.101386374250934},1.2520557391736262,{"$f":"CàlculsEV!AN$21","v":""}]
["MNT ingerida",{"$f":"L45","v":147.53011889997393},null,null,null,null,null,"Mn",{"$f":"((100-$O$9)/100)*I_Necessitats!C29","v":107.96975},{"$f":"(100+$O$9)/100*I_Necessitats!C29","v":138.81825000000001},{"$f":"CàlculsEV!S26","v":20.239803795385711},4.9675442404579364,{"$f":"CàlculsEV!BB21","v":"Mn"}]
["MOrD o MOF",{"$f":"L57","v":529.17249760402274},null,null,null,null,null,"Zn",{"$f":"((100-$O$9)/100)*I_Necessitats!C31","v":157.59100000000001},{"$f":"(100+$O$9)/100*I_Necessitats!C27","v":1.3499999999999999},{"$f":"CàlculsEV!T26","v":28.060573160756306},6.8870301312131437,{"$f":"CàlculsEV!BC21","v":"Zn"}]
["MNrD_rumen (MNF) fermentades rumen",{"$f":"B37*L56","v":95.100346109448282},null,null,null,null,null,"Iode",{"$f":"((100-$O$9)/100)*I_Necessitats!C27","v":1.05},{"$f":"(100+$O$9)/100*I_Necessitats!C27","v":1.3499999999999999},{"$f":"CàlculsEV!U26","v":1.9980010575724315E-8},4.903782045671581E-9,{"$f":"CàlculsEV!BD21","v":"Iode"}]
["MN alim_duodè (PIA) no ferm a rumen",{"$f":"B37*(1-L56)","v":52.429772790525654},null,null,null,null,null,"Se",{"$f":"((100-$O$9)/100)*I_Necessitats!C30","v":1.3262500393006558},{"$f":"(100+$O$9)/100*I_Necessitats!C30","v":1.7051786219579859},{"$f":"CàlculsEV!V26","v":2.29999106677682E-2},5.6449694336842575E-3,{"$f":"CàlculsEV!BE21","v":"Se"}]
["MN microbiana intestí ( 41,7 + 71,9 x 10^-3 x MOrD_rumen + 8,40 x PCO)",{"$f":"41.7+(B38*71.9*10^-3)+6.4*B34","v":81.908365205729737},null,null,null,null,null,"Vit A",{"$f":"((100-$O$9)/100)*I_Necessitats!C32","v":19250},{"$f":"(100+$O$9)/100*I_Necessitats!C32","v":24750},{"$f":"CàlculsEV!W26","v":136347.17647883049},33464.288392683433,{"$f":"CàlculsEV!BF21","v":"Vit A"}]
["MN endogena",14.2,null,null,null,null,null,"Vit D",{"$f":"((100-$O$9)/100)*I_Necessitats!C33","v":2800},{"$f":"(100+$O$9)/100*I_Necessitats!C33","v":3600},{"$f":"CàlculsEV!X26","v":134.93731845039636},33.118260723650003,{"$f":"CàlculsEV!BG21","v":"Vit D"}]
["BPR ració",{"$f":"B37-(B40+B41+B42)","v":-1.0080190962814584},null,null,null,null,null,"Vit E",{"$f":"((100-$O$9)/100)*I_Necessitats!C34","v":455},{"$f":"(100+$O$9)/100*I_Necessitats!C34","v":585},{"$f":"CàlculsEV!Y26","v":61.226965252163367},15.027203903450991,{"$f":"CàlculsEV!BH21","v":"Vit E"}]
["BPR ref",{"$f":"-L26","v":-7.4964789716744669},null,null,null,null,null,"AG",null,null,{"$f":"CàlculsEV!Z26","v":275.78064126875262},67.686058126547223,{"$f":"CàlculsEV!BI21","v":"AG"}]
["Δ dMO_BPR",{"$f":"(0.06*(B43-B44))/100","v":3.8930759252358048E-3},null,null,null,null,null,"MNT_PB",null,null,{"$f":"CàlculsEV!AA26","v":601.09795019563489},147.53011889997393,{"$f":"CàlculsEV!BJ21","v":""}]
[null,null,null,null,null,null,null,"PDIA",null,null,{"$f":"CàlculsEV!AB26","v":144.1401607162525},35.376954857039713,{"$f":"CàlculsEV!BK21","v":""}]
["∑ dMO x PMO",{"$f":"K47","v":0.68251766784696088},null,null,null,null,null,"dMO",null,{"$f":"B48","v":0.65557311719250644},{"$f":"CàlculsEV!AC26","v":0.68251766784696088},{"$f":"J47","v":0.65557311719250644},{"$f":"CàlculsEV!BL21","v":""}]
["Efecte total interaccions",{"$f":"B47+(B32+B35+B45)","v":0.65557311719250644},null,null,null,null,null,"MOD",null,null,{"$f":"CàlculsEV!AD26","v":2470.4892436617943},{"$f":"K48/$K$8","v":606.34306229111132},{"$f":"CàlculsEV!BM21","v":""}]
[null,null,null,null,null,null,null,"EE",null,null,{"$f":"CàlculsEV!AE26","v":291.62051543584835},{"$f":"K49/($K$8*10)","v":7.1573708248248185},{"$f":"CàlculsEV!BN21","v":""}]
["MODc_rumen (MOF corregida)",{"$f":"B38*B48/B47","v":508.28173412882302},null,null,null,null,null,"FB",null,null,{"$f":"CàlculsEV!AF26","v":844.73936319738277},{"$f":"K50/$K$8","v":207.32810459832299},{"$f":"CàlculsEV!BO21","v":""}]
["PANDI",{"$f":"0.193*B40","v":10.118946148571451},null,null,null,null,null,"NDF",null,null,{"$f":"CàlculsEV!AG26","v":1812.5415021185242},444.86004856887814,{"$f":"CàlculsEV!BP21","v":""}]
["dr",{"$f":"(B40-B51)/B40","v":0.80699999999999994},null,null,null,null,null,"ADF",null,null,{"$f":"CàlculsEV!AH26","v":1019.3133779540362},250.1745743716979,{"$f":"CàlculsEV!BQ21","v":""}]
["PDIA",{"$f":"B37*(1-L56)*B52","v":42.310826641954201},null,null,null,null,null,"Lignina",null,null,{"$f":"CàlculsEV!AI26","v":121.74889066688635},29.881366772553179,{"$f":"CàlculsEV!BR21","v":""}]
["MN microbianes_duodè (corregida)",{"$f":"40.7+75.6*10^-3*B50+8.07*B34-0.0114*B43","v":81.862303237830986},null,null,null,null,null,"cendres",null,null,{"$f":"CàlculsEV!AJ26","v":225.68755290289488},55.391490693275081,{"$f":"CàlculsEV!BS21","v":""}]
["PDI = PDIA + MN microbianes_duodè x 0,8 x 0,8",{"$f":"B53+B54*0.8*0.8","v":94.702700714166042},null,null,null,null,null,"Mo",null,null,{"$f":"CàlculsEV!AK26","v":0.34501799830846597},8.4679287787477506E-2,{"$f":"CàlculsEV!BT21","v":"Mo"}]
["flux de N duodenal endogen (Actualització)",null,null,null,null,null,null,"DT_N",null,null,{"$f":"CàlculsEV!AL26","v":0.64461648115342962},{"$f":"K56","v":0.64461648115342962},{"$f":"CàlculsEV!BU21","v":"DT_N"}]
["MOND = MO - MODc_rumen",{"$f":"L58-B50","v":416.62358366055958},null,null,null,null,null,"MOF",null,null,{"$f":"CàlculsEV!AM26","v":2156.064849546724},{"$f":"K57/K21","v":529.17249760402274},{"$f":"CàlculsEV!BV21","v":"MOF"}]
["N duodenal endo, g MNT/kg MSI = 14,2 x MSI",{"$f":"14.2*K8","v":57.856598750287617},null,null,null,null,null,"MO",null,null,{"$f":"K48/L47","v":3768.4419615033498},{"$f":"K58/K21","v":924.90531778938259},{"$f":"CàlculsEV!AN$21","v":""}]
["PÈRDUES FECALS ENDÒGENES (PEF)  i (NEC_PDI Actualització)",null,null,null,null,null,null,"PDI/UFL",{"$f":"((100-$O$9)/100)*I_Necessitats!C15/I_Necessitats!C14","v":86.6289812663303},{"$f":"((100+$O$9)/100)*I_Necessitats!C15/I_Necessitats!C14","v":111.38011877099609},{"$f":"K25/K24","v":76.707052365586563},{"$f":"K59","v":76.707052365586563}]
["MNND = 0,163 x MN alim_duodè + 0,20 x MN mic_duodè + 5,7 + 0,074 x MOND",{"$f":"0.163*B40+0.2*B54+5.7+0.074*B57","v":61.448658803303282}]
["PEF (proteïnes endogenes fecals) = 5,7 + 0,074 x MOND",{"$f":"5.7+0.074*B57","v":36.530145190881406}]
["Nec PDI_PEF = MSI x [0,5 x (5,7 + 0,074 x MOND)]/EfPDI",{"$f":"K8*(0.5*(5.7+0.074*B57))/B79","v":100.54247404393914}]
["PÈRDUES ENDÒGENES URINÀRIES i (NEC_PDI Actualització)"]
["log10 NU (N urinari g/dia) log10 NU = - 1,17 + 1,00 x log10 Pv",{"$f":"-1.17+LOG10(I_Necessitats!C10)","v":1.1310299956639813}]
["NU",{"$f":"10^B64","v":13.521659507839644}]
["NUNP microbià/NU =  0,3325/(1 + (NU/0,203))",{"$f":"0.3325/(1+(B65/0.203))","v":4.9179726434338752E-3}]
["NU endo",{"$f":"0.05*I_Necessitats!C10","v":10}]
["Nec PDI_NU endo",{"$f":"0.312*I_Necessitats!C10","v":62.4}]
["PÈRDUES NITROGENADES PER L’EPIDERMIS i (Nec_PDI Actualització)"]
["P epidèrmiques (0,2 g PDI/kg Pv0,60)",{"$f":"0.2*I_Necessitats!C10^0.6","v":4.8044977359257235}]
["Nec PDI_P epidèrmiques = 0,2 x Pv0,60/EffPDI",{"$f":"B70/B79","v":6.4909999161032497}]
["Nec_PDI no productives",{"$f":"B62+B68+B71","v":169.43347396004239}]
["Eficàcia de la síntesi proteica en lactació"]
["PDI disponible = PDI ingerida - Nec PDI_NU endògenes",{"$f":"K25-B68","v":250.93774649581749}]
["EfPDI = ∑ despeses prot/PDI disponible = 0,67xEXP(-0,007x(PDI-100)",{"$f":"0.67*EXP(-0.007*(L25-100))","v":0.78756874692573342}]
["Bal EN",{"$f":"K24-G30","v":0.41495779158467894}]
["bal Proteïna ",{"$f":"K25-G31","v":-49.999498156527068}]
["Guany Proteïna",{"$f":"I_Necessitats!C35","v":194.40354733884502}]
["EfPDI = (PEF + P epid + MP + bal Prote)/(PDI disponible)",{"$f":"IF(B76>0,(B61+B70+B78+B77)/B74,(B61+B70+B78)/(B74+ABS(B77)))","v":0.74017836974646178}]
[]
["NUcal=0,79xBPR/6,25 + (PDI/6,25) x (1-E·fPDI)+Nuendo + NUNPmic + 0,47X bal N",{"$f":"(0.79*B43/6.25+(K25/6.25)*(1-B79)+B67/6.25+(B41/6.25)+0.47*ABS(B77)/6.25)/I_Necessitats!C10","v":0.15681897469419862}]

{"sheet":"III_Resultat Ració","index":9,"n_rows":59,"n_cols":14,"rows_kept":59,"cut":false,"hidden":false,"merged":[[1,6,1,8],[0,5,0,6],[8,13,10,13]]}
["Explotació:","Data",{"$f":"TODAY()","v":"2026-06-11"},"Pes inicial",{"$f":"I_Necessitats!C10","v":200},"Temps en dies",null,{"$f":"I_Necessitats!G11","v":559.5150869246653}]
[{"$f":"NR!A16","v":"9.-Vedells precoces Creixement de 6 a 24 mesos"},"GPV, kg/dia",{"$f":"I_Necessitats!C11","v":0.75065000000000004},"Pes final",{"$f":"I_Necessitats!F12","v":620}]
[]
["INGREDIENTS","kg/dia","% MF","kg/tona ","COST",null,"NUTRIENTS","ANÀLISI"]
[{"$f":"IF(B5=\"\",\"\",CàlculsEV!B3)","v":"FENC Civada Inici espigat"},{"$f":"IF('II_Plantejar Ració'!D4=0,\"\",'II_Plantejar Ració'!D4)","v":2.9986070762314747},{"$f":"IF('II_Plantejar Ració'!D4=0,\"\",'II_Plantejar Ració'!F4)","v":65.996205589564497},{"$f":"IF('II_Plantejar Ració'!D4=0,\"\",('II_Plantejar Ració'!D4*1000)/('II_Plantejar Ració'!$K$4))","v":659.96205589564511},{"$f":"IF('II_Plantejar Ració'!D4=0,\"\",'II_Plantejar Ració'!G4*B5)","v":0.11994428304925898},null,"MSI (kg/dia)",{"$f":"'II_Plantejar Ració'!K21","v":4.0744083626963112},"Kg"]
[{"$f":"IF(B6=\"\",\"\",CàlculsEV!B4)","v":""},{"$f":"IF('II_Plantejar Ració'!D5=0,\"\",'II_Plantejar Ració'!D5)","v":""},{"$f":"IF('II_Plantejar Ració'!D5=0,\"\",'II_Plantejar Ració'!F5)","v":""},{"$f":"IF('II_Plantejar Ració'!D5=0,\"\",('II_Plantejar Ració'!D5*1000)/('II_Plantejar Ració'!$K$4))","v":""},{"$f":"IF('II_Plantejar Ració'!D5=0,\"\",'II_Plantejar Ració'!G5*B6)","v":""},null,"%MS ració",{"$f":"'II_Plantejar Ració'!K22","v":89.673466754531688},{"$f":"IF('II_Plantejar Ració'!L23=1,\"g\",\"%\")","v":"%"},"Mínim","Valor càlculs","Màxim"]
[{"$f":"IF(B7=\"\",\"\",CàlculsEV!B5)","v":""},{"$f":"IF('II_Plantejar Ració'!D6=0,\"\",'II_Plantejar Ració'!D6)","v":""},{"$f":"IF('II_Plantejar Ració'!D6=0,\"\",'II_Plantejar Ració'!F6)","v":""},{"$f":"IF('II_Plantejar Ració'!D6=0,\"\",('II_Plantejar Ració'!D6*1000)/('II_Plantejar Ració'!$K$4))","v":""},{"$f":"IF('II_Plantejar Ració'!D6=0,\"\",'II_Plantejar Ració'!G6*B7)","v":""},null,"UEB",{"$f":"'II_Plantejar Ració'!L23","v":0.8477713070826226},"UEB/kg MS",{"$f":"'II_Plantejar Ració'!I23","v":3.2091727816793019},{"$f":"'II_Plantejar Ració'!K23","v":3.4541665032314199},{"$f":"'II_Plantejar Ració'!J23","v":3.6676260362049162},{"$f":"IF(K7>=J7,IF(K7<=L7,\"OK\",\"Excés\"),\"Dèficit\")","v":"OK"}]
[{"$f":"IF(B8=\"\",\"\",CàlculsEV!B6)","v":""},{"$f":"IF('II_Plantejar Ració'!D7=0,\"\",'II_Plantejar Ració'!D7)","v":""},{"$f":"IF('II_Plantejar Ració'!D7=0,\"\",'II_Plantejar Ració'!F7)","v":""},{"$f":"IF('II_Plantejar Ració'!D7=0,\"\",('II_Plantejar Ració'!D7*1000)/('II_Plantejar Ració'!$K$4))","v":""},{"$f":"IF('II_Plantejar Ració'!D7=0,\"\",'II_Plantejar Ració'!G7*B8)","v":""},null,"UFV",{"$f":"'II_Plantejar Ració'!L24","v":1.0025657563611561},"UFV/kg MS",{"$f":"'II_Plantejar Ració'!I24","v":3.2111664465003971},{"$f":"'II_Plantejar Ració'!K24","v":4.0848623018708468},{"$f":"'II_Plantejar Ració'!J24","v":4.1286425740719386},{"$f":"IF(K8>=J8,IF(K8<=L8,\"OK\",\"Excés\"),\"Dèficit\")","v":"OK"}]
[{"$f":"IF(B9=\"\",\"\",CàlculsEV!B7)","v":""},{"$f":"IF('II_Plantejar Ració'!D8=0,\"\",'II_Plantejar Ració'!D8)","v":""},{"$f":"IF('II_Plantejar Ració'!D8=0,\"\",'II_Plantejar Ració'!F8)","v":""},{"$f":"IF('II_Plantejar Ració'!D8=0,\"\",('II_Plantejar Ració'!D8*1000)/('II_Plantejar Ració'!$K$4))","v":""},{"$f":"IF('II_Plantejar Ració'!D8=0,\"\",'II_Plantejar Ració'!G8*B9)","v":""},null,"PDI",{"$f":"'II_Plantejar Ració'!L25","v":76.903863973139096},"g/kg MS",{"$f":"'II_Plantejar Ració'!I25","v":264.0229841836063},{"$f":"'II_Plantejar Ració'!K25","v":313.3377464958175},{"$f":"'II_Plantejar Ració'!J25","v":339.45812252177956},"OK",{"$f":"'II_Plantejar Ració'!M20","v":"En alguns ingredients de la ració no hi consten els nutrients ..."}]
[{"$f":"IF(B10=\"\",\"\",CàlculsEV!B8)","v":""},{"$f":"IF('II_Plantejar Ració'!D9=0,\"\",'II_Plantejar Ració'!D9)","v":""},{"$f":"IF('II_Plantejar Ració'!D9=0,\"\",'II_Plantejar Ració'!F9)","v":""},{"$f":"IF('II_Plantejar Ració'!D9=0,\"\",('II_Plantejar Ració'!D9*1000)/('II_Plantejar Ració'!$K$4))","v":""},{"$f":"IF('II_Plantejar Ració'!D9=0,\"\",'II_Plantejar Ració'!G9*B10)","v":""},null,"BPR",{"$f":"'II_Plantejar Ració'!L26","v":7.4964789716744669},"g PDI/kg MS",{"$f":"'II_Plantejar Ració'!I26","v":7.5},{"$f":"'II_Plantejar Ració'!L26","v":7.4964789716744669},{"$f":"'II_Plantejar Ració'!J26","v":2},{"$f":"IF(K10<=J10,IF(K10<=L10,\"OK\",\"Excés\"),\"Dèficit\")","v":"Excés"}]
[{"$f":"IF(B11=\"\",\"\",CàlculsEV!B9)","v":"Ordi gra"},{"$f":"IF('II_Plantejar Ració'!D10=0,\"\",'II_Plantejar Ració'!D10)","v":1.3189427160712417},{"$f":"IF('II_Plantejar Ració'!D10=0,\"\",'II_Plantejar Ració'!F10)","v":29.028549735863063},{"$f":"IF('II_Plantejar Ració'!D10=0,\"\",('II_Plantejar Ració'!D10*1000)/('II_Plantejar Ració'!$K$4))","v":290.28549735863061},{"$f":"IF('II_Plantejar Ració'!D10=0,\"\",'II_Plantejar Ració'!G10*B11)","v":0.27697797037496075},null,"NI",{"$f":"'II_Plantejar Ració'!L27","v":2.0372041813481556},"% Pv",{"$f":"'II_Plantejar Ració'!I27","v":2.0339419661111404},{"$f":"'II_Plantejar Ració'!K27","v":2.0372041813481556},{"$f":"'II_Plantejar Ració'!J27","v":2.0339419661111404}]
[{"$f":"IF(B12=\"\",\"\",CàlculsEV!B10)","v":"Colza, turtó "},{"$f":"IF('II_Plantejar Ració'!D11=0,\"\",'II_Plantejar Ració'!D11)","v":-3.9970966317260535E-5},{"$f":"IF('II_Plantejar Ració'!D11=0,\"\",'II_Plantejar Ració'!F11)","v":-8.7971916414028095E-4},{"$f":"IF('II_Plantejar Ració'!D11=0,\"\",('II_Plantejar Ració'!D11*1000)/('II_Plantejar Ració'!$K$4))","v":-8.7971916414028087E-3},{"$f":"IF('II_Plantejar Ració'!D11=0,\"\",'II_Plantejar Ració'!G11*B12)","v":-1.1991289895178161E-5},null,"Ca",{"$f":"'II_Plantejar Ració'!L28","v":3.436388626833152},"g/kg MS",{"$f":"'II_Plantejar Ració'!I28","v":11.608393986523858},{"$f":"'II_Plantejar Ració'!K28","v":14.001250558643488},{"$f":"'II_Plantejar Ració'!J28","v":14.925077982673532},"OK",{"$f":"'II_Plantejar Ració'!M28","v":""}]
[{"$f":"IF(B13=\"\",\"\",CàlculsEV!B11)","v":""},{"$f":"IF('II_Plantejar Ració'!D12=0,\"\",'II_Plantejar Ració'!D12)","v":""},{"$f":"IF('II_Plantejar Ració'!D12=0,\"\",'II_Plantejar Ració'!F12)","v":""},{"$f":"IF('II_Plantejar Ració'!D12=0,\"\",('II_Plantejar Ració'!D12*1000)/('II_Plantejar Ració'!$K$4))","v":""},{"$f":"IF('II_Plantejar Ració'!D12=0,\"\",'II_Plantejar Ració'!G12*B13)","v":""},null,"P",{"$f":"'II_Plantejar Ració'!L29","v":2.3113225466292842},"g/kg MS",{"$f":"'II_Plantejar Ració'!I29","v":9.4172719208818485},{"$f":"'II_Plantejar Ració'!K29","v":9.4172719128748898},{"$f":"'II_Plantejar Ració'!J29","v":12.107921041133803},"Dèficit",{"$f":"'II_Plantejar Ració'!M29","v":""}]
[{"$f":"IF(B14=\"\",\"\",CàlculsEV!B12)","v":"Soja tortó 44"},{"$f":"IF('II_Plantejar Ració'!D13=0,\"\",'II_Plantejar Ració'!D13)","v":2.7460064882977688E-7},{"$f":"IF('II_Plantejar Ració'!D13=0,\"\",'II_Plantejar Ració'!F13)","v":6.0436730836950788E-6},{"$f":"IF('II_Plantejar Ració'!D13=0,\"\",('II_Plantejar Ració'!D13*1000)/('II_Plantejar Ració'!$K$4))","v":6.0436730836950788E-5},{"$f":"IF('II_Plantejar Ració'!D13=0,\"\",'II_Plantejar Ració'!G13*B14)","v":4.1190097324466533E-8},null,"Mg",{"$f":"'II_Plantejar Ració'!L30","v":0.39852740431625683},"g/kg MS",null,null,null,null,{"$f":"'II_Plantejar Ració'!M30","v":"Mg"}]
[{"$f":"IF(B15=\"\",\"\",CàlculsEV!B13)","v":""},{"$f":"IF('II_Plantejar Ració'!D14=0,\"\",'II_Plantejar Ració'!D14)","v":""},{"$f":"IF('II_Plantejar Ració'!D14=0,\"\",'II_Plantejar Ració'!F14)","v":""},{"$f":"IF('II_Plantejar Ració'!D14=0,\"\",('II_Plantejar Ració'!D14*1000)/('II_Plantejar Ració'!$K$4))","v":""},{"$f":"IF('II_Plantejar Ració'!D14=0,\"\",'II_Plantejar Ració'!G14*B15)","v":""},null,"K",{"$f":"'II_Plantejar Ració'!L31","v":1.5741185026627476},"g/kg MS",null,null,null,null,{"$f":"'II_Plantejar Ració'!M31","v":"K"}]
[{"$f":"IF(B16=\"\",\"\",CàlculsEV!B14)","v":""},{"$f":"IF('II_Plantejar Ració'!D15=0,\"\",'II_Plantejar Ració'!D15)","v":""},{"$f":"IF('II_Plantejar Ració'!D15=0,\"\",'II_Plantejar Ració'!F15)","v":""},{"$f":"IF('II_Plantejar Ració'!D15=0,\"\",('II_Plantejar Ració'!D15*1000)/('II_Plantejar Ració'!$K$4))","v":""},{"$f":"IF('II_Plantejar Ració'!D15=0,\"\",'II_Plantejar Ració'!G15*B16)","v":""},null,"Na",{"$f":"'II_Plantejar Ració'!L32","v":0.10384492145094971},"g/kg MS",null,null,null,null,{"$f":"'II_Plantejar Ració'!M32","v":"Na"}]
[{"$f":"IF(B17=\"\",\"\",CàlculsEV!B15)","v":""},{"$f":"IF('II_Plantejar Ració'!D16=0,\"\",'II_Plantejar Ració'!D16)","v":""},{"$f":"IF('II_Plantejar Ració'!D16=0,\"\",'II_Plantejar Ració'!F16)","v":""},{"$f":"IF('II_Plantejar Ració'!D16=0,\"\",('II_Plantejar Ració'!D16*1000)/('II_Plantejar Ració'!$K$4))","v":""},{"$f":"IF('II_Plantejar Ració'!D16=0,\"\",'II_Plantejar Ració'!G16*B17)","v":""},null,"S",{"$f":"'II_Plantejar Ració'!L33","v":6.9491604070693241E-2},"g/kg MS",null,null,null,null,{"$f":"'II_Plantejar Ració'!M33","v":"S"}]
[{"$f":"IF(B18=\"\",\"\",CàlculsEV!B16)","v":"Llevat cerveseria"},{"$f":"IF('II_Plantejar Ració'!D17=0,\"\",'II_Plantejar Ració'!D17)","v":4.2791662284867861E-5},{"$f":"IF('II_Plantejar Ració'!D17=0,\"\",'II_Plantejar Ració'!F17)","v":9.4179973230122205E-4},{"$f":"IF('II_Plantejar Ració'!D17=0,\"\",('II_Plantejar Ració'!D17*1000)/('II_Plantejar Ració'!$K$4))","v":9.4179973230122203E-3},{"$f":"IF('II_Plantejar Ració'!D17=0,\"\",'II_Plantejar Ració'!G17*B18)","v":6.2475826935907071E-6},null,"Cl",{"$f":"'II_Plantejar Ració'!L34","v":2.5269721462151807E-3},"g/kg MS",null,null,null,null,{"$f":"'II_Plantejar Ració'!M34","v":"Cl"}]
[{"$f":"IF(B19=\"\",\"\",CàlculsEV!B17)","v":"Grassa vegetal, mantega de porc (tots els tipus)"},{"$f":"IF('II_Plantejar Ració'!D18=0,\"\",'II_Plantejar Ració'!D18)","v":0.2},{"$f":"IF('II_Plantejar Ració'!D18=0,\"\",'II_Plantejar Ració'!F18)","v":4.4017908256593463},{"$f":"IF('II_Plantejar Ració'!D18=0,\"\",('II_Plantejar Ració'!D18*1000)/('II_Plantejar Ració'!$K$4))","v":44.017908256593465},{"$f":"IF('II_Plantejar Ració'!D18=0,\"\",'II_Plantejar Ració'!G18*B19)","v":2.7200000000000002E-2},null,"Co",{"$f":"'II_Plantejar Ració'!L35","v":2.8219699180108831E-3},"mg/kg MS",null,null,null,null,{"$f":"'II_Plantejar Ració'!M35","v":"Co"}]
[{"$f":"IF(B20=\"\",\"\",CàlculsEV!B18)","v":"Urea"},{"$f":"IF('II_Plantejar Ració'!D19=0,\"\",'II_Plantejar Ració'!D19)","v":1.06825498127418E-8},{"$f":"IF('II_Plantejar Ració'!D19=0,\"\",'II_Plantejar Ració'!F19)","v":2.3511174880187911E-7},{"$f":"IF('II_Plantejar Ració'!D19=0,\"\",('II_Plantejar Ració'!D19*1000)/('II_Plantejar Ració'!$K$4))","v":2.3511174880187912E-6},{"$f":"IF('II_Plantejar Ració'!D19=0,\"\",'II_Plantejar Ració'!G19*B20)","v":4.6789568179809084E-9},null,"Cu",{"$f":"'II_Plantejar Ració'!L36","v":1.2520557391736262},"mg/kg MS",null,null,null,null,{"$f":"'II_Plantejar Ració'!M36","v":""}]
[{"$f":"IF(B21=\"\",\"\",CàlculsEV!B19)","v":""},{"$f":"IF('II_Plantejar Ració'!D20=0,\"\",'II_Plantejar Ració'!D20)","v":""},{"$f":"IF('II_Plantejar Ració'!D20=0,\"\",'II_Plantejar Ració'!F20)","v":""},{"$f":"IF('II_Plantejar Ració'!D20=0,\"\",('II_Plantejar Ració'!D20*1000)/('II_Plantejar Ració'!$K$4))","v":""},{"$f":"IF('II_Plantejar Ració'!D20=0,\"\",'II_Plantejar Ració'!G20*B21)","v":""},null,"Mn",{"$f":"'II_Plantejar Ració'!L37","v":4.9675442404579364},"mg/kg MS",null,null,null,null,{"$f":"'II_Plantejar Ració'!M37","v":"Mn"}]
[{"$f":"IF(B22=\"\",\"\",CàlculsEV!B20)","v":"Carbonat de cobalt"},{"$f":"IF('II_Plantejar Ració'!D21=0,\"\",'II_Plantejar Ració'!D21)","v":3.7330715914718265E-9},{"$f":"IF('II_Plantejar Ració'!D21=0,\"\",'II_Plantejar Ració'!F21)","v":8.2161001414351108E-8},{"$f":"IF('II_Plantejar Ració'!D21=0,\"\",('II_Plantejar Ració'!D21*1000)/('II_Plantejar Ració'!$K$4))","v":8.21610014143511E-7},{"$f":"IF('II_Plantejar Ració'!D21=0,\"\",'II_Plantejar Ració'!G21*B22)","v":1.0825907615268296E-9},null,"Zn",{"$f":"'II_Plantejar Ració'!L38","v":6.8870301312131437},"mg/kg MS",null,null,null,null,{"$f":"'II_Plantejar Ració'!M38","v":"Zn"}]
[{"$f":"IF(B23=\"\",\"\",CàlculsEV!B21)","v":"Fosfat bicàlcic"},{"$f":"IF('II_Plantejar Ració'!D22=0,\"\",'II_Plantejar Ració'!D22)","v":2.6052369597239881E-2},{"$f":"IF('II_Plantejar Ració'!D22=0,\"\",'II_Plantejar Ració'!F22)","v":0.57338540739908495},{"$f":"IF('II_Plantejar Ració'!D22=0,\"\",('II_Plantejar Ració'!D22*1000)/('II_Plantejar Ració'!$K$4))","v":5.7338540739908499},{"$f":"IF('II_Plantejar Ració'!D22=0,\"\",'II_Plantejar Ració'!G22*B23)","v":1.7455087630150721E-3},null,"Iode",{"$f":"'II_Plantejar Ració'!L39","v":4.903782045671581E-9},"mg/kg MS",null,null,null,null,{"$f":"'II_Plantejar Ració'!M39","v":"Iode"}]
[{"$f":"IF(B24=\"\",\"\",CàlculsEV!B22)","v":""},{"$f":"IF('II_Plantejar Ració'!D23=0,\"\",'II_Plantejar Ració'!D23)","v":""},{"$f":"IF('II_Plantejar Ració'!D23=0,\"\",'II_Plantejar Ració'!F23)","v":""},{"$f":"IF('II_Plantejar Ració'!D23=0,\"\",('II_Plantejar Ració'!D23*1000)/('II_Plantejar Ració'!$K$4))","v":""},{"$f":"IF('II_Plantejar Ració'!D23=0,\"\",'II_Plantejar Ració'!G23*B24)","v":""},null,"Se",{"$f":"'II_Plantejar Ració'!L40","v":5.6449694336842575E-3},"mg/kg MS",null,null,null,null,{"$f":"'II_Plantejar Ració'!M40","v":"Se"}]
[{"$f":"IF(B25=\"\",\"\",CàlculsEV!B23)","v":""},{"$f":"IF('II_Plantejar Ració'!D24=0,\"\",'II_Plantejar Ració'!D24)","v":""},{"$f":"IF('II_Plantejar Ració'!D24=0,\"\",'II_Plantejar Ració'!F24)","v":""},{"$f":"IF('II_Plantejar Ració'!D24=0,\"\",('II_Plantejar Ració'!D24*1000)/('II_Plantejar Ració'!$K$4))","v":""},{"$f":"IF('II_Plantejar Ració'!D24=0,\"\",'II_Plantejar Ració'!G24*B25)","v":""},null,"Vit A",{"$f":"'II_Plantejar Ració'!L41","v":33464.288392683433},"UI",null,null,null,null,{"$f":"'II_Plantejar Ració'!M41","v":"Vit A"}]
[{"$f":"IF(B26=\"\",\"\",CàlculsEV!B24)","v":""},{"$f":"IF('II_Plantejar Ració'!D25=0,\"\",'II_Plantejar Ració'!D25)","v":""},{"$f":"IF('II_Plantejar Ració'!D25=0,\"\",'II_Plantejar Ració'!F25)","v":""},{"$f":"IF('II_Plantejar Ració'!D25=0,\"\",('II_Plantejar Ració'!D25*1000)/('II_Plantejar Ració'!$K$4))","v":""},{"$f":"IF('II_Plantejar Ració'!D25=0,\"\",'II_Plantejar Ració'!G25*B26)","v":""},null,"Vit D",{"$f":"'II_Plantejar Ració'!L42","v":33.118260723650003},"UI",null,null,null,null,{"$f":"'II_Plantejar Ració'!M42","v":"Vit D"}]
[{"$f":"IF(B27=\"\",\"\",CàlculsEV!B25)","v":""},{"$f":"IF('II_Plantejar Ració'!D26=0,\"\",'II_Plantejar Ració'!D26)","v":""},{"$f":"IF('II_Plantejar Ració'!D26=0,\"\",'II_Plantejar Ració'!F26)","v":""},{"$f":"IF('II_Plantejar Ració'!D26=0,\"\",('II_Plantejar Ració'!D26*1000)/('II_Plantejar Ració'!$K$4))","v":""},{"$f":"IF('II_Plantejar Ració'!D26=0,\"\",'II_Plantejar Ració'!G26*B27)","v":""},null,"Vit E",{"$f":"'II_Plantejar Ració'!L43","v":15.027203903450991},"UI",null,null,null,null,{"$f":"'II_Plantejar Ració'!M43","v":"Vit E"}]
["TOTAL",{"$f":"SUM(B5:B27)","v":4.5436052716121944},{"$f":"SUM(C5:C27)","v":99.999999999999986},{"$f":"SUM(D5:D27)","v":1000},{"$f":"'II_Plantejar Ració'!K16","v":0.42586206543167809},null,"AG",{"$f":"'II_Plantejar Ració'!L44","v":67.686058126547223},"g/kg MS",null,null,null,null,{"$f":"'II_Plantejar Ració'!M44","v":"AG"}]
[null,null,null,null,null,null,"MNT_PB",{"$f":"'II_Plantejar Ració'!L45","v":147.53011889997393},"g/kg MS",null,null,null,null,{"$f":"'II_Plantejar Ració'!M45","v":""}]
[null,"Fa %",{"$f":"'II_Plantejar Ració'!K11","v":66.236521437492442},"% greix s/MS",{"$f":"'II_Plantejar Ració'!L49","v":7.1573708248248185},null,"PDIA",{"$f":"'II_Plantejar Ració'!L46","v":35.376954857039713},"g/kg MS",null,null,null,null,{"$f":"'II_Plantejar Ració'!M46","v":""}]
[null,"Co %",{"$f":"'II_Plantejar Ració'!K12*100","v":33.763478562507551},null,null,null,"dMO",{"$f":"'II_Plantejar Ració'!L47","v":0.65557311719250644},null,null,null,null,null,{"$f":"'II_Plantejar Ració'!M47","v":""}]
[null,null,null,null,null,null,"MOD",{"$f":"'II_Plantejar Ració'!L48","v":606.34306229111132},"g/kg MS",null,null,null,null,{"$f":"'II_Plantejar Ració'!M48","v":""}]
[null,null,null,null,null,null,"EE",{"$f":"'II_Plantejar Ració'!L49","v":7.1573708248248185},"%",null,{"$f":"'II_Plantejar Ració'!K49","v":291.62051543584835},null,null,{"$f":"'II_Plantejar Ració'!M49","v":""}]
[null,null,null,null,null,null,"FB",{"$f":"'II_Plantejar Ració'!L50","v":207.32810459832299},"g/kg MS",null,null,null,null,{"$f":"'II_Plantejar Ració'!M50","v":""}]
[null,null,null,null,null,null,"NDF",{"$f":"'II_Plantejar Ració'!L51","v":444.86004856887814},"g/kg MS",null,null,null,null,{"$f":"'II_Plantejar Ració'!M51","v":""}]
[null,null,null,null,null,null,"ADF",{"$f":"'II_Plantejar Ració'!L52","v":250.1745743716979},"g/kg MS",null,null,null,null,{"$f":"'II_Plantejar Ració'!M52","v":""}]
[null,null,null,null,null,null,"Lignina",{"$f":"'II_Plantejar Ració'!L53","v":29.881366772553179},"g/kg MS",null,null,null,null,{"$f":"'II_Plantejar Ració'!M53","v":""}]
[null,null,null,null,null,null,"cendres",{"$f":"'II_Plantejar Ració'!L54","v":55.391490693275081},"g/kg MS",null,null,null,null,{"$f":"'II_Plantejar Ració'!M54","v":""}]
[null,null,null,null,null,null,"Mo",{"$f":"'II_Plantejar Ració'!L55","v":8.4679287787477506E-2},"mg/kg MS",null,null,null,null,{"$f":"'II_Plantejar Ració'!M55","v":"Mo"}]
[null,null,null,null,null,null,"DT_N",{"$f":"'II_Plantejar Ració'!L56","v":0.64461648115342962},null,null,null,null,null,{"$f":"'II_Plantejar Ració'!M56","v":"DT_N"}]
[null,null,null,null,null,null,"MOF",{"$f":"'II_Plantejar Ració'!L57","v":529.17249760402274},"g/kg MS",null,null,null,null,{"$f":"'II_Plantejar Ració'!M57","v":"MOF"}]
[null,null,null,null,null,null,"MO",{"$f":"'II_Plantejar Ració'!L58","v":924.90531778938259},"g/kg MS",null,null,null,null,{"$f":"'II_Plantejar Ració'!M58","v":""}]
[null,null,null,null,null,null,"PDI/UFL",{"$f":"'II_Plantejar Ració'!L59","v":76.707052365586563},"g",null,null,null,null,{"$f":"'II_Plantejar Ració'!M58","v":""}]
[]
[]
[]
[]
[]
[]
[]
[]
[]
[]
[]
[]
[]
[]
[]
[{"$f":"IF(B59=\"\",\"\",CàlculsEV!B26)","v":""},{"$f":"IF('II_Plantejar Ració'!D27=0,\"\",'II_Plantejar Ració'!D27)","v":""}]